Measurement
type: Class
type: NamedIndividual
type: Concept
term status: testing
in scheme: Thesaurustrait

Plant characteristics
type: Class
subclass of: Measurement
type: NamedIndividual
type: Concept
term status: testing
definition: a feature of individual plants (from cellular level to whole organism), plant population or plant species describing either an environmental association (TOP:environmental association) or a plant trait (TOP:plant trait)
in scheme: Thesaurustrait
reference: Eric Garnier, Jens Kattge, Stefan Klotz, Ingolf Kühn, Ulrike Stahl

Environmental association
type: Class
subclass of: Plant characteristics
type: NamedIndividual
type: Concept
in scheme: Thesaurustrait
term status: testing
definition: a feature describing the non-random association of individual plants, plant populations or plant species with particular characteristics of the environment
reference: based on Underwood, A.J., Chapman, M.G. & Crowe, T.P. (2004) Identifying and understanding ecological preferences for habitat or prey. Journal of Experimental Marine Biology and Ecology, 300, 161-187.

Fruit thickness
type: Class
subclass of: Dispersule thickness trait
type: NamedIndividual
type: Concept
related match: PO_0009001
definition: the thickness (PATO:thickness) of a fruit (PO:fruit)
formal name: fruit thickness
reference: Eric Garnier, Jens Kattge, Stefan Klotz, Ingolf Kühn, Ulrike Stahl
related match: PATO_0000915
pref unit: length unit
term status: stable
in scheme: Thesaurustrait

Germinule thickness
type: Class
subclass of: Dispersule thickness trait
type: NamedIndividual
type: Concept
definition: the thickness (PATO:thickness) of a germinule (Leda:germinule)
pref unit: length unit
related match: PATO_0000915
term status: stable
reference: Eric Garnier, Jens Kattge, Stefan Klotz, Ingolf Kühn, Ulrike Stahl
formal name: germinule thickness
in scheme: Thesaurustrait

Dispersule mass trait
type: Class
subclass of: Flower and dispersule trait
type: NamedIndividual
type: Concept
term status: stable
pref unit: mass unit
related match: PATO_0000125
definition: the mass (PATO:mass), either fresh or dried, of a dispersule (Perez:dispersule) or component thereof, i.e. seed, fruit or germinule (PO:seed, PO:fruit, Leda:germinule)
related match: PO_0009010
related match: PO_0009001
formal name: dispersule mass
alternative label: propagule mass
alternative label: diaspore mass
in scheme: Thesaurustrait
reference: Eric Garnier, Jens Kattge, Stefan Klotz, Ingolf Kühn, Ulrike Stahl

Seed mass
type: Class
subclass of: Dispersule mass trait
type: NamedIndividual
type: Concept
related match: PATO_0000125
related match: PO_0009010
term status: stable
alternative label: seed weight
pref unit: mass unit
alternative label: seed size
reference: Eric Garnier, Jens Kattge, Stefan Klotz, Ingolf Kühn, Ulrike Stahl
in scheme: Thesaurustrait
formal name: seed mass
definition: the mass (PATO:mass), either fresh or dried, of a seed (PO:seed)

Fruit mass
type: Class
subclass of: Dispersule mass trait
type: NamedIndividual
type: Concept
related match: PATO_0000125
in scheme: Thesaurustrait
term status: stable
alternative label: fruit weigt
related match: PO_0009001
pref unit: mass unit
definition: the mass (PATO:mass), either fresh or dried, of a fruit (PO:fruit)
reference: Eric Garnier, Jens Kattge, Stefan Klotz, Ingolf Kühn, Ulrike Stahl
formal name: fruit mass

Germinule mass
type: Class
subclass of: Dispersule mass trait
type: NamedIndividual
type: Concept
formal name: germinule mass
term status: stable
in scheme: Thesaurustrait
pref unit: mass unit
reference: KLEYER, M., BEKKER, R.M., KNEVEL, I.C., BAKKER, J.P, THOMPSON, K., SONNENSCHEIN, M., POSCHLOD, P., VAN GROENENDAEL, J.M., KLIMES, L., KLIMESOV�, J., KLOTZ, S., RUSCH, G.M., HERMY, M., ADRIAENS, D., BOEDELTJE, G., BOSSUYT, B., DANNEMANN, A., ENDELS, P., GoeTZENBERGER, L., HODGSON, J.G., JACKEL, A-K., Kühn, I., KUNZMANN, D., OZINGA, W.A., RoeMERMANN, C., STADLER, M., SCHLEGELMILCH, J., STEENDAM, H.J., TACKENBERG, O., WILMANN, B., CORNELISSEN, J.H.C., ERIKSSON, O., GARNIER, E., PECO, B. (2008): The LEDA Traitbase: A database of life-history traits of Northwest European flora. Journal of Ecology 96: 1266-1274
alternative label: germinule weight
related match: PATO_0000125
definition: the mass (PATO:mass), either fresh or dried, of a germinule (Leda:germinule)

Dispersule fresh mass trait
type: Class
subclass of: Flower and dispersule trait
type: NamedIndividual
type: Concept
alternative label: propagule mass
pref unit: mass unit
related match: PO_0009001
related match: PO_0009010
formal name: dispersule fresh mass
related match: PATO_0000125
reference: Eric Garnier, Jens Kattge, Stefan Klotz, Ingolf Kühn, Ulrike Stahl
alternative label: diaspore mass
in scheme: Thesaurustrait
term status: stable
definition: the mass (PATO:mass) of a dispersule (Perez:dispersule) or component thereof, i.e. seed, fruit or germinule (PO:seed, PO:fruit, Leda:germinule) assessed without drying

Seed fresh mass
type: Class
subclass of: Dispersule fresh mass trait
type: NamedIndividual
type: Concept
pref unit: mass unit
formal name: seed fresh mass
reference: Eric Garnier, Jens Kattge, Stefan Klotz, Ingolf Kühn, Ulrike Stahl
definition: the mass (PATO:mass) of a seed (PO:seed) assessed without drying
related match: PO_0009010
in scheme: Thesaurustrait
term status: stable
alternative label: seed fresh weight
related match: PATO_0000125

Fruit fresh mass
type: Class
subclass of: Dispersule fresh mass trait
type: NamedIndividual
type: Concept
related match: PO_0009001
pref unit: mass unit
definition: the mass (PATO:mass) of a fruit (PO:fruit) assessed without drying
formal name: fruit fresh mass
in scheme: Thesaurustrait
alternative label: fruit fresh weight
reference: Eric Garnier, Jens Kattge, Stefan Klotz, Ingolf Kühn, Ulrike Stahl
term status: stable
related match: PATO_0000125

Germinule fresh mass
type: Class
subclass of: Dispersule fresh mass trait
type: NamedIndividual
type: Concept
reference: KLEYER, M., BEKKER, R.M., KNEVEL, I.C., BAKKER, J.P, THOMPSON, K., SONNENSCHEIN, M., POSCHLOD, P., VAN GROENENDAEL, J.M., KLIMES, L., KLIMESOV�, J., KLOTZ, S., RUSCH, G.M., HERMY, M., ADRIAENS, D., BOEDELTJE, G., BOSSUYT, B., DANNEMANN, A., ENDELS, P., GoeTZENBERGER, L., HODGSON, J.G., JACKEL, A-K., Kühn, I., KUNZMANN, D., OZINGA, W.A., RoeMERMANN, C., STADLER, M., SCHLEGELMILCH, J., STEENDAM, H.J., TACKENBERG, O., WILMANN, B., CORNELISSEN, J.H.C., ERIKSSON, O., GARNIER, E., PECO, B. (2008): The LEDA Traitbase: A database of life-history traits of Northwest European flora. Journal of Ecology 96: 1266-1274
formal name: germinule fresh mass
definition: the mass (PATO:mass) of a germinule (Leda:germinule) assessed without drying
related match: PATO_0000125
pref unit: mass unit
in scheme: Thesaurustrait
alternative label: germinule fresh weight
term status: stable

Spatial distribution
type: Class
subclass of: Environmental association
type: NamedIndividual
type: Concept
reference: based on Legendre, P. & Fortin, M. (1989) Spatial pattern and ecological analysis. Vegetatio, 80, 107-138.
term status: testing
in scheme: Thesaurustrait
definition: a feature describing the way in which plant populations or species are arranged in the physical space

Dispersule dry mass trait
type: Class
subclass of: Flower and dispersule trait
type: NamedIndividual
type: Concept
related match: PO_0009001
pref unit: mass unit
alternative label: dispersule size
term status: stable
alternative label: dispersule weight
in scheme: Thesaurustrait
reference: Eric Garnier, Jens Kattge, Stefan Klotz, Ingolf Kühn, Ulrike Stahl
related match: PATO_0000125
related match: PO_0009010
formal name: dispersule dry mass
definition: the mass (PATO:mass) of a dispersule (Perez:dispersule) or component thereof, i.e. seed, fruit or germinule (PO:seed, PO:fruit, Leda:germinule) assessed after drying

Seed dry mass
type: Class
subclass of: Dispersule dry mass trait
type: NamedIndividual
type: Concept
related match: PO_0009010
formal name: seed dry mass
pref unit: mass unit
in scheme: Thesaurustrait
related match: PATO_0000125
definition: the mass (PATO:mass) of a seed (PO:seed) assessed after drying
term status: stable
alternative label: seed size
alternative label: seed dry weight
reference: Eric Garnier, Jens Kattge, Stefan Klotz, Ingolf Kühn, Ulrike Stahl

Fruit dry mass
type: Class
subclass of: Dispersule dry mass trait
type: NamedIndividual
type: Concept
related match: PO_0009001
alternative label: fruit weight
reference: Eric Garnier, Jens Kattge, Stefan Klotz, Ingolf Kühn, Ulrike Stahl
pref unit: mass unit
term status: stable
formal name: fruit dry mass
related match: PATO_0000125
in scheme: Thesaurustrait
definition: the mass (PATO:mass) of a fruit (PO:fruit) assessed after drying

Germinule dry mass
type: Class
subclass of: Dispersule dry mass trait
type: NamedIndividual
type: Concept
alternative label: germinule weight
pref unit: mass unit
formal name: germinule dry mass
reference: KLEYER, M., BEKKER, R.M., KNEVEL, I.C., BAKKER, J.P, THOMPSON, K., SONNENSCHEIN, M., POSCHLOD, P., VAN GROENENDAEL, J.M., KLIMES, L., KLIMESOV�, J., KLOTZ, S., RUSCH, G.M., HERMY, M., ADRIAENS, D., BOEDELTJE, G., BOSSUYT, B., DANNEMANN, A., ENDELS, P., GoeTZENBERGER, L., HODGSON, J.G., JACKEL, A-K., Kühn, I., KUNZMANN, D., OZINGA, W.A., RoeMERMANN, C., STADLER, M., SCHLEGELMILCH, J., STEENDAM, H.J., TACKENBERG, O., WILMANN, B., CORNELISSEN, J.H.C., ERIKSSON, O., GARNIER, E., PECO, B. (2008): The LEDA Traitbase: A database of life-history traits of Northwest European flora. Journal of Ecology 96: 1266-1274
related match: PATO_0000125
in scheme: Thesaurustrait
definition: the mass (PATO:mass) of a germinule (Leda:germinule) assessed after drying
term status: stable

Seed shape
type: Class
subclass of: Flower and dispersule trait
type: NamedIndividual
type: Concept
related match: PO_0009010
definition: the variance of the three linear dimensions seed length (TOP:seed length), seed width (TOP:seed width) and seed thickness (TOP:seed thickness) of a seed (PO:seed) dividing each dimension by seed length so that length is unity
reference: K. Thompson, S. R. Band, and J. G. Hodgson, _Seed size and shape predict persistence in soil,� Functional Ecology, vol. 7, no. 2, pp. 236_241, 1993
pref unit: unitless (variance)
in scheme: Thesaurustrait
formal name: seed shape
term status: stable

Seed production type
type: Class
subclass of: Whole plant trait
type: NamedIndividual
type: Concept
formal name: seed production type
related match: PO_0009089
related match: PO_0009010
related match: PO_0000003
pref unit: unitless (nominal)
term status: stable
in scheme: Thesaurustrait
cat: Mostly amphimictic rarely apomictic plant
cat: Amphimictic plant
definition: a feature of the whole plant (PO:whole plant) characterizing the seed (PO:seed) production with respect to amphimixis or apomixis (PO:somatic plant embryo). In amphimixis, one of the pollen sperm nuclei unites with the egg cell and form the zygote (PO:whole plant zygote). The other unites with the polar nuclei and forms the endosperm (PO:endosperm)
cat: Obligate apomictic plant
cat: Facultative apomictic plant
reference: Klotz, S., Kühn, I. & Durka, W. (2002): BIOLFLOR - Eine Datenbank zu biologisch-oekologischen Merkmalen der Gefaesspflanzen in Deutschland. - Schriftenreihe fuer Vegetationskunde 38. Bonn: Bundesamt fuer Naturschutz.
related match: PO_0025302

Amphimictic plant
type: Class
type: NamedIndividual
type: Concept
term status: stable
in scheme: Thesaurustrait
related match: PO_0000003
reference: Klotz, S., Kühn, I. & Durka, W. (2002): BIOLFLOR - Eine Datenbank zu biologisch-oekologischen Merkmalen der Gefaesspflanzen in Deutschland. - Schriftenreihe fuer Vegetationskunde 38. Bonn: Bundesamt fuer Naturschutz.
related match: PO_0009010
definition: plants (PO:whole plant) which produce amphimictic seeds (PO:seed).
pref unit: unitless (category)
formal name: whole plant amphimictic

Mostly amphimictic rarely apomictic plant
type: Class
type: NamedIndividual
type: Concept
reference: Klotz, S., Kühn, I. & Durka, W. (2002): BIOLFLOR - Eine Datenbank zu biologisch-oekologischen Merkmalen der Gefaesspflanzen in Deutschland. - Schriftenreihe fuer Vegetationskunde 38. Bonn: Bundesamt fuer Naturschutz.
in scheme: Thesaurustrait
related match: PO_0000003
definition: plants (PO:whole plant) which produce mostly amphimictic and rarely apomictic seeds (PO:somatic plant embryo).
formal name: whole plant mostly amphimictic rarely apomictic
pref unit: unitless (category)
related match: PO_0025302
term status: stable

Facultative apomictic plant
type: Class
type: NamedIndividual
type: Concept
reference: Klotz, S., Kühn, I. & Durka, W. (2002): BIOLFLOR - Eine Datenbank zu biologisch-oekologischen Merkmalen der Gefaesspflanzen in Deutschland. - Schriftenreihe fuer Vegetationskunde 38. Bonn: Bundesamt fuer Naturschutz.
in scheme: Thesaurustrait
formal name: whole plant facultative apomictic
related match: PO_0000003
definition: plants (PO:whole plant) which produce facultative apomictic seeds (PO:somatic plant embryo).
pref unit: unitless (category)
related match: PO_0025302
term status: stable

Obligate apomictic plant
type: Class
type: NamedIndividual
type: Concept
related match: PO_0000003
reference: Klotz, S., Kühn, I. & Durka, W. (2002): BIOLFLOR - Eine Datenbank zu biologisch-oekologischen Merkmalen der Gefaesspflanzen in Deutschland. - Schriftenreihe fuer Vegetationskunde 38. Bonn: Bundesamt fuer Naturschutz.
in scheme: Thesaurustrait
formal name: whole plant obligate apomictic
pref unit: unitless (category)
term status: stable
definition: plants (PO:whole plant) which produce obligate apomictic seeds (PO:apomictic plant embryo).

Leaf length trait
type: Class
subclass of: Leaf trait
type: NamedIndividual
type: Concept
related match: PATO_0000122
related match: PO_0025034
formal name: leaf length trait
term status: stable
in scheme: Thesaurustrait
reference: Eric Garnier, Jens Kattge, Stefan Klotz, Ingolf Kühn, Ulrike Stahl
definition: the length (PATO:length) of a leaf (PO:leaf) or component thereof, i.e. leaf lamina or leaflet (PO:leaf lamina, PO:leaflet)
related match: PO_0020039
related match: PO_0020049
pref unit: length unit

Plant apomixis type
type: Class
subclass of: Whole plant trait
type: NamedIndividual
type: Concept
formal name: whole plant apomixis type
related match: PO_0025302
related match: GO_0009856
cat: Pseudogamous plant
cat: Autonomous plant
pref unit: unitless (nominal)
reference: Klotz, S., Kühn, I. & Durka, W. (2002): BIOLFLOR - Eine Datenbank zu biologisch-oekologischen Merkmalen der Gefaesspflanzen in Deutschland. - Schriftenreihe fuer Vegetationskunde 38. Bonn: Bundesamt fuer Naturschutz.
definition: a feature of the whole plant (PO:whole plant) characterizing the apomixis (PO:somatic plant embryo) with respect to its pollination (GO:pollination) needs
in scheme: Thesaurustrait
term status: stable
related match: PO_0000003

Autonomous plant
type: Class
type: NamedIndividual
type: Concept
related match: PO_0000003
reference: Klotz, S., Kühn, I. & Durka, W. (2002): BIOLFLOR - Eine Datenbank zu biologisch-oekologischen Merkmalen der Gefaesspflanzen in Deutschland. - Schriftenreihe fuer Vegetationskunde 38. Bonn: Bundesamt fuer Naturschutz.
related match: GO_0009856
pref unit: unitless (category)
definition: plants (PO:whole plant) which do not need pollination (GO:pollination), i.e. both plant egg cell (PO:whole plant egg cell) and polar nuclei (GO:polar nucleus) are independent of fertilization (GO:fertilization)
related match: GO_0009566
related match: GO_0043078
term status: stable
formal name: whole plant autonomous
in scheme: Thesaurustrait

Pseudogamous plant
type: Class
type: NamedIndividual
type: Concept
definition: plants (PO:whole plant) which need pollination (GO:pollination), i.e. polar nuclei (GO:polar nucleus) must be fertilized for endosperm (PO:endosperm) development
formal name: whole plant pseudogamous
related match: GO_0043078
related match: PO_0009089
related match: PO_0000003
term status: stable
in scheme: Thesaurustrait
reference: Klotz, S., Kühn, I. & Durka, W. (2002): BIOLFLOR - Eine Datenbank zu biologisch-oekologischen Merkmalen der Gefaesspflanzen in Deutschland. - Schriftenreihe fuer Vegetationskunde 38. Bonn: Bundesamt fuer Naturschutz.
related match: GO_0009856
pref unit: unitless (category)

Plant reproduction type
type: Class
subclass of: Whole plant trait
type: NamedIndividual
type: Concept
cat: Vegetative plant
cat: Mostly vegetative plant
reference: Klotz, S., Kühn, I. & Durka, W. (2002): BIOLFLOR - Eine Datenbank zu biologisch-oekologischen Merkmalen der Gefaesspflanzen in Deutschland. - Schriftenreihe fuer Vegetationskunde 38. Bonn: Bundesamt fuer Naturschutz.
cat: Generative and vegetative plant
cat: Mostly generative plant
cat: Generative plant
definition: a feature of the whole plant (PO:whole plant) characterizing the reproduction with respect to vegetative and generative modi
in scheme: Thesaurustrait
term status: stable
pref unit: unitless (nominal)
related match: PO_0000003
formal name: whole plant reproduction type

Generative plant
type: Class
type: NamedIndividual
type: Concept
related match: PO_0009010
formal name: whole plant generative
definition: plants (PO:whole plant) which reproduce by seeds (PO:seed) or by plant spores (PO:whole plant spore)
related match: PO_0000003
in scheme: Thesaurustrait
reference: Klotz, S., Kühn, I. & Durka, W. (2002): BIOLFLOR - Eine Datenbank zu biologisch-oekologischen Merkmalen der Gefaesspflanzen in Deutschland. - Schriftenreihe fuer Vegetationskunde 38. Bonn: Bundesamt fuer Naturschutz.
term status: stable
pref unit: unitless (category)

Mostly generative plant
type: Class
type: NamedIndividual
type: Concept
related match: PO_0000003
formal name: whole plant mostly generative
definition: plants (PO:whole plant) which reproduce mostly by seeds (PO:seed) and rarely vegetatively
related match: PO_0009010
reference: Klotz, S., Kühn, I. & Durka, W. (2002): BIOLFLOR - Eine Datenbank zu biologisch-oekologischen Merkmalen der Gefaesspflanzen in Deutschland. - Schriftenreihe fuer Vegetationskunde 38. Bonn: Bundesamt fuer Naturschutz.
in scheme: Thesaurustrait
pref unit: unitless (category)
term status: stable

Generative and vegetative plant
type: Class
type: NamedIndividual
type: Concept
formal name: whole plant generative and vegetative
related match: PO_0000003
in scheme: Thesaurustrait
related match: PO_0009010
reference: Klotz, S., Kühn, I. & Durka, W. (2002): BIOLFLOR - Eine Datenbank zu biologisch-oekologischen Merkmalen der Gefaesspflanzen in Deutschland. - Schriftenreihe fuer Vegetationskunde 38. Bonn: Bundesamt fuer Naturschutz.
pref unit: unitless (category)
definition: plants (PO:whole plant) which reproduce by seeds (PO:seed) and vegetatively
term status: stable

Mostly vegetative plant
type: Class
type: NamedIndividual
type: Concept
related match: PO_0000003
formal name: whole plant mostly vegetative
in scheme: Thesaurustrait
reference: Klotz, S., Kühn, I. & Durka, W. (2002): BIOLFLOR - Eine Datenbank zu biologisch-oekologischen Merkmalen der Gefaesspflanzen in Deutschland. - Schriftenreihe fuer Vegetationskunde 38. Bonn: Bundesamt fuer Naturschutz.
related match: PO_0009010
definition: plants (PO:whole plant) which reproduce rarely by seeds (PO:seed) and mostly vegetatively
pref unit: unitless (category)
term status: stable

Vegetative plant
type: Class
type: NamedIndividual
type: Concept
term status: stable
in scheme: Thesaurustrait
related match: PO_0000003
reference: Klotz, S., Kühn, I. & Durka, W. (2002): BIOLFLOR - Eine Datenbank zu biologisch-oekologischen Merkmalen der Gefaesspflanzen in Deutschland. - Schriftenreihe fuer Vegetationskunde 38. Bonn: Bundesamt fuer Naturschutz.
pref unit: unitless (category)
definition: plants (PO:whole plant) which reproduce vegetatively
formal name: whole plant vegetative

Plant generative reproduction type
type: Class
subclass of: Whole plant trait
type: NamedIndividual
type: Concept
in scheme: Thesaurustrait
term status: stable
related match: PO_0000003
cat: Automictic plant
reference: Klotz, S., Kühn, I. & Durka, W. (2002): BIOLFLOR - Eine Datenbank zu biologisch-oekologischen Merkmalen der Gefaesspflanzen in Deutschland. - Schriftenreihe fuer Vegetationskunde 38. Bonn: Bundesamt fuer Naturschutz.
cat: Autogamous and allogamous plant
cat: Facultative allogamous plant
cat: Autogamous plant
cat: Facultative autogamous plant
definition: a feature of the whole plant (PO:whole plant) characterizing the generative reproduction with respect to the origin of gametes (PO:gamete) that unite to form offspring
cat: Allogamous plant
formal name: whole plant generative reproduction type
related match: PO_0025006
pref unit: unitless (nominal)

Leaf length
type: Class
subclass of: Leaf length trait
type: NamedIndividual
type: Concept
related match: PO_0025140
formal name: leaf length
related match: PATO_0000122
related match: PO_0025034
reference: Eric Garnier, Jens Kattge, Stefan Klotz, Ingolf Kühn, Ulrike Stahl
definition: the length (PATO:length) of a leaf (PO:leaf) from its phyllom base (PO:phyllom base) to its apex (PO:apex)
in scheme: Thesaurustrait
term status: stable
pref unit: length unit

Allogamous plant
type: Class
type: NamedIndividual
type: Concept
definition: plants (PO:whole plant) that are obligate outcrossing (xenogamy), i.e. gametes (PO:gamete) originate from different sporophytes
term status: stable
in scheme: Thesaurustrait
reference: Klotz, S., Kühn, I. & Durka, W. (2002): BIOLFLOR - Eine Datenbank zu biologisch-oekologischen Merkmalen der Gefaesspflanzen in Deutschland. - Schriftenreihe fuer Vegetationskunde 38. Bonn: Bundesamt fuer Naturschutz.
formal name: whole plant allogamous
related match: PO_0025006
related match: PO_0000003
pref unit: unitless (category)

Facultative allogamous plant
type: Class
type: NamedIndividual
type: Concept
reference: Klotz, S., Kühn, I. & Durka, W. (2002): BIOLFLOR - Eine Datenbank zu biologisch-oekologischen Merkmalen der Gefaesspflanzen in Deutschland. - Schriftenreihe fuer Vegetationskunde 38. Bonn: Bundesamt fuer Naturschutz.
formal name: whole plant facultative allogamous
definition: plants (PO:whole plant) that are mainly outcrossing (xenogamy) but selfing (autogamy) is possible
related match: PO_0000003
in scheme: Thesaurustrait
term status: stable
pref unit: unitless (category)

Autogamous and allogamous plant
type: Class
type: NamedIndividual
type: Concept
definition: plants (PO:whole plant) that are both outcrossing (xenogamy) and selfing (autogamy)
reference: Klotz, S., Kühn, I. & Durka, W. (2002): BIOLFLOR - Eine Datenbank zu biologisch-oekologischen Merkmalen der Gefaesspflanzen in Deutschland. - Schriftenreihe fuer Vegetationskunde 38. Bonn: Bundesamt fuer Naturschutz.
formal name: whole plant autogamous and allogamous
related match: PO_0000003
term status: stable
pref unit: unitless (category)
in scheme: Thesaurustrait

Facultative autogamous plant
type: Class
type: NamedIndividual
type: Concept
reference: Klotz, S., Kühn, I. & Durka, W. (2002): BIOLFLOR - Eine Datenbank zu biologisch-oekologischen Merkmalen der Gefaesspflanzen in Deutschland. - Schriftenreihe fuer Vegetationskunde 38. Bonn: Bundesamt fuer Naturschutz.
definition: plants (PO:whole plant) that are mainly selfing (autogamy) but outcrossing (xenogamy) is possible
formal name: whole plant facultative autogamous
related match: PO_0000003
in scheme: Thesaurustrait
pref unit: unitless (category)
term status: stable

Autogamous plant
type: Class
type: NamedIndividual
type: Concept
pref unit: unitless (category)
reference: Klotz, S., Kühn, I. & Durka, W. (2002): BIOLFLOR - Eine Datenbank zu biologisch-oekologischen Merkmalen der Gefaesspflanzen in Deutschland. - Schriftenreihe fuer Vegetationskunde 38. Bonn: Bundesamt fuer Naturschutz.
formal name: whole plant autogamous
related match: PO_0000003
related match: PO_0025006
in scheme: Thesaurustrait
definition: plants (PO:whole plant) that are obligate selfing (autogamy), i.e. gametes (PO:gamete) originate from the same sporophyte
term status: stable

Automictic plant
type: Class
type: NamedIndividual
type: Concept
pref unit: unitless (category)
in scheme: Thesaurustrait
definition: plants (PO:whole plant) that are intra-gametophytic selfing, i.e. gametes (PO:gamete) originate from the same gametophyte
formal name: whole plant automictic
reference: Klotz, S., Kühn, I. & Durka, W. (2002): BIOLFLOR - Eine Datenbank zu biologisch-oekologischen Merkmalen der Gefaesspflanzen in Deutschland. - Schriftenreihe fuer Vegetationskunde 38. Bonn: Bundesamt fuer Naturschutz.
related match: PO_0000003
related match: PO_0025006
term status: stable

Plant growth form
type: Class
subclass of: Whole plant trait
type: NamedIndividual
type: Concept
related match: PO_0000003
cat: Herb
cat: Shrub
reference: Eric Garnier, Jens Kattge, Stefan Klotz, Ingolf Kühn, Ulrike Stahl
cat: Tree
in scheme: Thesaurustrait
formal name: whole plant growth form
definition: a feature of the whole plant (PO:whole plant) defining the growth form with respect to woodiness and stem branching mode
pref unit: unitless (nominal)
term status: stable

Herb
type: Class
type: NamedIndividual
type: Concept
related match: GO_0080117
definition: plants (PO:whole plant) that have either no or at most modest secondary growth (GO:secondary growth) and have a shoot system (PO:shoot system) that shows different branching modes
related match: PO_0000003
in scheme: Thesaurustrait
reference: Pérez-Harguindeguy N., Díaz S., Garnier E., Lavorel S., Poorter H., Jaureguiberry P., Bret-Harte M. S., Cornwell W. K., Craine J. M., Gurvich D. E., Urcelay C., Veneklaas E. J., Reich P. B., Poorter L., Wright I. J., Ray P., Enrico L., Pausas J. G., de Vos A. C., Buchmann N., Funes G., Quétier F., Hodgson J. G., Thompson K., Morgan H. D., ter Steege H., van der Heijden M. G. A., Sack L., Blonder B., Poschlod P., Vaieretti M. V., Conti G., Staver A. C., Aquino S., Cornelissen J. H. C. (2013) New handbook for standardised measurement of plant functional traits worldwide. Australian Journal of Botany 61, 167_234 (adapted)
pref unit: unitless (category)
term status: stable
formal name: whole plant herb
related match: PO_0009006
alternative label: herbaceous

Shrub
type: Class
type: NamedIndividual
type: Concept
related match: PO_0000003
related match: GO_0080117
definition: plants (PO:whole plant) that have secondary growth (GO:secondary growth) and have a shoot system (PO:shoot system) typically carried by several stems (PO:stem), i.e. show a sympodial branching mode (TOP:sympodial stem)
in scheme: Thesaurustrait
related match: PO_0009006
reference: Pérez-Harguindeguy N., Díaz S., Garnier E., Lavorel S., Poorter H., Jaureguiberry P., Bret-Harte M. S., Cornwell W. K., Craine J. M., Gurvich D. E., Urcelay C., Veneklaas E. J., Reich P. B., Poorter L., Wright I. J., Ray P., Enrico L., Pausas J. G., de Vos A. C., Buchmann N., Funes G., Quétier F., Hodgson J. G., Thompson K., Morgan H. D., ter Steege H., van der Heijden M. G. A., Sack L., Blonder B., Poschlod P., Vaieretti M. V., Conti G., Staver A. C., Aquino S., Cornelissen J. H. C. (2013) New handbook for standardised measurement of plant functional traits worldwide. Australian Journal of Botany 61, 167_234 (adapted)
pref unit: unitless (category)
term status: stable
related match: PO_0009047
formal name: whole plant shrub

Tree
type: Class
type: NamedIndividual
type: Concept
related match: PO_0000003
term status: stable
in scheme: Thesaurustrait
related match: PO_0009006
reference: Pérez-Harguindeguy N., Díaz S., Garnier E., Lavorel S., Poorter H., Jaureguiberry P., Bret-Harte M. S., Cornwell W. K., Craine J. M., Gurvich D. E., Urcelay C., Veneklaas E. J., Reich P. B., Poorter L., Wright I. J., Ray P., Enrico L., Pausas J. G., de Vos A. C., Buchmann N., Funes G., Quétier F., Hodgson J. G., Thompson K., Morgan H. D., ter Steege H., van der Heijden M. G. A., Sack L., Blonder B., Poschlod P., Vaieretti M. V., Conti G., Staver A. C., Aquino S., Cornelissen J. H. C. (2013) New handbook for standardised measurement of plant functional traits worldwide. Australian Journal of Botany 61, 167_234 (adapted)
pref unit: unitless (category)
related match: PO_0009047
related match: GO_0080117
formal name: whole plant tree
definition: plants (PO:whole plant) that have secondary growth (GO:secondary growth) and have a main shoot system (PO:shoot system) elevated on a long-lived, substantial, usually single branching stem (PO:stem), i.e. show a monopodial branching mode

Leaflet length
type: Class
subclass of: Leaf length trait
type: NamedIndividual
type: Concept
related match: PO_0020049
reference: Eric Garnier, Jens Kattge, Stefan Klotz, Ingolf Kühn, Ulrike Stahl
related match: PO_0020050
pref unit: length unit
term status: stable
in scheme: Thesaurustrait
related match: PATO_0000122
definition: the length (PATO:length) of a leaflet (PO:leaflet) from its petiolule (PO:petiolule) base to its apex (PO:apex)
formal name: leaflet length

Shoot architecture type
type: Class
subclass of: Shoot trait
type: NamedIndividual
type: Concept
definition: a feature of the shoot system (PO:shoot system) defining its architecture
cat: Monopodial-deliquescent stem
cat: Monopodial-excurrent stem
cat: Sympodial stem
cat: Cushion
cat: Bambusoid
cat: Extensive-stemmed
cat: Tussock
in scheme: Thesaurustrait
formal name: shoot architecture type
related match: PO_0009006
pref unit: unitless (nominal)
reference: Eric Garnier, Jens Kattge, Stefan Klotz, Ingolf Kühn, Ulrike Stahl
term status: stable

Bambusoid
type: Class
type: NamedIndividual
type: Concept
in scheme: Thesaurustrait
term status: stable
related match: GO_0080117
reference: Pérez-Harguindeguy N., Díaz S., Garnier E., Lavorel S., Poorter H., Jaureguiberry P., Bret-Harte M. S., Cornwell W. K., Craine J. M., Gurvich D. E., Urcelay C., Veneklaas E. J., Reich P. B., Poorter L., Wright I. J., Ray P., Enrico L., Pausas J. G., de Vos A. C., Buchmann N., Funes G., Quétier F., Hodgson J. G., Thompson K., Morgan H. D., ter Steege H., van der Heijden M. G. A., Sack L., Blonder B., Poschlod P., Vaieretti M. V., Conti G., Staver A. C., Aquino S., Cornelissen J. H. C. (2013) New handbook for standardised measurement of plant functional traits worldwide. Australian Journal of Botany 61, 167_234 (adapted)
definition: a shoot system (PO:shoot system) that has only weak secondary growth (GO:secondary growth) or is stiffened by sclerification, has an excurrently branched stem lacking (TOP:monopodial-excurrent stem) and supports a vertically extensive, sometimes tree-sized crown
formal name: shoot bambusoid
pref unit: unitless (category)
related match: PO_0009006

Cushion
type: Class
type: NamedIndividual
type: Concept
in scheme: Thesaurustrait
definition: a shoot system (PO:shoot system) that has tightly packed leaf foliage (PO:vascular leaf) held close to soil surface and has a hemisperical to flat compact form (PO:shoot system) due to the close branching of the shoots and the short internods
reference: Pérez-Harguindeguy N., Díaz S., Garnier E., Lavorel S., Poorter H., Jaureguiberry P., Bret-Harte M. S., Cornwell W. K., Craine J. M., Gurvich D. E., Urcelay C., Veneklaas E. J., Reich P. B., Poorter L., Wright I. J., Ray P., Enrico L., Pausas J. G., de Vos A. C., Buchmann N., Funes G., Quétier F., Hodgson J. G., Thompson K., Morgan H. D., ter Steege H., van der Heijden M. G. A., Sack L., Blonder B., Poschlod P., Vaieretti M. V., Conti G., Staver A. C., Aquino S., Cornelissen J. H. C. (2013) New handbook for standardised measurement of plant functional traits worldwide. Australian Journal of Botany 61, 167_234 (adapted)
pref unit: unitless (category)
related match: PO_0009025
related match: PO_0009006
formal name: shoot cushion
term status: stable

Tussock
type: Class
type: NamedIndividual
type: Concept
related match: PO_0025034
formal name: shoot tussock
in scheme: Thesaurustrait
reference: Pérez-Harguindeguy N., Díaz S., Garnier E., Lavorel S., Poorter H., Jaureguiberry P., Bret-Harte M. S., Cornwell W. K., Craine J. M., Gurvich D. E., Urcelay C., Veneklaas E. J., Reich P. B., Poorter L., Wright I. J., Ray P., Enrico L., Pausas J. G., de Vos A. C., Buchmann N., Funes G., Quétier F., Hodgson J. G., Thompson K., Morgan H. D., ter Steege H., van der Heijden M. G. A., Sack L., Blonder B., Poschlod P., Vaieretti M. V., Conti G., Staver A. C., Aquino S., Cornelissen J. H. C. (2013) New handbook for standardised measurement of plant functional traits worldwide. Australian Journal of Botany 61, 167_234 (adapted)
definition: a shoot system (PO:shoot system) that develops elongated aerial stem(s) (PO:stem) whose nodes bear photosynthetic leaves (PO:leaf). Leaves are distributed nearly throughout the shoot system (PO:shoot system), except when shed from its more basal parts during later growth, and lacking in distally developed inflorescences (PO:inflorescence)
related match: PO_0009047
pref unit: unitless (category)
related match: PO_0009049
related match: PO_0009006
term status: stable

Extensive-stemmed
type: Class
type: NamedIndividual
type: Concept
in scheme: Thesaurustrait
formal name: shoot extensive-stemmed
reference: Pérez-Harguindeguy N., Díaz S., Garnier E., Lavorel S., Poorter H., Jaureguiberry P., Bret-Harte M. S., Cornwell W. K., Craine J. M., Gurvich D. E., Urcelay C., Veneklaas E. J., Reich P. B., Poorter L., Wright I. J., Ray P., Enrico L., Pausas J. G., de Vos A. C., Buchmann N., Funes G., Quétier F., Hodgson J. G., Thompson K., Morgan H. D., ter Steege H., van der Heijden M. G. A., Sack L., Blonder B., Poschlod P., Vaieretti M. V., Conti G., Staver A. C., Aquino S., Cornelissen J. H. C. (2013) New handbook for standardised measurement of plant functional traits worldwide. Australian Journal of Botany 61, 167_234 (adapted)
definition: a shoot system (PO:shoot system) that has many individual shoots of a dense colony or clone grow upward, leaving behind a tough, mostly dead supporting column topped by living shoots with active leaves (PO:leaf)
pref unit: unitless (category)
term status: stable
related match: PO_0009006
related match: PO_0025034

Monopodial-excurrent stem
type: Class
type: NamedIndividual
type: Concept
related match: PO_0009047
related match: PO_0025073
pref unit: unitless (category)
reference: Pérez-Harguindeguy N., Díaz S., Garnier E., Lavorel S., Poorter H., Jaureguiberry P., Bret-Harte M. S., Cornwell W. K., Craine J. M., Gurvich D. E., Urcelay C., Veneklaas E. J., Reich P. B., Poorter L., Wright I. J., Ray P., Enrico L., Pausas J. G., de Vos A. C., Buchmann N., Funes G., Quétier F., Hodgson J. G., Thompson K., Morgan H. D., ter Steege H., van der Heijden M. G. A., Sack L., Blonder B., Poschlod P., Vaieretti M. V., Conti G., Staver A. C., Aquino S., Cornelissen J. H. C. (2013) New handbook for standardised measurement of plant functional traits worldwide. Australian Journal of Botany 61, 167_234 (adapted)
related match: PO_0000003
in scheme: Thesaurustrait
definition: a shoot system (PO:shoot system) that has a single main stem (PO:stem) extending up to, or almost to, the top of the plant (PO:whole plant), with shorter, ascending or horizontal branches (PO:branch) giving a conical or columnar form to the crown
term status: stable
related match: PO_0009006
formal name: shoot monopodial-excurrent stem

Monopodial-deliquescent stem
type: Class
type: NamedIndividual
type: Concept
related match: PO_0009047
related match: PO_0025073
pref unit: unitless (category)
definition: a shoot system (PO:shoot system) that has a stem (PO:stem) which divides, somewhere above its base, into two to several, more or less equal branches (PO:branch) that continue branching upward to produce a wider, more flat-topped crown
formal name: shoot monopodial-deliquescent stem
reference: Pérez-Harguindeguy N., Díaz S., Garnier E., Lavorel S., Poorter H., Jaureguiberry P., Bret-Harte M. S., Cornwell W. K., Craine J. M., Gurvich D. E., Urcelay C., Veneklaas E. J., Reich P. B., Poorter L., Wright I. J., Ray P., Enrico L., Pausas J. G., de Vos A. C., Buchmann N., Funes G., Quétier F., Hodgson J. G., Thompson K., Morgan H. D., ter Steege H., van der Heijden M. G. A., Sack L., Blonder B., Poschlod P., Vaieretti M. V., Conti G., Staver A. C., Aquino S., Cornelissen J. H. C. (2013) New handbook for standardised measurement of plant functional traits worldwide. Australian Journal of Botany 61, 167_234 (adapted)
term status: stable
in scheme: Thesaurustrait
related match: PO_0009006

Sympodial stem
type: Class
type: NamedIndividual
type: Concept
related match: PO_0009047
definition: a shoot system (PO:shoot system) typically carried by several stems (PO:stem)
pref unit: unitless (category)
reference: Pérez-Harguindeguy N., Díaz S., Garnier E., Lavorel S., Poorter H., Jaureguiberry P., Bret-Harte M. S., Cornwell W. K., Craine J. M., Gurvich D. E., Urcelay C., Veneklaas E. J., Reich P. B., Poorter L., Wright I. J., Ray P., Enrico L., Pausas J. G., de Vos A. C., Buchmann N., Funes G., Quétier F., Hodgson J. G., Thompson K., Morgan H. D., ter Steege H., van der Heijden M. G. A., Sack L., Blonder B., Poschlod P., Vaieretti M. V., Conti G., Staver A. C., Aquino S., Cornelissen J. H. C. (2013) New handbook for standardised measurement of plant functional traits worldwide. Australian Journal of Botany 61, 167_234 (adapted)
formal name: shoot sympodial stem
in scheme: Thesaurustrait
term status: stable
related match: PO_0009006

Shoot metamorphosis
type: Class
subclass of: Shoot trait
type: NamedIndividual
type: Concept
cat: Shoot thorn
cat: Shoot tendril
cat: Runner shoot
cat: Shoot turio
cat: Runner-like rhizome
cat: Runner shoot with bulbous tip
formal name: shoot metamorphosis
cat: Brood shoot
cat: Rhizome
reference: Eric Garnier, Jens Kattge, Stefan Klotz, Ingolf Kühn, Ulrike Stahl
pref unit: unitless (nominal)
definition: a feature of the shoot system (PO:shoot system) defining the development of different structures for special task like storage or dispersal from comparable tissues .
in scheme: Thesaurustrait
cat: Runner shoot with tuberous tip
cat: TOP158-like pleiocorm
cat: Shoot tuber
cat: Assimilating shoot
cat: Succulent shoot
cat: Bambusoid
cat: Bulbil shoot
cat: Shoot bulb
cat: Pleiocorm
cat: Elongated leaf-bearing rhizomatous shoot
term status: stable
related match: PO_0009006

Elongated leaf-bearing rhizomatous shoot
type: Class
type: NamedIndividual
type: Concept
pref unit: unitless (category)
related match: PO_0004542
formal name: shoot elongated leaf-bearing rhizomatous
definition: a shoot system (PO:shoot system) that has an elongated rhizome (PO:rhizome) as permanent axis that directly bears photosynthetic leaves (PO:leaf) that extend individually up into the light.
in scheme: Thesaurustrait
reference: Pérez-Harguindeguy N., Díaz S., Garnier E., Lavorel S., Poorter H., Jaureguiberry P., Bret-Harte M. S., Cornwell W. K., Craine J. M., Gurvich D. E., Urcelay C., Veneklaas E. J., Reich P. B., Poorter L., Wright I. J., Ray P., Enrico L., Pausas J. G., de Vos A. C., Buchmann N., Funes G., Quétier F., Hodgson J. G., Thompson K., Morgan H. D., ter Steege H., van der Heijden M. G. A., Sack L., Blonder B., Poschlod P., Vaieretti M. V., Conti G., Staver A. C., Aquino S., Cornelissen J. H. C. (2013) New handbook for standardised measurement of plant functional traits worldwide. Australian Journal of Botany 61, 167_234 (adapted)
related match: PO_0025034
related match: PO_0009006
term status: stable

Leaf lamina length
type: Class
subclass of: Leaf length trait
type: NamedIndividual
type: Concept
related match: PO_0020042
formal name: leaf lamina length
term status: stable
related match: PO_0020039
related match: PO_0020049
related match: PO_0020043
definition: the length (PATO:length) of the leaf lamina (PO:leaf lamina) of a simple leaf (PO:simple leaf) or the length of the leaflet lamina (PO:leaflet, PO:leaf lamina) of a compound leaf (PO:compound leaf) from its base to its apex (PO:apex).
reference: Eric Garnier, Jens Kattge, Stefan Klotz, Ingolf Kühn, Ulrike Stahl
in scheme: Thesaurustrait
related match: PATO_0000122
alternative label: leaf blade length
pref unit: length unit

Runner shoot
type: Class
type: NamedIndividual
type: Concept
related match: PO_0005005
related match: PO_0025029
reference: Klotz, S., Kühn, I. & Durka, W. (2002): BIOLFLOR - Eine Datenbank zu biologisch-oekologischen Merkmalen der Gefaesspflanzen in Deutschland. - Schriftenreihe fuer Vegetationskunde 38. Bonn: Bundesamt fuer Naturschutz.
in scheme: Thesaurustrait
pref unit: unitless (category)
formal name: shoot runner
definition: a shoot system (PO:shoot system) that has a lateral shoot (PO:shoot axis) (exceptional main shoot axis) with long thin shoot internodes (PO:shoot internode) and adventitious roots.
related match: PO_0009006
term status: stable

Runner shoot with tuberous tip
type: Class
type: NamedIndividual
type: Concept
related match: PO_0005005
in scheme: Thesaurustrait
formal name: shoot runner with tuberous tip
related match: PO_0009006
reference: Klotz, S., Kühn, I. & Durka, W. (2002): BIOLFLOR - Eine Datenbank zu biologisch-oekologischen Merkmalen der Gefaesspflanzen in Deutschland. - Schriftenreihe fuer Vegetationskunde 38. Bonn: Bundesamt fuer Naturschutz.
definition: a shoot system (PO:shoot system) that has tuberous swelling of several internodes (PO:shoot internode) at the distal end of a subterranean runner
pref unit: unitless (category)
term status: stable

Runner-like rhizome
type: Class
type: NamedIndividual
type: Concept
formal name: shoot runner-like rhizome
in scheme: Thesaurustrait
related match: PO_0025029
reference: Klotz, S., Kühn, I. & Durka, W. (2002): BIOLFLOR - Eine Datenbank zu biologisch-oekologischen Merkmalen der Gefaesspflanzen in Deutschland. - Schriftenreihe fuer Vegetationskunde 38. Bonn: Bundesamt fuer Naturschutz.
pref unit: unitless (category)
definition: a shoot system (PO:shoot system) that has a subterranean or close to the surface situated shoot (PO:shoot axis) with cataphyllary leaves (PO:leaf), which is more or less thickened, adventitiously rooted and long-lived (> 1 year)
related match: PO_0025034
term status: stable
related match: PO_0009006

Assimilating shoot
type: Class
type: NamedIndividual
type: Concept
term status: stable
in scheme: Thesaurustrait
reference: Klotz, S., Kühn, I. & Durka, W. (2002): BIOLFLOR - Eine Datenbank zu biologisch-oekologischen Merkmalen der Gefaesspflanzen in Deutschland. - Schriftenreihe fuer Vegetationskunde 38. Bonn: Bundesamt fuer Naturschutz.
related match: PO_0025029
definition: a shoot system (PO:shoot system) that has a shoot axis (PO:shoot axis) used for assimilation instead of or in addition to leaves (PO:leaf)
pref unit: unitless (category)
formal name: shoot assimilating
related match: PO_0009006
related match: PO_0025034

Runner shoot with bulbous tip
type: Class
type: NamedIndividual
type: Concept
formal name: shoot runner with bulbous tip
term status: stable
in scheme: Thesaurustrait
reference: Klotz, S., Kühn, I. & Durka, W. (2002): BIOLFLOR - Eine Datenbank zu biologisch-oekologischen Merkmalen der Gefaesspflanzen in Deutschland. - Schriftenreihe fuer Vegetationskunde 38. Bonn: Bundesamt fuer Naturschutz.
pref unit: unitless (category)
definition: a shoot system (PO:shoot system) that has a bulb (PO:bulb) at the distal end of a subterranean runner
related match: PO_0009006
related match: PO_0025356

Bulbil shoot
type: Class
type: NamedIndividual
type: Concept
reference: Klotz, S., Kühn, I. & Durka, W. (2002): BIOLFLOR - Eine Datenbank zu biologisch-oekologischen Merkmalen der Gefaesspflanzen in Deutschland. - Schriftenreihe fuer Vegetationskunde 38. Bonn: Bundesamt fuer Naturschutz.
related match: PO_0000003
in scheme: Thesaurustrait
formal name: shoot bulbil
definition: a shoot system (PO:shoot system) that has a compressed above ground, vegetative lateral shoot with disproportionately developed or still absent organs, which develops into a new independently viable plant (PO:whole plant) after severance from the mother plant
pref unit: unitless (category)
term status: stable
related match: PO_0009006

Brood shoot
type: Class
type: NamedIndividual
type: Concept
related match: PO_0009006
definition: a shoot system (PO:shoot system) where the spikelet (PO:spikelet) has been transformed into a small shoot (PO:shoot system)
pref unit: unitless (category)
in scheme: Thesaurustrait
formal name: shoot brood shoot
related match: PO_0009051
reference: Klotz, S., Kühn, I. & Durka, W. (2002): BIOLFLOR - Eine Datenbank zu biologisch-oekologischen Merkmalen der Gefaesspflanzen in Deutschland. - Schriftenreihe fuer Vegetationskunde 38. Bonn: Bundesamt fuer Naturschutz.
term status: stable

Pleiocorm
type: Class
type: NamedIndividual
type: Concept
related match: PO_0009006
in scheme: Thesaurustrait
reference: Klotz, S., Kühn, I. & Durka, W. (2002): BIOLFLOR - Eine Datenbank zu biologisch-oekologischen Merkmalen der Gefaesspflanzen in Deutschland. - Schriftenreihe fuer Vegetationskunde 38. Bonn: Bundesamt fuer Naturschutz.
definition: a shoot system (PO:shoot system) that occurs at the proximal end of the persistent primary root (PO:primary root). The innovation buds (PO:bud) are situated in the axils (PO:leaf axil) of basal leaves (PO:leaf)
related match: PO_0020127
term status: stable
related match: PO_0000055
related match: PO_0009023
pref unit: unitless (category)
formal name: shoot pleiocorm
related match: PO_0025034

Rhizome
type: Class
type: NamedIndividual
type: Concept
related match: PO_0004542
pref unit: unitless (category)
related match: PO_0009006
reference: Klotz, S., Kühn, I. & Durka, W. (2002): BIOLFLOR - Eine Datenbank zu biologisch-oekologischen Merkmalen der Gefaesspflanzen in Deutschland. - Schriftenreihe fuer Vegetationskunde 38. Bonn: Bundesamt fuer Naturschutz.
in scheme: Thesaurustrait
formal name: shoot rhizome
term status: stable
definition: a shoot system (PO:shoot system) that has a rhizome (PO:rhizome)

Rhizome-like pleiocorm
type: Class
type: NamedIndividual
type: Concept
definition: a shoot system (PO:shoot system) that has more or less crowded shoots (PO:shoot axis), persisting several years which arise mainly at the proximal end of the primary root (PO:primary root) especially in the first years of the individual cycle.
formal name: shoot rhizome-like pleiocorm
pref unit: unitless (category)
related match: PO_0009006
related match: PO_0025029
reference: Klotz, S., Kühn, I. & Durka, W. (2002): BIOLFLOR - Eine Datenbank zu biologisch-oekologischen Merkmalen der Gefaesspflanzen in Deutschland. - Schriftenreihe fuer Vegetationskunde 38. Bonn: Bundesamt fuer Naturschutz.
in scheme: Thesaurustrait
related match: PO_0020127
term status: stable

Leaf width trait
type: Class
subclass of: Leaf trait
type: NamedIndividual
type: Concept
term status: stable
alternative label: leaf blade width
related match: PO_0020049
formal name: leaf width trait
related match: PATO_0000921
reference: Eric Garnier, Jens Kattge, Stefan Klotz, Ingolf Kühn, Ulrike Stahl
related match: PO_0025034
in scheme: Thesaurustrait
alternative label: leaf lamina width
pref unit: length unit
definition: the longest width (PATO:width) axis of a leaf (PO:leaf) or component thereof, i.e. leaflet (PO:leaflet), orthogonal to its length (TOP:leaf length)

Shoot thorn
type: Class
type: NamedIndividual
type: Concept
definition: a shoot system (PO:shoot system) that has prickly, spiky-shaped structures which are rich in strengthening tissue, mostly at the position of a lateral shoot
pref unit: unitless (category)
formal name: shoot thorn
in scheme: Thesaurustrait
reference: Klotz, S., Kühn, I. & Durka, W. (2002): BIOLFLOR - Eine Datenbank zu biologisch-oekologischen Merkmalen der Gefaesspflanzen in Deutschland. - Schriftenreihe fuer Vegetationskunde 38. Bonn: Bundesamt fuer Naturschutz.
term status: stable
related match: PO_0009006

Shoot tuber
type: Class
type: NamedIndividual
type: Concept
pref unit: unitless (category)
related match: PO_0025029
reference: Klotz, S., Kühn, I. & Durka, W. (2002): BIOLFLOR - Eine Datenbank zu biologisch-oekologischen Merkmalen der Gefaesspflanzen in Deutschland. - Schriftenreihe fuer Vegetationskunde 38. Bonn: Bundesamt fuer Naturschutz.
in scheme: Thesaurustrait
term status: stable
definition: a shoot system (PO:shoot system) that has a thickened, mostly subterranean, roundish, short lived (< 1 year) part of a shoot (PO:shoot axis) which is used as storage
related match: PO_0009006
formal name: shoot tuber

Shoot tendril
type: Class
type: NamedIndividual
type: Concept
in scheme: Thesaurustrait
definition: a shoot system (PO:shoot system) that has a thread like, ramified or non-ramified shoot used for climbing
reference: Klotz, S., Kühn, I. & Durka, W. (2002): BIOLFLOR - Eine Datenbank zu biologisch-oekologischen Merkmalen der Gefaesspflanzen in Deutschland. - Schriftenreihe fuer Vegetationskunde 38. Bonn: Bundesamt fuer Naturschutz.
pref unit: unitless (category)
term status: stable
related match: PO_0009006
formal name: shoot tendril

Succulent shoot
type: Class
type: NamedIndividual
type: Concept
formal name: shoot succulent
in scheme: Thesaurustrait
reference: Klotz, S., Kühn, I. & Durka, W. (2002): BIOLFLOR - Eine Datenbank zu biologisch-oekologischen Merkmalen der Gefaesspflanzen in Deutschland. - Schriftenreihe fuer Vegetationskunde 38. Bonn: Bundesamt fuer Naturschutz.
related match: PO_0009006
definition: a shoot system (PO:shoot system) that has large amounts of water-storing tissue causing fleshy, thickened shoots
pref unit: unitless (category)
term status: stable

Shoot turio
type: Class
type: NamedIndividual
type: Concept
related match: PO_0000003
term status: stable
formal name: shoot turio
in scheme: Thesaurustrait
reference: Klotz, S., Kühn, I. & Durka, W. (2002): BIOLFLOR - Eine Datenbank zu biologisch-oekologischen Merkmalen der Gefaesspflanzen in Deutschland. - Schriftenreihe fuer Vegetationskunde 38. Bonn: Bundesamt fuer Naturschutz.
related match: PO_0009006
pref unit: unitless (category)
related match: PO_0025034
definition: a shoot system (PO:shoot system) that has a vegetative compressed, mostly bud like shoot, which hibernates with leaves (PO:leaf) or parts of leaves and sprouts only after severance from the mother plant (PO:whole plant)

Shoot bulb
type: Class
type: NamedIndividual
type: Concept
in scheme: Thesaurustrait
term status: stable
related match: PO_0025356
reference: Klotz, S., Kühn, I. & Durka, W. (2002): BIOLFLOR - Eine Datenbank zu biologisch-oekologischen Merkmalen der Gefaesspflanzen in Deutschland. - Schriftenreihe fuer Vegetationskunde 38. Bonn: Bundesamt fuer Naturschutz.
pref unit: unitless (category)
formal name: shoot bulb
definition: a shoot system (PO:shoot system) that is a bulb (PO:bulb)
related match: PO_0009006

Plant storage organ
type: Class
subclass of: Whole plant trait
type: NamedIndividual
type: Concept
cat: Shoot bulb
cat: Bulbil shoot
cat: Shoot tuber
cat: Runner shoot with tuberous tip
cat: Thickened lateral root
definition: a feature of the whole plant (PO:whole plant) defining its storage organs which store nutrients and water.
term status: stable
cat: Thickened primary root
cat: Rhizome-like pleiocorm
cat: Tufted shoot
cat: Pleiocorm
in scheme: Thesaurustrait
formal name: whole plant storage organ
cat: Runner shoot with bulbous tip
cat: Runner-like rhizome
cat: Shoot turio
cat: Runner shoot
cat: Root tuber
cat: Succulent plant
cat: Rhizome
reference: Klotz, S., Kühn, I. & Durka, W. (2002): BIOLFLOR - Eine Datenbank zu biologisch-oekologischen Merkmalen der Gefaesspflanzen in Deutschland. - Schriftenreihe fuer Vegetationskunde 38. Bonn: Bundesamt fuer Naturschutz.
related match: PO_0000003
cat: Hypocotyl bulb
pref unit: unitless (nominal)

Tufted shoot
type: Class
type: NamedIndividual
type: Concept
reference: Klotz, S., Kühn, I. & Durka, W. (2002): BIOLFLOR - Eine Datenbank zu biologisch-oekologischen Merkmalen der Gefaesspflanzen in Deutschland. - Schriftenreihe fuer Vegetationskunde 38. Bonn: Bundesamt fuer Naturschutz.
related match: PO_0009006
term status: stable
pref unit: unitless (category)
formal name: shoot tuft
in scheme: Thesaurustrait
definition: a shoot system (PO:shoot system) that has ring-like arranged more or less orthotropously growing shoots, which are tightly-packed because of numerous, spatially more or less regular ramification of the basally crowded, adventitiously rooted parts of the shoots

Hypocotyl bulb
type: Class
type: NamedIndividual
type: Concept
related match: PO_0020100
reference: Klotz, S., Kühn, I. & Durka, W. (2002): BIOLFLOR - Eine Datenbank zu biologisch-oekologischen Merkmalen der Gefaesspflanzen in Deutschland. - Schriftenreihe fuer Vegetationskunde 38. Bonn: Bundesamt fuer Naturschutz.
related match: PO_0009006
pref unit: unitless (category)
in scheme: Thesaurustrait
term status: stable
definition: a shoot system (PO:shoot system) that has thickened hypocotyl (PO:hypocotyl)
formal name: shoot hypocotyl bulb

Thickened primary root
type: Class
type: NamedIndividual
type: Concept
formal name: primary root thickened
reference: Klotz, S., Kühn, I. & Durka, W. (2002): BIOLFLOR - Eine Datenbank zu biologisch-oekologischen Merkmalen der Gefaesspflanzen in Deutschland. - Schriftenreihe fuer Vegetationskunde 38. Bonn: Bundesamt fuer Naturschutz.
in scheme: Thesaurustrait
definition: the primary root (PO:primary root) is thickened. Additionally the hypocotyl (PO:hypocotyl) and epicotyl (PO:epicotyl) is thickened and act as a storage function es well.
pref unit: unitless (category)
term status: stable
related match: PO_0020127
related match: PO_0020035
related match: PO_0020100

Leaf width
type: Class
subclass of: Leaf width trait
type: NamedIndividual
type: Concept
related match: PATO_0000921
term status: stable
in scheme: Thesaurustrait
definition: the longest width (PATO:width) axis of a leaf (PO:leaf) orthogonal to its length (TOP:leaf length)
related match: PO_0025034
formal name: leaf width
reference: Eric Garnier, Jens Kattge, Stefan Klotz, Ingolf Kühn, Ulrike Stahl
pref unit: length unit

Succulent plant
type: Class
type: NamedIndividual
type: Concept
pref unit: unitless (category)
formal name: whole plant succulent
reference: Klotz, S., Kühn, I. & Durka, W. (2002): BIOLFLOR - Eine Datenbank zu biologisch-oekologischen Merkmalen der Gefaesspflanzen in Deutschland. - Schriftenreihe fuer Vegetationskunde 38. Bonn: Bundesamt fuer Naturschutz.
related match: PO_0000003
definition: plants (PO:whole plant) that have special water storing tissues (PO:portion of plant tissue)
in scheme: Thesaurustrait
term status: stable
related match: PO_0009007

Thickened lateral root
type: Class
type: NamedIndividual
type: Concept
related match: PO_0020121
pref unit: unitless (category)
reference: Klotz, S., Kühn, I. & Durka, W. (2002): BIOLFLOR - Eine Datenbank zu biologisch-oekologischen Merkmalen der Gefaesspflanzen in Deutschland. - Schriftenreihe fuer Vegetationskunde 38. Bonn: Bundesamt fuer Naturschutz.
in scheme: Thesaurustrait
term status: stable
formal name: lateral root thickened
definition: the lateral root (PO:lateral root) or adventitious root (PO:lateral root) is thickened.

Root tuber
type: Class
type: NamedIndividual
type: Concept
pref unit: unitless (category)
reference: Klotz, S., Kühn, I. & Durka, W. (2002): BIOLFLOR - Eine Datenbank zu biologisch-oekologischen Merkmalen der Gefaesspflanzen in Deutschland. - Schriftenreihe fuer Vegetationskunde 38. Bonn: Bundesamt fuer Naturschutz.
related match: PO_0000055
in scheme: Thesaurustrait
term status: stable
formal name: root tuber
related match: PO_0009005
definition: The root (PO:root) is thickened, not ramified and adventitious, formed by an innovation bud (PO:bud), which primarily acts as storage but rarely as absorption

Plant species altitudinal range
type: Class
subclass of: Altitudinal range
type: NamedIndividual
type: Concept
in scheme: Thesaurustrait
alternative label: plant species altitudinal level
term status: stable
definition: a feature of the plant species (Mayr:species) characterizing the altitudinal level or multiple levels at which the individuals may occur.
cat: Colline distributed plant species
cat: Lowland distributed plant species
cat: Subalpine distributed plant species
cat: Montane distributed plant species
cat: Alpine distributed plant species
reference: Klotz, S., Kühn, I. & Durka, W. (2002): BIOLFLOR - Eine Datenbank zu biologisch-oekologischen Merkmalen der Gefaesspflanzen in Deutschland. - Schriftenreihe fuer Vegetationskunde 38. Bonn: Bundesamt fuer Naturschutz.
pref unit: unitless (ordinal)
formal name: plant species altitudinal range

Lowland distributed plant species
type: Class
type: NamedIndividual
type: Concept
pref unit: unitless (category)
definition: an altitudinal zone at which individuals of a plant species (Mayr:species) can occur defined by the altitudinal range within the lowlands and plains.
reference: Jaeger, J.E. (2011): Exkursionsflora von Deutschland. Gefaesspflanzen: Grundband. Spectrum Akademischer Verlag
in scheme: Thesaurustrait
formal name: plant species lowland
term status: stable

Colline distributed plant species
type: Class
type: NamedIndividual
type: Concept
term status: stable
reference: Jaeger, J.E. (2011): Exkursionsflora von Deutschland. Gefaesspflanzen: Grundband. Spectrum Akademischer Verlag
pref unit: unitless (category)
definition: an altitudinal zone at which individuals of a plant species (Mayr:species) can occur defined by the altitudinal range within the hilly country
in scheme: Thesaurustrait
formal name: plant species colline

Montane distributed plant species
type: Class
type: NamedIndividual
type: Concept
term status: stable
in scheme: Thesaurustrait
definition: an altitudinal zone at which individuals of a plant species (Mayr:species) can occur defined by the altitudinal range within the average mountain zone
reference: Jaeger, J.E. (2011): Exkursionsflora von Deutschland. Gefaesspflanzen: Grundband. Spectrum Akademischer Verlag
pref unit: unitless (category)
formal name: plant species montane

Subalpine distributed plant species
type: Class
type: NamedIndividual
type: Concept
term status: stable
formal name: plant species subalpine
in scheme: Thesaurustrait
reference: Jaeger, J.E. (2011): Exkursionsflora von Deutschland. Gefaesspflanzen: Grundband. Spectrum Akademischer Verlag
pref unit: unitless (category)
definition: an altitudinal zone at which individuals of a plant species (Mayr:species) can occur defined by the altitudinal range within the knee-timber zone

Alpine distributed plant species
type: Class
type: NamedIndividual
type: Concept
formal name: plant species alpine
reference: Jaeger, J.E. (2011): Exkursionsflora von Deutschland. Gefaesspflanzen: Grundband. Spectrum Akademischer Verlag
in scheme: Thesaurustrait
definition: an altitudinal zone at which individuals of a plant species (Mayr:species) can occur defined by the altitudinal range in the alpine tundra above treeline
term status: stable
pref unit: unitless (category)

Plant population altitudinal range
type: Class
subclass of: Altitudinal range
type: NamedIndividual
type: Concept
reference: Klotz, S., Kühn, I. & Durka, W. (2002): BIOLFLOR - Eine Datenbank zu biologisch-oekologischen Merkmalen der Gefaesspflanzen in Deutschland. - Schriftenreihe fuer Vegetationskunde 38. Bonn: Bundesamt fuer Naturschutz.
term status: stable
in scheme: Thesaurustrait
related match: Efo plant population
definition: a feature of the plant population (EFO:plant population) characterizing the altitudinal level or multiple levels at which the individuals may occur.
formal name: plant population altitudinal range
alternative label: plant population altitudinal level
cat: Subalpine distributed plant population
cat: Alpine distributed plant population
cat: Colline distributed plant population
pref unit: unitless (ordinal)
cat: Montane distributed plant population
cat: Lowland distributed plant population

Leaflet width
type: Class
subclass of: Leaf width trait
type: NamedIndividual
type: Concept
formal name: leaflet width
in scheme: Thesaurustrait
related match: PO_0020049
related match: PATO_0000921
term status: stable
reference: Eric Garnier, Jens Kattge, Stefan Klotz, Ingolf Kühn, Ulrike Stahl
pref unit: length unit
definition: the longest width (PATO:width) axis of a leaflet (PO:leaflet) orthogonal to its length (TOP:leaflet length)

Lowland distributed plant population
type: Class
type: NamedIndividual
type: Concept
related match: Efo plant population
reference: Jaeger, J.E. (2011): Exkursionsflora von Deutschland. Gefaesspflanzen: Grundband. Spectrum Akademischer Verlag
definition: an altitudinal zone at which individuals of a plant population (EFO:plant population) can occur defined by the altitudinal range within the lowlands and plains.
formal name: plant population lowland
in scheme: Thesaurustrait
pref unit: unitless (category)
term status: stable

Colline distributed plant population
type: Class
type: NamedIndividual
type: Concept
formal name: plant population colline
related match: Efo plant population
pref unit: unitless (category)
in scheme: Thesaurustrait
reference: Jaeger, J.E. (2011): Exkursionsflora von Deutschland. Gefaesspflanzen: Grundband. Spectrum Akademischer Verlag
definition: an altitudinal zone at which individuals of a plant population (EFO:plant population) can occur defined by the altitudinal range within the hilly country
term status: stable

Montane distributed plant population
type: Class
type: NamedIndividual
type: Concept
pref unit: unitless (category)
reference: Jaeger, J.E. (2011): Exkursionsflora von Deutschland. Gefaesspflanzen: Grundband. Spectrum Akademischer Verlag
in scheme: Thesaurustrait
formal name: plant population montane
term status: stable
related match: Efo plant population
definition: an altitudinal zone at which individuals of a plant population (EFO:plant population) can occur defined by the altitudinal range within the average mountain zone

Subalpine distributed plant population
type: Class
type: NamedIndividual
type: Concept
pref unit: unitless (category)
definition: an altitudinal zone at which individuals of a plant population (EFO:plant population) can occur defined by the altitudinal range within the knee-timber zone
reference: Jaeger, J.E. (2011): Exkursionsflora von Deutschland. Gefaesspflanzen: Grundband. Spectrum Akademischer Verlag
in scheme: Thesaurustrait
term status: stable
related match: Efo plant population
formal name: plant population subalpine

Alpine distributed plant population
type: Class
type: NamedIndividual
type: Concept
pref unit: unitless (category)
in scheme: Thesaurustrait
related match: Efo plant population
reference: Jaeger, J.E. (2011): Exkursionsflora von Deutschland. Gefaesspflanzen: Grundband. Spectrum Akademischer Verlag
term status: stable
definition: an altitudinal zone at which individuals of a plant population (EFO:plant population) can occur defined by the altitudinal range in the alpine tundra above treeline
formal name: plant population alpine

Ellenberg light value
type: Class
subclass of: Environmental indicator
type: NamedIndividual
type: Concept
abbreviation: L
alternative label: plant light preference
definition: a feature of the plant population (EFO:plant population) or plant species (Mayr:species) describing the occurrence of its individuals in relation to relative irradiance intensity at the time when the deciduous plants (PATO:deciduous (plant)) are in full leaf (PO:leaf)
related match: Pato deciduous plant
cat: Semi-shade
cat: Between shade and semi-shade
cat: Shade
cat: Between deep shade and shade
related match: PO_0025034
pref unit: unitless (ordinal)
formal name: plant populations light indicator value according to Ellenberg
cat: Deep shade
cat: Full light
cat: Light
in scheme: Thesaurustrait
term status: stable
cat: Semi-light
cat: Between semi-shade and semi-light
reference: Ellenberg, H., Weber, H. E., Duell, R., Wirth, V., Werner, W., Paulissen, D. (1992): Zeigerwerte der Pflanzen in Mitteleuropa, 2nd edition, Scripta Geobotanica, Vol. 18, Goltze KG, Goettingen
related match: Efo plant population

Leaf thickness trait
type: Class
subclass of: Leaf trait
type: NamedIndividual
type: Concept
pref unit: length unit
formal name: leaf thickness trait
in scheme: Thesaurustrait
reference: Eric Garnier, Jens Kattge, Stefan Klotz, Ingolf Kühn, Ulrike Stahl
related match: PO_0025034
definition: the thickness (PATO:thickness) of a leaf (PO:leaf) or component thereof, i.e. leaf lamina or leaf midvein (PO:leaf lamina, PO:leaf midvein)
related match: PO_0020039
term status: stable
related match: PO_0020139
related match: PATO_0000915

Plant trait
type: Class
subclass of: Plant characteristics
type: NamedIndividual
type: Concept
term status: testing
in scheme: Thesaurustrait
reference: Violle, C., Navas, M. L., Vile, D., Kazakou, E., Fortunel, C., Hummel, I., & Garnier, E. (2007). Let the concept of trait be functional!. Oikos, 116(5), 882-892, as modified by Garnier, E., Navas, M.-L. & Grigulis, K. (2016) Plant Functional Diversity - Organism Traits, Community Structure, and Ecosystem Properties. Oxford University Press, Oxford.
definition: any morphological, anatomical, biochemical, physiological or phenological heritable feature measurable at the individual level, from the cellular level to the whole-organism

Leaf thickness
type: Class
subclass of: Leaf thickness trait
type: NamedIndividual
type: Concept
definition: the thickness (PATO:thickness) of a leaf (PO:leaf)
pref unit: length unit
term status: stable
related match: PATO_0000915
formal name: leaf thickness
reference: Eric Garnier, Jens Kattge, Stefan Klotz, Ingolf Kühn, Ulrike Stahl
in scheme: Thesaurustrait
related match: PO_0025034

Ellenberg salt value
type: Class
subclass of: Environmental indicator
type: NamedIndividual
type: Concept
term status: stable
in scheme: Thesaurustrait
abbreviation: S
reference: Ellenberg, H., Weber, H. E., Duell, R., Wirth, V., Werner, W., Paulissen, D. (1992): Zeigerwerte der Pflanzen in Mitteleuropa, 2nd edition, Scripta Geobotanica, Vol. 18, Goltze KG, Goettingen
formal name: plant populations salt indicator value according to Ellenberg
alternative label: plant salt preference
definition: a feature of the plant population (EFO:plant population) or plant species (Mayr:species) describing the occurrence of its individulas along gradient of salt in soil solution or water solution
related match: Efo plant population
pref unit: unitless (ordinal)

Leaf lamina thickness
type: Class
subclass of: Leaf thickness trait
type: NamedIndividual
type: Concept
pref unit: length unit
term status: stable
in scheme: Thesaurustrait
related match: PO_0020139
related match: PATO_0000915
related match: PO_0020039
reference: Eric Garnier, Jens Kattge, Stefan Klotz, Ingolf Kühn, Ulrike Stahl
alternative label: leaf blade thickness
definition: the thickness (PATO:thickness) of the leaf lamina (PO:leaf lamina) including the midvein (PO:leaf midvein)
formal name: leaf lamina thickness

Plant life form
type: Class
subclass of: Whole plant trait
type: NamedIndividual
type: Concept
cat: Geophyte
related match: PO_0000003
in scheme: Thesaurustrait
related match: Buds po bud
term status: stable
definition: a feature of the whole plant (PO:whole plant) defining the location of the perennating (meristematic) tissue (buds (PO:bud), shoot apices or seeds (PO:seed)) on the shoot system (PO:shoot system)), their distance to the ground surface and the kind of protection afforded to survive unfavourable seasons
cat: Nanophanerophyte
related match: PO_0009006
pref unit: unitless (nominal)
cat: Hemiphanerophyte
cat: Phanerophyte
cat: Macrophanerophyte
formal name: whole plant life form
cat: Hemicryptophyte
cat: Hydrophyte
cat: Pseudophanerophyte
related match: PO_0009010
cat: Chamaephyte
cat: Cryptophyte
cat: Therophyte
reference: after Raunkiaer, C. (1934): The lifeforms of plants and statistical plant geography. Oxford, 632 pages and Raunkiaer, C (1937) : Plant life forms. Oxford (Claredon Press), 104 pages, changed by Klotz, S., Kühn, I. & Durka, W. (2002): BIOLFLOR - Eine Datenbank zu biologisch-oekologischen Merkmalen der Gefaesspflanzen in Deutschland. - Schriftenreihe fuer Vegetationskunde 38. Bonn: Bundesamt fuer Naturschutz.

Phanerophyte
type: Class
type: NamedIndividual
type: Concept
related match: PO_0000003
reference: Raunkiaer, C. (1934): The lifeforms of plants and statistical plant geography. Oxford, 632 pages, Raunkiaer, C (1937) : Plant life forms. Oxford (Claredon Press), 104 pages
in scheme: Thesaurustrait
formal name: whole plant phanerophyte
related match: PO_0025029
term status: stable
related match: PO_0000055
pref unit: unitless (category)
definition: plants (PO:whole plant) which have their survinging buds (PO:bud) situated on woody (TOP:woody plant) shoots (PO:shoot axis)

Macrophanerophyte
type: Class
type: NamedIndividual
type: Concept
in scheme: Thesaurustrait
term status: stable
formal name: whole plant macrophanerophyte
related match: PO_0000055
related match: PO_0000003
reference: after Baesseler, M., Jaeger, E. J., Werner, K. (1996): Exkursionsflora von Deutschland. Bd. 2 Gefaesspflanzen, 16.Auflage Jena (Fischer-Verlag), 639 pages, changed by Klotz, S., Kühn, I. & Durka, W. (2002): BIOLFLOR - Eine Datenbank zu biologisch-oekologischen Merkmalen der Gefaesspflanzen in Deutschland. - Schriftenreihe fuer Vegetationskunde 38. Bonn: Bundesamt fuer Naturschutz.
pref unit: unitless (category)
related match: PO_0025029
definition: plants (PO:whole plant) which have their survinging buds (PO:bud) situated more than 3m above the ground surface on woody (TOP:woody plant) shoots (PO:shoot axis), which from a crown and a trunk

Nanophanerophyte
type: Class
type: NamedIndividual
type: Concept
related match: PO_0000055
term status: stable
in scheme: Thesaurustrait
related match: PO_0009006
reference: after Baesseler, M., Jaeger, E. J., Werner, K. (1996): Exkursionsflora von Deutschland. Bd. 2 Gefaesspflanzen, 16.Auflage Jena (Fischer-Verlag), 639 pages, changed by Klotz, S., Kühn, I. & Durka, W. (2002): BIOLFLOR - Eine Datenbank zu biologisch-oekologischen Merkmalen der Gefaesspflanzen in Deutschland. - Schriftenreihe fuer Vegetationskunde 38. Bonn: Bundesamt fuer Naturschutz.
definition: plants (PO:whole plant) which have their survinging buds (PO:bud) situated between 0.5m and 3m above the ground surface on woody (TOP:woody plant) shoots (PO:shoot axis), which form a stemless shoot system (PO:shoot system) with strong basal ramification
pref unit: unitless (category)
related match: PO_0025029
related match: PO_0000003
formal name: whole plant nanophanerophyte

Hemiphanerophyte
type: Class
type: NamedIndividual
type: Concept
definition: plants (PO:whole plant) which have their survinging buds (PO:bud) situated up to 0.5m above the ground surface on woody (TOP:woody plant), basally ramified shoots (PO:shoot axis) or on the only basally lignified parts of higher shoots, which do not become lignified in their upper parts but die down periodically
related match: PO_0000055
term status: stable
formal name: whole plant hemiphanerophyte
pref unit: unitless (category)
related match: PO_0025029
alternative label: suffrutex
reference: after Baesseler, M., Jaeger, E. J., Werner, K. (1996): Exkursionsflora von Deutschland. Bd. 2 Gefaesspflanzen, 16.Auflage Jena (Fischer-Verlag), 639 pages, changed by Klotz, S., Kühn, I. & Durka, W. (2002): BIOLFLOR - Eine Datenbank zu biologisch-oekologischen Merkmalen der Gefaesspflanzen in Deutschland. - Schriftenreihe fuer Vegetationskunde 38. Bonn: Bundesamt fuer Naturschutz.
alternative label: dwarf shrub
related match: PO_0000003
in scheme: Thesaurustrait

Pseudophanerophyte
type: Class
type: NamedIndividual
type: Concept
related match: PO_0009006
related match: PO_0000055
term status: stable
definition: plants (PO:whole plant) which have their survinging buds (PO:bud) situated on this year�s shoots (PO:shoot axis) forming an aboveground, stemless, strongly ramified but only slightly lignified shoot system (PO:shoot system). Shoots flower in the second year, die down afterwards and are replaced by new innovation shoots annually
pref unit: unitless (category)
related match: PO_0025029
reference: Klotz, S., Kühn, I. & Durka, W. (2002): BIOLFLOR - Eine Datenbank zu biologisch-oekologischen Merkmalen der Gefaesspflanzen in Deutschland. - Schriftenreihe fuer Vegetationskunde 38. Bonn: Bundesamt fuer Naturschutz.
formal name: whole plant pseudophanerophyte
alternative label: pseudoshrub
in scheme: Thesaurustrait
related match: PO_0000003

Chamaephyte
type: Class
type: NamedIndividual
type: Concept
pref unit: unitless (category)
definition: plants (PO:whole plant) which have their survinging buds (PO:bud) situated close to the ground surface on herbaceous shoots (PO:shoot axis) or only slightly lignified shoots, protected by parts of the plant itself and/or by snow cover
related match: PO_0000003
reference: after Baesseler, M., Jaeger, E. J., Werner, K. (1996): Exkursionsflora von Deutschland. Bd. 2 Gefaesspflanzen, 16.Auflage Jena (Fischer-Verlag), 639 pages, changed by Klotz, S., Kühn, I. & Durka, W. (2002): BIOLFLOR - Eine Datenbank zu biologisch-oekologischen Merkmalen der Gefaesspflanzen in Deutschland. - Schriftenreihe fuer Vegetationskunde 38. Bonn: Bundesamt fuer Naturschutz.
term status: stable
related match: PO_0000055
formal name: whole plant chamaephyte
in scheme: Thesaurustrait
related match: PO_0025029

Hemicryptophyte
type: Class
type: NamedIndividual
type: Concept
formal name: whole plant hemicryptophyte
pref unit: unitless (category)
definition: plants (PO:whole plant) which have their survinging buds (PO:bud) situated close to the ground surface on herbaceous (TOP:non woody plant) shoots (PO:shoot axis), protected by foliage or dead leaves (PO:leaf)
related match: PO_0025034
related match: PO_0000055
term status: stable
reference: after Baesseler, M., Jaeger, E. J., Werner, K. (1996): Exkursionsflora von Deutschland. Bd. 2 Gefaesspflanzen, 16.Auflage Jena (Fischer-Verlag), 639 pages, changed by Klotz, S., Kühn, I. & Durka, W. (2002): BIOLFLOR - Eine Datenbank zu biologisch-oekologischen Merkmalen der Gefaesspflanzen in Deutschland. - Schriftenreihe fuer Vegetationskunde 38. Bonn: Bundesamt fuer Naturschutz.
related match: PO_0025029
related match: PO_0000003
in scheme: Thesaurustrait

Hydrophyte
type: Class
type: NamedIndividual
type: Concept
pref unit: unitless (category)
in scheme: Thesaurustrait
related match: PO_0000055
term status: stable
reference: after Baesseler, M., Jaeger, E. J., Werner, K. (1996): Exkursionsflora von Deutschland. Bd. 2 Gefaesspflanzen, 16.Auflage Jena (Fischer-Verlag), 639 pages, changed by Klotz, S., Kühn, I. & Durka, W. (2002): BIOLFLOR - Eine Datenbank zu biologisch-oekologischen Merkmalen der Gefaesspflanzen in Deutschland. - Schriftenreihe fuer Vegetationskunde 38. Bonn: Bundesamt fuer Naturschutz.
formal name: whole plant hydrophyte
definition: plants (PO:whole plant) which have their survinging buds (PO:bud) situated under water on the bed or in the mud
related match: PO_0000003

Geophyte
type: Class
type: NamedIndividual
type: Concept
definition: plants (PO:whole plant) which have their survinging buds (PO:bud) situated within the soil often on storing organs
related match: PO_0000055
term status: stable
related match: PO_0000003
reference: after Baesseler, M., Jaeger, E. J., Werner, K. (1996): Exkursionsflora von Deutschland. Bd. 2 Gefaesspflanzen, 16.Auflage Jena (Fischer-Verlag), 639 pages, changed by Klotz, S., Kühn, I. & Durka, W. (2002): BIOLFLOR - Eine Datenbank zu biologisch-oekologischen Merkmalen der Gefaesspflanzen in Deutschland. - Schriftenreihe fuer Vegetationskunde 38. Bonn: Bundesamt fuer Naturschutz.
formal name: whole plant geophyte
pref unit: unitless (category)
in scheme: Thesaurustrait

Leaf lamina thickness excluding midvein
type: Class
subclass of: Leaf thickness trait
type: NamedIndividual
type: Concept
reference: Eric Garnier, Jens Kattge, Stefan Klotz, Ingolf Kühn, Ulrike Stahl
in scheme: Thesaurustrait
term status: stable
related match: PO_0020039
related match: PATO_0000915
related match: PO_0020139
formal name: leaf lamina thickness excluding midvein
pref unit: length unit
definition: the thickness (PATO:thickness) of the leaf lamina (PO:leaf lamina) excluding the midvein (PO:leaf midvein)

Cryptophyte
type: Class
type: NamedIndividual
type: Concept
pref unit: unitless (category)
definition: plants (PO:whole plant) which are either hydrophytes (TOP:hydrophyte) or geophytes (TOP:geophyte)
reference: after Baesseler, M., Jaeger, E. J., Werner, K. (1996): Exkursionsflora von Deutschland. Bd. 2 Gefaesspflanzen, 16.Auflage Jena (Fischer-Verlag), 639 pages, changed by Klotz, S., Kühn, I. & Durka, W. (2002): BIOLFLOR - Eine Datenbank zu biologisch-oekologischen Merkmalen der Gefaesspflanzen in Deutschland. - Schriftenreihe fuer Vegetationskunde 38. Bonn: Bundesamt fuer Naturschutz.
term status: stable
formal name: whole plant cryptophyte
in scheme: Thesaurustrait
related match: PO_0000003

Therophyte
type: Class
type: NamedIndividual
type: Concept
related match: PO_0009010
related match: PO_0000003
definition: plants (PO:whole plant) whose entire shoot (PO:shoot system) dies after seed (PO:seed) production and which survive through their seeds
pref unit: unitless (category)
alternative label: annuals
term status: stable
related match: PO_0009006
reference: after Baesseler, M., Jaeger, E. J., Werner, K. (1996): Exkursionsflora von Deutschland. Bd. 2 Gefaesspflanzen, 16.Auflage Jena (Fischer-Verlag), 639 pages, changed by Klotz, S., Kühn, I. & Durka, W. (2002): BIOLFLOR - Eine Datenbank zu biologisch-oekologischen Merkmalen der Gefaesspflanzen in Deutschland. - Schriftenreihe fuer Vegetationskunde 38. Bonn: Bundesamt fuer Naturschutz.
formal name: whole plant therophyte
in scheme: Thesaurustrait

Leaf compoundness
type: Class
subclass of: Leaf trait
type: NamedIndividual
type: Concept
related match: PO_0025034
definition: a feature of the leaf (PO:leaf) defining whether it is simple (PO:simple leaf) or compound (PO:compound leaf)
reference: Eric Garnier, Jens Kattge, Stefan Klotz, Ingolf Kühn, Ulrike Stahl
in scheme: Thesaurustrait
term status: stable
pref unit: unitless (nominal)
cat: Compound leaf
cat: Simple leaf
related match: PO_0020043
related match: PO_0020042
formal name: leaf compoundness

Simple leaf
type: Class
type: NamedIndividual
type: Concept
definition: the leaf (PO:leaf) is simple (PO:simple leaf)
term status: stable
related match: PO_0025034
related match: PO_0020042
pref unit: unitless (category)
reference: Eric Garnier, Jens Kattge, Stefan Klotz, Ingolf Kühn, Ulrike Stahl
in scheme: Thesaurustrait
formal name: leaf simple

Compound leaf
type: Class
type: NamedIndividual
type: Concept
in scheme: Thesaurustrait
term status: stable
definition: the leaf (PO:leaf) is compound (PO:compound leaf)
related match: PO_0025034
formal name: leaf compound
pref unit: unitless (category)
related match: PO_0020043
reference: Eric Garnier, Jens Kattge, Stefan Klotz, Ingolf Kühn, Ulrike Stahl

Leaf form
type: Class
subclass of: Leaf trait
type: NamedIndividual
type: Concept
related match: PO_0025034
definition: a feature of the leaf (PO:leaf) defining the form of the leaf
in scheme: Thesaurustrait
cat: Tubular leaf
cat: Scale-like leaf
cat: Bipinnate leaf
cat: Needle leaf
formal name: leaf form
cat: Grass-like leaf
cat: Broadleaved leaf
cat: Ensiform leaf
term status: stable
pref unit: unitless (nominal)
cat: Eliptic leaf
cat: Long-leaved leaf
cat: Lobate leaf
cat: Rhombic leaf
cat: Digitate leaf
cat: Pinnatifid leaf
cat: Pinnate leaf
reference: Klotz, S., Kühn, I. & Durka, W. (2002): BIOLFLOR - Eine Datenbank zu biologisch-oekologischen Merkmalen der Gefaesspflanzen in Deutschland. - Schriftenreihe fuer Vegetationskunde 38. Bonn: Bundesamt fuer Naturschutz.
cat: Palmate leaf

Needle leaf
type: Class
type: NamedIndividual
type: Concept
reference: Klotz, S., Kühn, I. & Durka, W. (2002): BIOLFLOR - Eine Datenbank zu biologisch-oekologischen Merkmalen der Gefaesspflanzen in Deutschland. - Schriftenreihe fuer Vegetationskunde 38. Bonn: Bundesamt fuer Naturschutz.
related match: PO_0025034
term status: stable
definition: the leaf (PO:leaf) is simple (PO:simple leaf, TOP:simple leaf), slender, rigid, needle-shaped (PATO:subulate) and is equally wide across most of its length (TOP:leaf length) and often has a stiff tip (PO:leaf tip)
related match: PO_0025142
related match: PATO_0001954
related match: PO_0020042
pref unit: unitless (category)
formal name: leaf needle-like
in scheme: Thesaurustrait

Scale-like leaf
type: Class
type: NamedIndividual
type: Concept
definition: the leaf (PO:leaf) is simple (PO:simple leaf, TOP:simple leaf), reduced and short but wide adjoining the shoot (PO:shoot axis)
reference: Klotz, S., Kühn, I. & Durka, W. (2002): BIOLFLOR - Eine Datenbank zu biologisch-oekologischen Merkmalen der Gefaesspflanzen in Deutschland. - Schriftenreihe fuer Vegetationskunde 38. Bonn: Bundesamt fuer Naturschutz.
related match: PO_0020042
related match: PO_0025034
formal name: leaf scale-like
related match: PO_0025029
pref unit: unitless (category)
term status: stable
in scheme: Thesaurustrait

Broadleaved leaf
type: Class
type: NamedIndividual
type: Concept
related match: PO_0025034
definition: the leaf (PO:leaf) is not needle-like (TOP:needle leaf) or scale-like (TOP:scale-like leaf)
term status: stable
formal name: leaf broadleaved
reference: Eric Garnier, Jens Kattge, Stefan Klotz, Ingolf Kühn, Ulrike Stahl
in scheme: Thesaurustrait
pref unit: unitless (category)

Grass-like leaf
type: Class
type: NamedIndividual
type: Concept
related match: PO_0020042
related match: PO_0025142
definition: the leaf (PO:leaf) is simple (PO:simple leaf, TOP:simple leaf), long and narrow with parallel margins and usually long tip (PO:leaf tip) and the leaf width (TOP:leaf width) is <10% of the leaf length (TOP:leaf length).
term status: stable
in scheme: Thesaurustrait
reference: Klotz, S., Kühn, I. & Durka, W. (2002): BIOLFLOR - Eine Datenbank zu biologisch-oekologischen Merkmalen der Gefaesspflanzen in Deutschland. - Schriftenreihe fuer Vegetationskunde 38. Bonn: Bundesamt fuer Naturschutz.
related match: PO_0025034
formal name: leaf grass-like
pref unit: unitless (category)

Leaf midvein thickness
type: Class
subclass of: Leaf thickness trait
type: NamedIndividual
type: Concept
related match: PATO_0000915
reference: Eric Garnier, Jens Kattge, Stefan Klotz, Ingolf Kühn, Ulrike Stahl
term status: stable
in scheme: Thesaurustrait
related match: PO_0020139
definition: the thickness (PATO:thickness) of the leaf midvein (PO:leaf midvein)
formal name: leaf midvein thickness
alternative label: leaf mid rib thickness
pref unit: length unit

Eliptic leaf
type: Class
type: NamedIndividual
type: Concept
related match: PO_0020042
pref unit: unitless (category)
definition: the leaf (PO:leaf) is simple leaves (PO:simple leaf, TOP:simple leaf), oval (PATO:ovate) or elliptic (PATO:elliptic) and the leaf width (TOP:leaf width) is 25-50% of the leaf length (TOP:leaf length)
related match: PATO_0001891
related match: PO_0025034
formal name: leaf eliptic
in scheme: Thesaurustrait
term status: stable
reference: Klotz, S., Kühn, I. & Durka, W. (2002): BIOLFLOR - Eine Datenbank zu biologisch-oekologischen Merkmalen der Gefaesspflanzen in Deutschland. - Schriftenreihe fuer Vegetationskunde 38. Bonn: Bundesamt fuer Naturschutz.
related match: PATO_0000947

Rhombic leaf
type: Class
type: NamedIndividual
type: Concept
related match: PATO_0001934
related match: PO_0020042
pref unit: unitless (category)
definition: the leaf (PO:leaf) is simple (PO:simple leaf, TOP:simple leaf) and is either orbicular (PATO:orbicular), cordate, rhombic or polygonal and the leaf width (TOP:leaf width) is >50% of the leaf length (TOP:leaf length).
related match: PO_0025034
in scheme: Thesaurustrait
term status: stable
formal name: leaf rhombic
reference: Klotz, S., Kühn, I. & Durka, W. (2002): BIOLFLOR - Eine Datenbank zu biologisch-oekologischen Merkmalen der Gefaesspflanzen in Deutschland. - Schriftenreihe fuer Vegetationskunde 38. Bonn: Bundesamt fuer Naturschutz.

Lobate leaf
type: Class
type: NamedIndividual
type: Concept
definition: the leaf (PO:leaf) is simple (PO:simple leaf, TOP:simple leaf) and lobate (PATO:lobate) with lobed divisions up to 1/4-1/3 of the leaf length (TOP:leaf lenght) and/or leaf width (TOP:leaf width)
pref unit: unitless (category)
related match: PATO_0001367
related match: PO_0025034
formal name: leaf lobate
term status: stable
related match: PO_0020042
in scheme: Thesaurustrait
reference: Klotz, S., Kühn, I. & Durka, W. (2002): BIOLFLOR - Eine Datenbank zu biologisch-oekologischen Merkmalen der Gefaesspflanzen in Deutschland. - Schriftenreihe fuer Vegetationskunde 38. Bonn: Bundesamt fuer Naturschutz.

Pinnatifid leaf
type: Class
type: NamedIndividual
type: Concept
related match: PO_0020139
related match: PATO_0000410
formal name: leaf pinnatifid
related match: PO_0025034
term status: stable
pref unit: unitless (category)
related match: PO_0020042
definition: the leaf (PO:leaf) is simple (PO:simple leaf, TOP:simple) and almost pinnate (PATO:pinnate) is not completely divided along the leaf midvein (PO:leaf midvein)
reference: Klotz, S., Kühn, I. & Durka, W. (2002): BIOLFLOR - Eine Datenbank zu biologisch-oekologischen Merkmalen der Gefaesspflanzen in Deutschland. - Schriftenreihe fuer Vegetationskunde 38. Bonn: Bundesamt fuer Naturschutz.
in scheme: Thesaurustrait

Digitate leaf
type: Class
type: NamedIndividual
type: Concept
term status: stable
related match: PATO_0001980
formal name: leaf digitate
related match: PO_0025034
related match: PO_0020043
definition: the leaf (PO:leaf) is compound (PO:compound leaf, TOP:compound leaf) and digitate (PATO:digitate) with three or more divisions all arising at one point but not completely separated
pref unit: unitless (category)
reference: Klotz, S., Kühn, I. & Durka, W. (2002): BIOLFLOR - Eine Datenbank zu biologisch-oekologischen Merkmalen der Gefaesspflanzen in Deutschland. - Schriftenreihe fuer Vegetationskunde 38. Bonn: Bundesamt fuer Naturschutz.
in scheme: Thesaurustrait

Palmate leaf
type: Class
type: NamedIndividual
type: Concept
related match: PO_0020049
term status: stable
definition: the leaf (PO:leaf) is compound (PO:compound leaf, TOP:compound leaf) with three or more completely separated leaflets (PO:leaflet) all arising at one point
formal name: leaf palmate
related match: PO_0025034
related match: PO_0020043
pref unit: unitless (category)
reference: Klotz, S., Kühn, I. & Durka, W. (2002): BIOLFLOR - Eine Datenbank zu biologisch-oekologischen Merkmalen der Gefaesspflanzen in Deutschland. - Schriftenreihe fuer Vegetationskunde 38. Bonn: Bundesamt fuer Naturschutz.
in scheme: Thesaurustrait

Pinnate leaf
type: Class
type: NamedIndividual
type: Concept
term status: stable
in scheme: Thesaurustrait
related match: PATO_0000410
related match: PO_0025034
formal name: leaf pinnate
pref unit: unitless (category)
related match: PO_0020043
definition: the leaf (PO:leaf) is compound (PO:compound leaf, TOP:compound leaf) and pinnate (PATO:pinnate)
reference: Klotz, S., Kühn, I. & Durka, W. (2002): BIOLFLOR - Eine Datenbank zu biologisch-oekologischen Merkmalen der Gefaesspflanzen in Deutschland. - Schriftenreihe fuer Vegetationskunde 38. Bonn: Bundesamt fuer Naturschutz.

Bipinnate leaf
type: Class
type: NamedIndividual
type: Concept
term status: stable
in scheme: Thesaurustrait
related match: PATO_0000410
reference: Klotz, S., Kühn, I. & Durka, W. (2002): BIOLFLOR - Eine Datenbank zu biologisch-oekologischen Merkmalen der Gefaesspflanzen in Deutschland. - Schriftenreihe fuer Vegetationskunde 38. Bonn: Bundesamt fuer Naturschutz.
related match: PO_0025034
related match: PO_0020049
related match: PO_0020043
definition: the leaf (PO:leaf) is compound (PO:compound leaf, TOP:compound leaf) with leaflets (PO:leaflet) which are pinnate (PATO:pinnate) again
formal name: leaf bipinnate
pref unit: unitless (category)

Tubular leaf
type: Class
type: NamedIndividual
type: Concept
reference: Klotz, S., Kühn, I. & Durka, W. (2002): BIOLFLOR - Eine Datenbank zu biologisch-oekologischen Merkmalen der Gefaesspflanzen in Deutschland. - Schriftenreihe fuer Vegetationskunde 38. Bonn: Bundesamt fuer Naturschutz.
related match: PO_0025034
related match: PO_0020042
formal name: leaf tubular
definition: the leaf (PO:leaf)is simple (PO:simple leaf, TOP:simple leaf), unifacial (having just one surface) and tuberous, usually hollow inside.
term status: stable
in scheme: Thesaurustrait
pref unit: unitless (category)

Ensiform leaf
type: Class
type: NamedIndividual
type: Concept
related match: PO_0025034
formal name: leaf ensiform
reference: Klotz, S., Kühn, I. & Durka, W. (2002): BIOLFLOR - Eine Datenbank zu biologisch-oekologischen Merkmalen der Gefaesspflanzen in Deutschland. - Schriftenreihe fuer Vegetationskunde 38. Bonn: Bundesamt fuer Naturschutz.
related match: PO_0020042
definition: the leaf (PO:leaf) is simple (PO:simple leaf, TOP:simple leaf), blade-like (PATO:blade-like), unifacial (having just one surface), sword-like and vertical orientated and flat.
related match: Pato blade-like
pref unit: unitless (category)
term status: stable
in scheme: Thesaurustrait

Leaf area trait
type: Class
subclass of: Leaf trait
type: NamedIndividual
type: Concept
term status: stable
pref unit: area unit
in scheme: Thesaurustrait
related match: PATO_0001323
formal name: leaf area trait
definition: the area (PATO:area) of a leaf (PO:leaf) or component thereof, i.e. leaf lamina or leaflet (PO:leaf lamina, PO:leaflet) in the one sided projection
related match: PO_0025034
abbreviation: LA
alternative label: leaf size
related match: PO_0020049
reference: Eric Garnier, Jens Kattge, Stefan Klotz, Ingolf Kühn, Ulrike Stahl
related match: PO_0020039

Long-leaved leaf
type: Class
type: NamedIndividual
type: Concept
related match: PO_0025034
definition: the leaf (PO:leaf) is simple (PO:simple leaf, TOP:simple leaf), lanceolate, spathulate or slender hastate (triangular leaves) and the leaf width (TOP:leaf width) is 10-25% of the leaf length (TOP:leaf length).
term status: stable
formal name: leaf long-leaf
in scheme: Thesaurustrait
pref unit: unitless (category)
related match: PO_0020042
reference: Klotz, S., Kühn, I. & Durka, W. (2002): BIOLFLOR - Eine Datenbank zu biologisch-oekologischen Merkmalen der Gefaesspflanzen in Deutschland. - Schriftenreihe fuer Vegetationskunde 38. Bonn: Bundesamt fuer Naturschutz.

Plant chromosome number
type: Class
subclass of: Whole plant trait
type: NamedIndividual
type: Concept
definition: a feature of the whole plant (PO:whole plant) characterizing the number of chromosomes (GO:chromosome) of the chromosome set of the plant
related match: PO_0000003
related match: GO_0005694
pref unit: unitless (number)
term status: stable
in scheme: Thesaurustrait
reference: Klotz, S., Kühn, I. & Durka, W. (2002): BIOLFLOR - Eine Datenbank zu biologisch-oekologischen Merkmalen der Gefaesspflanzen in Deutschland. - Schriftenreihe fuer Vegetationskunde 38. Bonn: Bundesamt fuer Naturschutz.
formal name: whole plant chromosome number

Flower color
type: Class
subclass of: Flower and dispersule trait
type: NamedIndividual
type: Concept
cat: Blue flower
cat: Brown flower
definition: the color (PATO:color) of the flower or flowers (PO:flower)
cat: Violet flower
cat: White flower
cat: Magenta flower
cat: Various colored flower
pref unit: unitless (nominal)
related match: PO_0009046
term status: stable
in scheme: Thesaurustrait
formal name: flower color
cat: Red flower
related match: PATO_0000014
reference: Klotz, S., Kühn, I. & Durka, W. (2002): BIOLFLOR - Eine Datenbank zu biologisch-oekologischen Merkmalen der Gefaesspflanzen in Deutschland. - Schriftenreihe fuer Vegetationskunde 38. Bonn: Bundesamt fuer Naturschutz.
cat: Orange flower
cat: Purple flower
cat: Yellow flower
cat: Green flower

Blue flower
type: Class
type: NamedIndividual
type: Concept
related match: PATO_0000318
related match: PO_0009046
pref unit: unitless (category)
in scheme: Thesaurustrait
related match: PATO_0000014
term status: stable
formal name: flower blue
definition: the color (PATO:color) of the flower or flowers (PO:flower) is blue (PATO:blue)
reference: Klotz, S., Kühn, I. & Durka, W. (2002): BIOLFLOR - Eine Datenbank zu biologisch-oekologischen Merkmalen der Gefaesspflanzen in Deutschland. - Schriftenreihe fuer Vegetationskunde 38. Bonn: Bundesamt fuer Naturschutz.

Brown flower
type: Class
type: NamedIndividual
type: Concept
related match: PATO_0000952
related match: PO_0009046
reference: Klotz, S., Kühn, I. & Durka, W. (2002): BIOLFLOR - Eine Datenbank zu biologisch-oekologischen Merkmalen der Gefaesspflanzen in Deutschland. - Schriftenreihe fuer Vegetationskunde 38. Bonn: Bundesamt fuer Naturschutz.
related match: PATO_0000014
term status: stable
definition: the color (PATO:color) of the flower or flowers (PO:flower) is brown (PATO:brown)
in scheme: Thesaurustrait
pref unit: unitless (category)
formal name: flower brown

Yellow flower
type: Class
type: NamedIndividual
type: Concept
related match: PO_0009046
formal name: flower yellow
reference: Klotz, S., Kühn, I. & Durka, W. (2002): BIOLFLOR - Eine Datenbank zu biologisch-oekologischen Merkmalen der Gefaesspflanzen in Deutschland. - Schriftenreihe fuer Vegetationskunde 38. Bonn: Bundesamt fuer Naturschutz.
pref unit: unitless (category)
term status: stable
in scheme: Thesaurustrait
related match: PATO_0000014
definition: the color (PATO:color) of the flower or flowers (PO:flower) is yellow (PATO:yellow)
related match: PATO_0000324

Green flower
type: Class
type: NamedIndividual
type: Concept
formal name: flower green
related match: PO_0009046
definition: the color (PATO:color) of the flower or flowers (PO:flower) is green (PATO:green)
reference: Klotz, S., Kühn, I. & Durka, W. (2002): BIOLFLOR - Eine Datenbank zu biologisch-oekologischen Merkmalen der Gefaesspflanzen in Deutschland. - Schriftenreihe fuer Vegetationskunde 38. Bonn: Bundesamt fuer Naturschutz.
related match: PATO_0000320
related match: PATO_0000014
term status: stable
in scheme: Thesaurustrait
pref unit: unitless (category)

Orange flower
type: Class
type: NamedIndividual
type: Concept
formal name: flower orange
in scheme: Thesaurustrait
related match: PO_0009046
reference: Klotz, S., Kühn, I. & Durka, W. (2002): BIOLFLOR - Eine Datenbank zu biologisch-oekologischen Merkmalen der Gefaesspflanzen in Deutschland. - Schriftenreihe fuer Vegetationskunde 38. Bonn: Bundesamt fuer Naturschutz.
term status: stable
related match: PATO_0000953
definition: the color (PATO:color) of the flower or flowers (PO:flower) is orange (PATO:orange)
related match: PATO_0000014
pref unit: unitless (category)

Purple flower
type: Class
type: NamedIndividual
type: Concept
term status: stable
in scheme: Thesaurustrait
formal name: flower purple
reference: Klotz, S., Kühn, I. & Durka, W. (2002): BIOLFLOR - Eine Datenbank zu biologisch-oekologischen Merkmalen der Gefaesspflanzen in Deutschland. - Schriftenreihe fuer Vegetationskunde 38. Bonn: Bundesamt fuer Naturschutz.
pref unit: unitless (category)
related match: PO_0009046
related match: PATO_0000951
definition: the color (PATO:color) of the flower or flowers (PO:flower) is purple (PATO:purple)
related match: PATO_0000014

Red flower
type: Class
type: NamedIndividual
type: Concept
related match: PATO_0000014
reference: Klotz, S., Kühn, I. & Durka, W. (2002): BIOLFLOR - Eine Datenbank zu biologisch-oekologischen Merkmalen der Gefaesspflanzen in Deutschland. - Schriftenreihe fuer Vegetationskunde 38. Bonn: Bundesamt fuer Naturschutz.
in scheme: Thesaurustrait
related match: PO_0009046
formal name: flower red
pref unit: unitless (category)
definition: the color (PATO:color) of the flower or flowers (PO:flower) is red (PATO:red)
related match: PATO_0000322
term status: stable

Leaf area
type: Class
subclass of: Leaf area trait
type: NamedIndividual
type: Concept
alternative label: area of a leaf
related match: PATO_0001323
reference: Eric Garnier, Jens Kattge, Stefan Klotz, Ingolf Kühn, Ulrike Stahl
related match: PO_0025034
pref unit: area unit
term status: stable
formal name: leaf area
in scheme: Thesaurustrait
definition: the area (PATO:area) of a leaf (PO:leaf) in the one sided projection
abbreviation: LA

Magenta flower
type: Class
type: NamedIndividual
type: Concept
formal name: flower magenta
related match: PATO_0000014
related match: PATO_0000321
term status: stable
definition: the color (PATO:color) of the flower or flowers (PO:flower) is magenta (PATO:magenta)
related match: PO_0009046
pref unit: unitless (category)
in scheme: Thesaurustrait
reference: Eric Garnier, Jens Kattge, Stefan Klotz, Ingolf Kühn, Ulrike Stahl

Various colored flower
type: Class
type: NamedIndividual
type: Concept
reference: Klotz, S., Kühn, I. & Durka, W. (2002): BIOLFLOR - Eine Datenbank zu biologisch-oekologischen Merkmalen der Gefaesspflanzen in Deutschland. - Schriftenreihe fuer Vegetationskunde 38. Bonn: Bundesamt fuer Naturschutz.
related match: PATO_0000014
term status: stable
formal name: flower various colored
related match: PO_0009046
pref unit: unitless (category)
definition: the color (PATO:color) of the flower or flowers (PO:flower) of a whole plant (PO:whole plant) is variously
related match: PO_0000003
in scheme: Thesaurustrait

Violet flower
type: Class
type: NamedIndividual
type: Concept
reference: Klotz, S., Kühn, I. & Durka, W. (2002): BIOLFLOR - Eine Datenbank zu biologisch-oekologischen Merkmalen der Gefaesspflanzen in Deutschland. - Schriftenreihe fuer Vegetationskunde 38. Bonn: Bundesamt fuer Naturschutz.
related match: PO_0009046
term status: stable
pref unit: unitless (category)
in scheme: Thesaurustrait
formal name: flower violet
related match: PATO_0000014
definition: the color (PATO:color) of the flower or flowers (PO:flower) is violet (PATO:violet)
related match: PATO_0001424

White flower
type: Class
type: NamedIndividual
type: Concept
definition: the color (PATO:color) of the flower or flowers (PO:flower) is white (PATO:white)
related match: PO_0009046
related match: PATO_0000323
term status: stable
formal name: flower white
related match: PATO_0000014
reference: Klotz, S., Kühn, I. & Durka, W. (2002): BIOLFLOR - Eine Datenbank zu biologisch-oekologischen Merkmalen der Gefaesspflanzen in Deutschland. - Schriftenreihe fuer Vegetationskunde 38. Bonn: Bundesamt fuer Naturschutz.
pref unit: unitless (category)
in scheme: Thesaurustrait

Leaf life span
type: Class
subclass of: Leaf trait
type: NamedIndividual
type: Concept
formal name: leaf life span
definition: the life span (PATO:life span) of a leaf (PO:leaf)
alternative label: leaf longevity
pref unit: unitless (ordinal, number)
related match: PATO_0000050
in scheme: Thesaurustrait
term status: stable
related match: PO_0025034
reference: Eric Garnier, Jens Kattge, Stefan Klotz, Ingolf Kühn, Ulrike Stahl

Plant life span
type: Class
subclass of: Whole plant trait
type: NamedIndividual
type: Concept
related match: PATO_0000050
in scheme: Thesaurustrait
alternative label: plant longevity
term status: stable
reference: Eric Garnier, Jens Kattge, Stefan Klotz, Ingolf Kühn, Ulrike Stahl
pref unit: unitless (ordinal, number)
related match: PO_0000003
definition: the life span (PATO:life span) of a whole plant (PO:whole plant)
formal name: whole plant life span

Plant species floristic zone
type: Class
subclass of: Floristic zone
type: NamedIndividual
type: Concept
reference: Jaeger, E. J.& Werner K. (2002): Rothmaler, Exkursionsflora von Deutschland. Gefaesspflanzen: Kritischer Band, Berlin, Spectrum, 948 pages
cat: Arctic species
cat: Meridional species
cat: Submeridional species
cat: Temperate species
cat: Boreal species
cat: Antarctic species
cat: Austral species
cat: Tropical species
cat: Subtropical species
formal name: plant species floristic zone
definition: a feature of the plant species (Mayr:species) characterizing the floristic zone or multiple zones at which the individuals occur. Floristic zones are the characteristic sequences of plant assemblages from the poles to the equator in relation to climatic factors.
pref unit: unitless (ordinal)
in scheme: Thesaurustrait
term status: stable

Leaf lamina area
type: Class
subclass of: Leaf area trait
type: NamedIndividual
type: Concept
alternative label: leaf size
pref unit: area unit
definition: the area (PATO:area) of the leaf lamina (PO:leaf lamina) in the one sided projection
related match: PATO_0001323
term status: stable
related match: PO_0020039
reference: Eric Garnier, Jens Kattge, Stefan Klotz, Ingolf Kühn, Ulrike Stahl
in scheme: Thesaurustrait
formal name: leaf lamina area

Plant population floristic zone
type: Class
subclass of: Floristic zone
type: NamedIndividual
type: Concept
in scheme: Thesaurustrait
cat: Arctic population
term status: stable
formal name: plant population floristic zone
cat: Temperate population
cat: Boreal population
cat: Meridional population
definition: the feature of the plant population (EFO:plant population) characterizing the floristic zone or multiple zones at which the individuals may occur. Floristic zones are the characteristic sequences of plant assemblages from the poles to the equator due to climatic factors.
cat: Submeridional population
reference: Jaeger, E. J.& Werner K. (2002): Rothmaler, Exkursionsflora von Deutschland. Gefaesspflanzen: Kritischer Band, Berlin, Spectrum, 948 pages
cat: Tropical population
cat: Subtropical population
cat: Antarctic population
cat: Austral population
related match: Efo plant population
pref unit: unitless (ordinal)

Leaflet area
type: Class
subclass of: Leaf area trait
type: NamedIndividual
type: Concept
pref unit: area unit
formal name: leaflet area
definition: the area (PATO:area) of a leaflet (PO:leaflet) in the one sided projection
term status: stable
related match: PO_0020049
related match: PATO_0001323
in scheme: Thesaurustrait
alternative label: leaflet size
reference: Eric Garnier, Jens Kattge, Stefan Klotz, Ingolf Kühn, Ulrike Stahl

Leaflet lamina area
type: Class
subclass of: Leaf area trait
type: NamedIndividual
type: Concept
alternative label: leaflet size
pref unit: area unit
related match: PO_0020049
term status: stable
related match: PO_0020039
reference: Eric Garnier, Jens Kattge, Stefan Klotz, Ingolf Kühn, Ulrike Stahl
related match: PATO_0001323
in scheme: Thesaurustrait
definition: the area (PATO:area) of the leaflet lamina (PO:leaflet, PO:leaf lamina) in the one sided projection
formal name: leaflet lamina area

Bark density
type: Class
subclass of: Stem and branch trait
type: NamedIndividual
type: Concept
alternative label: bark specific gravity
pref unit: mass unit / volume unit
related match: PATO_0000918
definition: the ratio of the mass (PATO:mass) of a unit bark (PO:bark) of the stem (PO:stem) assessed after drying to its volume (PATO:volume) being fresh, i.e. sampled without loosing water
reference: Eric Garnier, Jens Kattge, Stefan Klotz, Ingolf Kühn, Ulrike Stahl
in scheme: Thesaurustrait
term status: stable
related match: PO_0009047
formal name: stem bark dry mass per stem bark fresh volume
related match: PATO_0000125
related match: PO_0004518

Bark thickness
type: Class
subclass of: Stem and branch trait
type: NamedIndividual
type: Concept
related match: PO_0004518
in scheme: Thesaurustrait
formal name: stem bark thickness
alternative label: bark width
pref unit: length unit
related match: PATO_0000915
related match: PO_0009047
reference: Eric Garnier, Jens Kattge, Stefan Klotz, Ingolf Kühn, Ulrike Stahl
definition: the thickness (PATO:thickness) of the bark (PO:bark) of the stem (PO:stem)
term status: stable

Wood density
type: Class
subclass of: Stem and branch trait
type: NamedIndividual
type: Concept
in scheme: Thesaurustrait
related match: PATO_0000918
pref unit: mass unit / volume unit
related match: PO_0009047
definition: the ratio of the mass (PATO:mass) of a unit wood (PO:secondary xylem) of the stem (PO:stem) assessed after drying to its volume (PATO:volume) assessed without drying.
formal name: stem wood density
term status: stable
related match: PO_0005848
related match: PATO_0000125
reference: Eric Garnier, Jens Kattge, Stefan Klotz, Ingolf Kühn, Ulrike Stahl
alternative label: wood specific gravity

Wood specific gravity
type: Class
subclass of: Stem and branch trait
type: NamedIndividual
type: Concept
related match: PATO_0000918
in scheme: Thesaurustrait
term status: stable
definition: the ratio of the mass (PATO:mass) of a unit wood (PO:secondary xylem) of the stem (PO:stem) assessed after drying to its volume (PATO:volume) and water density
related match: PO_0009047
related match: PATO_0000125
related match: PO_0005848
formal name: stem wood dry mass per stem wood volume per water density
pref unit: mass unit / volume unit * volume unit / mass unit
alternative label: wood density
reference: Williamson, G. B., & Wiemann, M. C. (2010). Measuring wood specific gravity� correctly. American Journal of Botany, 97(3), 519-524.

Stem specific density
type: Class
subclass of: Stem and branch trait
type: NamedIndividual
type: Concept
in scheme: Thesaurustrait
term status: stable
abbreviation: SSD
related match: PATO_0000918
pref unit: mass unit / volume unit
reference: after Pérez-Harguindeguy N., Díaz S., Garnier E., Lavorel S., Poorter H., Jaureguiberry P., Bret-Harte M. S., Cornwell W. K., Craine J. M., Gurvich D. E., Urcelay C., Veneklaas E. J., Reich P. B., Poorter L., Wright I. J., Ray P., Enrico L., Pausas J. G., de Vos A. C., Buchmann N., Funes G., Quétier F., Hodgson J. G., Thompson K., Morgan H. D., ter Steege H., van der Heijden M. G. A., Sack L., Blonder B., Poschlod P., Vaieretti M. V., Conti G., Staver A. C., Aquino S., Cornelissen J. H. C. (2013) New handbook for standardised measurement of plant functional traits worldwide. Australian Journal of Botany 61, 167_234
related match: PO_0009047
definition: the ratio of the mass (PATO:mass) of the stem (PO:stem) or an unit thereof assessed after drying to its volume (PATO:volume) assessed without drying
related match: PATO_0000125
alternative label: wood density
alternative label: wood specific gravity
formal name: stem dry mass per stem fresh volume

Leaf volume trait
type: Class
subclass of: Leaf trait
type: NamedIndividual
type: Concept
pref unit: volume unit
definition: the volume (PATO:volume) of a leaf (PO:leaf) or component thereof, i.e. leaf lamina or leaflet (PO:leaf lamina, PO:leaflet)
formal name: leaf volume trait
related match: PO_0020049
term status: stable
related match: PO_0020039
related match: PO_0025034
reference: Eric Garnier, Jens Kattge, Stefan Klotz, Ingolf Kühn, Ulrike Stahl
related match: PATO_0000918
in scheme: Thesaurustrait

Plant flowering duration trait
type: Class
subclass of: Flower and dispersule trait
type: NamedIndividual
type: Concept
related match: PO_0009046
pref unit: time unit
alternative label: time of flowering
formal name: plant flowering duration
reference: Klotz, S., Kühn, I. & Durka, W. (2002): BIOLFLOR - Eine Datenbank zu biologisch-oekologischen Merkmalen der Gefaesspflanzen in Deutschland. - Schriftenreihe fuer Vegetationskunde 38. Bonn: Bundesamt fuer Naturschutz
definition: a feature of the whole plant (PO:whole plant) or the plant population (EFO:plant population) characterizing the time span when the flowers (PO:flower) of the plant or the plant population are open
related match: Efo plant population
alternative label: flowering phenology
related match: PO_0000003
in scheme: Thesaurustrait
term status: stable

Plant flowering begin trait
type: Class
subclass of: Flower and dispersule trait
type: NamedIndividual
type: Concept
formal name: plant flowering begin
related match: PO_0009046
pref unit: time unit
reference: Klotz, S., Kühn, I. & Durka, W. (2002): BIOLFLOR - Eine Datenbank zu biologisch-oekologischen Merkmalen der Gefaesspflanzen in Deutschland. - Schriftenreihe fuer Vegetationskunde 38. Bonn: Bundesamt fuer Naturschutz
related match: Efo plant population
in scheme: Thesaurustrait
definition: a feature of the whole plant (PO:whole plant) or the plant population (EFO:plant population) characterizing the initial time point when the flowers (PO:flower) of the plant or the plant population are open
related match: PO_0000003
alternative label: flowering phenology
term status: stable

Plant flowering end trait
type: Class
subclass of: Flower and dispersule trait
type: NamedIndividual
type: Concept
related match: PO_0007024
pref unit: time unit
related match: PO_0000003
reference: Klotz, S., Kühn, I. & Durka, W. (2002): BIOLFLOR - Eine Datenbank zu biologisch-oekologischen Merkmalen der Gefaesspflanzen in Deutschland. - Schriftenreihe fuer Vegetationskunde 38. Bonn: Bundesamt fuer Naturschutz
related match: Efo plant population
in scheme: Thesaurustrait
definition: a feature of the whole plant (PO:whole plant) or the plant population (EFO:plant population) characterizing the time point when the plant or the plant population completed flowering (PO:FL.04 end of flowering stage)
alternative label: flowering phenology
term status: stable
formal name: plant flowering end

Plant flowering phases number trait
type: Class
subclass of: Flower and dispersule trait
type: NamedIndividual
type: Concept
related match: PO_0000003
reference: Klotz, S., Kühn, I. & Durka, W. (2002): BIOLFLOR - Eine Datenbank zu biologisch-oekologischen Merkmalen der Gefaesspflanzen in Deutschland. - Schriftenreihe fuer Vegetationskunde 38. Bonn: Bundesamt fuer Naturschutz
related match: Efo plant population
in scheme: Thesaurustrait
formal name: plant flowering phases number
pref unit: unitless (number)
definition: a feature of the whole plant (PO:whole plant) or the plant population (EFO:plant population) characterizing how often the plant or the plant population flowers within the growing season
term status: stable

Plant dicliny type
type: Class
subclass of: Flower and dispersule trait
type: NamedIndividual
type: Concept
formal name: whole plant dicliny type
cat: Gynodioecious plant
cat: Andromonoecious plant
reference: Klotz, S., Kühn, I. & Durka, W. (2002): BIOLFLOR - Eine Datenbank zu biologisch-oekologischen Merkmalen der Gefaesspflanzen in Deutschland. - Schriftenreihe fuer Vegetationskunde 38. Bonn: Bundesamt fuer Naturschutz
cat: Dioecious plant
cat: Gynomonoecious plant
definition: a feature of the whole plant (PO:whole plant) defining the spatial separation of sexes on one or several flowers (PO:flower) and/or individual plants.
cat: Hermaphroditic plant
cat: Monoecious plant
related match: PO_0000003
cat: Trimonoecious plant
in scheme: Thesaurustrait
cat: Male steril plant
cat: Androdioecious plant
cat: Trioecious plant
related match: PO_0009046
term status: stable
pref unit: unitless (nominal)

Hermaphroditic plant
type: Class
type: NamedIndividual
type: Concept
related match: PO_0000003
term status: stable
in scheme: Thesaurustrait
formal name: whole plant hermaphroditic
reference: Klotz, S., Kühn, I. & Durka, W. (2002): BIOLFLOR - Eine Datenbank zu biologisch-oekologischen Merkmalen der Gefaesspflanzen in Deutschland. - Schriftenreihe fuer Vegetationskunde 38. Bonn: Bundesamt fuer Naturschutz
pref unit: unitless (category)
related match: PO_0009046
definition: plants (PO:whole plant) which are hermaphroditic, i.e. all flowers (PO:flower) are bisexual

Monoecious plant
type: Class
type: NamedIndividual
type: Concept
in scheme: Thesaurustrait
term status: stable
related match: PO_0000003
definition: plants (PO:whole plant) which are monoecious, i.e. male and femal flowers (PO:flower) are on the same plant individual
formal name: whole plant monoecious
pref unit: unitless (category)
related match: PO_0009046
reference: Klotz, S., Kühn, I. & Durka, W. (2002): BIOLFLOR - Eine Datenbank zu biologisch-oekologischen Merkmalen der Gefaesspflanzen in Deutschland. - Schriftenreihe fuer Vegetationskunde 38. Bonn: Bundesamt fuer Naturschutz

Dioecious plant
type: Class
type: NamedIndividual
type: Concept
definition: plants (PO:whole plant) which are dioecious, i.e. male and femal flowers (PO:flower) are on different plant individuals
term status: stable
related match: PO_0000003
in scheme: Thesaurustrait
related match: PO_0009046
pref unit: unitless (category)
reference: Klotz, S., Kühn, I. & Durka, W. (2002): BIOLFLOR - Eine Datenbank zu biologisch-oekologischen Merkmalen der Gefaesspflanzen in Deutschland. - Schriftenreihe fuer Vegetationskunde 38. Bonn: Bundesamt fuer Naturschutz
formal name: whole plant dioecious

Gynomonoecious plant
type: Class
type: NamedIndividual
type: Concept
term status: stable
formal name: whole plant gynomonoecious
pref unit: unitless (category)
definition: plants (PO:whole plant) which are gynomonoecious, i.e. femal and bisexual flowers (PO:flower) are on the same plant individual
related match: PO_0000003
in scheme: Thesaurustrait
reference: Klotz, S., Kühn, I. & Durka, W. (2002): BIOLFLOR - Eine Datenbank zu biologisch-oekologischen Merkmalen der Gefaesspflanzen in Deutschland. - Schriftenreihe fuer Vegetationskunde 38. Bonn: Bundesamt fuer Naturschutz
related match: PO_0009046

Whole plant trait
type: Class
subclass of: Plant trait
type: NamedIndividual
type: Concept
term status: testing
reference: Eric Garnier, Jens Kattge, Stefan Klotz, Ingolf Kühn, Ulrike Stahl
in scheme: Thesaurustrait
definition: a plant trait (TOP:plant trait) referring to the whole plant (PO:whole plant)

Leaf volume
type: Class
subclass of: Leaf volume trait
type: NamedIndividual
type: Concept
pref unit: volume unit
definition: the volume (PATO:volume) of a leaf (PO:leaf)
formal name: leaf volume
term status: stable
in scheme: Thesaurustrait
reference: Eric Garnier, Jens Kattge, Stefan Klotz, Ingolf Kühn, Ulrike Stahl
alternative label: volume of a leaf
related match: PO_0025034
related match: PATO_0000918

Gynodioecious plant
type: Class
type: NamedIndividual
type: Concept
pref unit: unitless (category)
definition: plants (PO:whole plant) which are gynodioecious, i.e. within one plant population (EFO:plant population) female and bisexual flowers (PO:flower) are on different plant individuals or plant individuals have either female flowers or are monoecious (TOP:monoecious plant)
reference: Klotz, S., Kühn, I. & Durka, W. (2002): BIOLFLOR - Eine Datenbank zu biologisch-oekologischen Merkmalen der Gefaesspflanzen in Deutschland. - Schriftenreihe fuer Vegetationskunde 38. Bonn: Bundesamt fuer Naturschutz
in scheme: Thesaurustrait
related match: PO_0000003
term status: stable
related match: Efo plant population
related match: PO_0009046
formal name: whole plant gynodioecious

Andromonoecious plant
type: Class
type: NamedIndividual
type: Concept
reference: Klotz, S., Kühn, I. & Durka, W. (2002): BIOLFLOR - Eine Datenbank zu biologisch-oekologischen Merkmalen der Gefaesspflanzen in Deutschland. - Schriftenreihe fuer Vegetationskunde 38. Bonn: Bundesamt fuer Naturschutz
pref unit: unitless (category)
related match: PO_0000003
in scheme: Thesaurustrait
definition: plants (PO:whole plant) which are andromonoecious, i.e. male and bisexual flowers (PO:flower) are on the same plant individual
term status: stable
related match: PO_0009046
formal name: whole plant andromonoecious

Androdioecious plant
type: Class
type: NamedIndividual
type: Concept
related match: PO_0009046
definition: plants (PO:whole plant) which are androdioecious, i.e. within one plant population (EFO:plant population) male and bisexual flowers (PO:flower) are on different plant individuals or plant individuals have either male flowers or are monoecious (TOP:monoecious plant)
pref unit: unitless (category)
reference: Klotz, S., Kühn, I. & Durka, W. (2002): BIOLFLOR - Eine Datenbank zu biologisch-oekologischen Merkmalen der Gefaesspflanzen in Deutschland. - Schriftenreihe fuer Vegetationskunde 38. Bonn: Bundesamt fuer Naturschutz
related match: PO_0000003
in scheme: Thesaurustrait
related match: Efo plant population
formal name: whole plant androdioecious
term status: stable

Trioecious plant
type: Class
type: NamedIndividual
type: Concept
related match: PO_0000003
definition: plants (PO:whole plant) which are trioecious, i.e. female, male, bisexual flowers (PO:flower) are on different plant individuals or plant individuals are monoecious (TOP:monoecious plant) or andomonoecious (TOP:andromonoecious plant)
pref unit: unitless (category)
in scheme: Thesaurustrait
formal name: whole plant trioecious
term status: stable
reference: Klotz, S., Kühn, I. & Durka, W. (2002): BIOLFLOR - Eine Datenbank zu biologisch-oekologischen Merkmalen der Gefaesspflanzen in Deutschland. - Schriftenreihe fuer Vegetationskunde 38. Bonn: Bundesamt fuer Naturschutz
related match: PO_0009046

Trimonoecious plant
type: Class
type: NamedIndividual
type: Concept
definition: plants (PO:whole plant) which are trimonoecious, i.e. bisexual, female and male flowers (PO:flowers) are on the same plant individual
formal name: whole plant trimonoecious
pref unit: unitless (category)
term status: stable
in scheme: Thesaurustrait
related match: PO_0000003
reference: Klotz, S., Kühn, I. & Durka, W. (2002): BIOLFLOR - Eine Datenbank zu biologisch-oekologischen Merkmalen der Gefaesspflanzen in Deutschland. - Schriftenreihe fuer Vegetationskunde 38. Bonn: Bundesamt fuer Naturschutz
related match: PO_0009046

Male steril plant
type: Class
type: NamedIndividual
type: Concept
related match: PO_0000003
definition: plants (PO:whole plant) which are male steril, i.e. have only female flowers (PO:flower)
term status: stable
in scheme: Thesaurustrait
pref unit: unitless (category)
formal name: whole plant male steril
related match: PO_0009046
reference: Klotz, S., Kühn, I. & Durka, W. (2002): BIOLFLOR - Eine Datenbank zu biologisch-oekologischen Merkmalen der Gefaesspflanzen in Deutschland. - Schriftenreihe fuer Vegetationskunde 38. Bonn: Bundesamt fuer Naturschutz

Plant self incompatibility type
type: Class
subclass of: Whole plant trait
type: NamedIndividual
type: Concept
cat: Self incompatible plant
definition: a feature of the whole plant (PO:whole plant) defining the self-incompatibility with respect to seed (PO:seed) setting
pref unit: unitless (nominal)
formal name: whole plant self incompatibility type
related match: PO_0009010
cat: Self compatible plant
related match: PO_0000003
cat: Mostly self compatible plant
cat: Mostly self incompatible plant
in scheme: Thesaurustrait
term status: stable
reference: Klotz, S., Kühn, I. & Durka, W. (2002): BIOLFLOR - Eine Datenbank zu biologisch-oekologischen Merkmalen der Gefaesspflanzen in Deutschland. - Schriftenreihe fuer Vegetationskunde 38. Bonn: Bundesamt fuer Naturschutz

Self compatible plant
type: Class
type: NamedIndividual
type: Concept
term status: stable
in scheme: Thesaurustrait
related match: PO_0000003
definition: plants (PO:whole plant) for which selfing leads to seed (PO:seed) set
formal name: whole plant self compatible
pref unit: unitless (category)
related match: PO_0009010
reference: Klotz, S., Kühn, I. & Durka, W. (2002): BIOLFLOR - Eine Datenbank zu biologisch-oekologischen Merkmalen der Gefaesspflanzen in Deutschland. - Schriftenreihe fuer Vegetationskunde 38. Bonn: Bundesamt fuer Naturschutz

Mostly self compatible plant
type: Class
type: NamedIndividual
type: Concept
definition: plants (PO:whole plant) for which selfing mostly leads to seed (PO:seed) set
related match: PO_0000003
in scheme: Thesaurustrait
term status: stable
pref unit: unitless (category)
reference: Klotz, S., Kühn, I. & Durka, W. (2002): BIOLFLOR - Eine Datenbank zu biologisch-oekologischen Merkmalen der Gefaesspflanzen in Deutschland. - Schriftenreihe fuer Vegetationskunde 38. Bonn: Bundesamt fuer Naturschutz
formal name: whole plant mostly self compatible
related match: PO_0009010

Mostly self incompatible plant
type: Class
type: NamedIndividual
type: Concept
in scheme: Thesaurustrait
pref unit: unitless (category)
term status: stable
formal name: whole plant mostly self incompatible
related match: PO_0000003
reference: Klotz, S., Kühn, I. & Durka, W. (2002): BIOLFLOR - Eine Datenbank zu biologisch-oekologischen Merkmalen der Gefaesspflanzen in Deutschland. - Schriftenreihe fuer Vegetationskunde 38. Bonn: Bundesamt fuer Naturschutz
definition: plants (PO:whole plant) for which selfing is mostly prohibited

Leaf lamina volume
type: Class
subclass of: Leaf volume trait
type: NamedIndividual
type: Concept
related match: PO_0020039
pref unit: volume unit
formal name: leaf lamina volume
term status: stable
reference: Eric Garnier, Jens Kattge, Stefan Klotz, Ingolf Kühn, Ulrike Stahl
in scheme: Thesaurustrait
definition: the volume (PATO:volume) of the leaf lamina (PO:leaf lamina)
related match: PATO_0000918

Self incompatible plant
type: Class
type: NamedIndividual
type: Concept
term status: stable
pref unit: unitless (category)
related match: PO_0000003
in scheme: Thesaurustrait
formal name: whole plant self incompatible
definition: plants (PO:whole plant) for which selfing and seed (PO:seed) set is impossible due to genetically or physiological determined mechanisms
related match: PO_0009010
reference: Klotz, S., Kühn, I. & Durka, W. (2002): BIOLFLOR - Eine Datenbank zu biologisch-oekologischen Merkmalen der Gefaesspflanzen in Deutschland. - Schriftenreihe fuer Vegetationskunde 38. Bonn: Bundesamt fuer Naturschutz

Plant self incompatibility mechanism
type: Class
subclass of: Whole plant trait
type: NamedIndividual
type: Concept
definition: a feature of the whole plant (PO:whole plant) defining genetic and/or physiological mechanisms of the self-incompatibility of the plant (TOP:self incompatible)
reference: Klotz, S., Kühn, I. & Durka, W. (2002): BIOLFLOR - Eine Datenbank zu biologisch-oekologischen Merkmalen der Gefaesspflanzen in Deutschland. - Schriftenreihe fuer Vegetationskunde 38. Bonn: Bundesamt fuer Naturschutz
cat: Sporophytic self incompatible plant
pref unit: unitless (nominal)
cat: Gametophytic self incompatible plant
cat: Gametophytic sporophytic incompatible plant
cat: Heteromorphic self incompatible plant
term status: stable
in scheme: Thesaurustrait
related match: PO_0000003
formal name: whole plant self incompatibility mechanism
cat: Postcygotic self incompatible plant
cat: Plant has lethal alleles
cat: Plant has inbreeding depression
cat: Cryptic self incompatible plant

Sporophytic self incompatible plant
type: Class
type: NamedIndividual
type: Concept
reference: Klotz, S., Kühn, I. & Durka, W. (2002): BIOLFLOR - Eine Datenbank zu biologisch-oekologischen Merkmalen der Gefaesspflanzen in Deutschland. - Schriftenreihe fuer Vegetationskunde 38. Bonn: Bundesamt fuer Naturschutz
related match: PO_0025281
definition: plants (PO:whole plant) whose pollen (PO:pollen) germination is prevented on stigma (PO:stigma) surface, if one of the parental alleles (SO:allele) are matched by alleles expressed in stigma
pref unit: unitless (category)
related match: SO_0001023
in scheme: Thesaurustrait
related match: PO_0000003
related match: PO_0009073
term status: stable
formal name: whole plant sporophytic self incompatible

Gametophytic self incompatible plant
type: Class
type: NamedIndividual
type: Concept
reference: Klotz, S., Kühn, I. & Durka, W. (2002): BIOLFLOR - Eine Datenbank zu biologisch-oekologischen Merkmalen der Gefaesspflanzen in Deutschland. - Schriftenreihe fuer Vegetationskunde 38. Bonn: Bundesamt fuer Naturschutz
related match: PO_0025281
pref unit: unitless (category)
related match: PO_0000003
in scheme: Thesaurustrait
related match: PATO_0001375
definition: plants (PO:whole plant) whose pollen (PO:pollen) germinate on stigma (PO:stigma), but pollen tube growth (PO:pollen tube cell) stops if the allele (SO:allele) expressed in haploid (PATO:haploid) pollen is matched by alleles expressed in stigma
related match: SO_0001023
related match: PO_0009073
term status: stable
formal name: whole plant gametophytic self incompatible

Gametophytic sporophytic incompatible plant
type: Class
type: NamedIndividual
type: Concept
related match: PO_0000003
definition: plants (PO:whole plant) which are a combination of sporophytically (TOP:sporophytic self incompatible plant) and gametophytically (TOP:gametophytic self incompatible plant) controlled self-incompatibility
pref unit: unitless (category)
in scheme: Thesaurustrait
term status: stable
formal name: whole plant gametophytic sporophytic incompatible
reference: Klotz, S., Kühn, I. & Durka, W. (2002): BIOLFLOR - Eine Datenbank zu biologisch-oekologischen Merkmalen der Gefaesspflanzen in Deutschland. - Schriftenreihe fuer Vegetationskunde 38. Bonn: Bundesamt fuer Naturschutz

Heteromorphic self incompatible plant
type: Class
type: NamedIndividual
type: Concept
related match: PO_0000003
pref unit: unitless (category)
term status: stable
in scheme: Thesaurustrait
definition: plants (PO:whole plant) whose self-incompatibility system is genetically linked with heterostyly (TOP:heterostyly type) and is often a diallelic sporophytic system
formal name: whole plant heteromorphic self incompatible
reference: Klotz, S., Kühn, I. & Durka, W. (2002): BIOLFLOR - Eine Datenbank zu biologisch-oekologischen Merkmalen der Gefaesspflanzen in Deutschland. - Schriftenreihe fuer Vegetationskunde 38. Bonn: Bundesamt fuer Naturschutz

Postcygotic self incompatible plant
type: Class
type: NamedIndividual
type: Concept
related match: PO_0000003
related match: PO_0000423
pref unit: unitless (category)
term status: stable
formal name: whole plant postcygotic self incompatible
related match: PO_0009009
in scheme: Thesaurustrait
definition: plants (PO:whole plant) whose self-incompatibility reactions act either shortly before fertilization (GO:fertilization) or after fertilization in the development of the zygote (PO:plant zygote), the embryo (PO:plant embryo) or the endosperm (PO:endosperm)
reference: Klotz, S., Kühn, I. & Durka, W. (2002): BIOLFLOR - Eine Datenbank zu biologisch-oekologischen Merkmalen der Gefaesspflanzen in Deutschland. - Schriftenreihe fuer Vegetationskunde 38. Bonn: Bundesamt fuer Naturschutz
related match: GO_0009566
related match: PO_0009089

Plant has lethal alleles
type: Class
type: NamedIndividual
type: Concept
related match: PO_0000003
in scheme: Thesaurustrait
pref unit: unitless (category)
related match: SO_0001023
related match: PO_0009009
formal name: whole plant lethal alleles
term status: stable
definition: plants (PO:whole plant) which have a large number of lethal alleles (SO:allele) leading to near total mortality of self-fertilized embryos (PO:plant embryo)
reference: Klotz, S., Kühn, I. & Durka, W. (2002): BIOLFLOR - Eine Datenbank zu biologisch-oekologischen Merkmalen der Gefaesspflanzen in Deutschland. - Schriftenreihe fuer Vegetationskunde 38. Bonn: Bundesamt fuer Naturschutz

Plant has inbreeding depression
type: Class
type: NamedIndividual
type: Concept
related match: PO_0000003
in scheme: Thesaurustrait
term status: stable
related match: SO_0001023
reference: Klotz, S., Kühn, I. & Durka, W. (2002): BIOLFLOR - Eine Datenbank zu biologisch-oekologischen Merkmalen der Gefaesspflanzen in Deutschland. - Schriftenreihe fuer Vegetationskunde 38. Bonn: Bundesamt fuer Naturschutz
pref unit: unitless (category)
definition: plants (PO:whole plant) which have expressed deleterious alleles (SO:allele) after selfing leading to increased mortality during seed (PO:seed) development, germination and juvenile growth
formal name: whole plant inbreeding depression
related match: PO_0009010

Cryptic self incompatible plant
type: Class
type: NamedIndividual
type: Concept
in scheme: Thesaurustrait
term status: stable
related match: PO_0000003
related match: PO_0025281
pref unit: unitless (category)
reference: Klotz, S., Kühn, I. & Durka, W. (2002): BIOLFLOR - Eine Datenbank zu biologisch-oekologischen Merkmalen der Gefaesspflanzen in Deutschland. - Schriftenreihe fuer Vegetationskunde 38. Bonn: Bundesamt fuer Naturschutz
formal name: whole plant cryptic self incompatible
definition: plants (PO:whole plant) whose outcross pollen (PO:pollen) has faster pollen tube (PO:pollen tube cell) growth and higher probability to sire offspring than self pollen

Leaflet volume
type: Class
subclass of: Leaf volume trait
type: NamedIndividual
type: Concept
in scheme: Thesaurustrait
term status: stable
related match: PO_0020049
pref unit: volume unit
formal name: leaflet volume
reference: Eric Garnier, Jens Kattge, Stefan Klotz, Ingolf Kühn, Ulrike Stahl
related match: PATO_0000918
definition: the volume (PATO:volume) of a leaflet (PO:leaflet)

Flower heterostyly type
type: Class
subclass of: Flower and dispersule trait
type: NamedIndividual
type: Concept
in scheme: Thesaurustrait
term status: stable
formal name: flower heterostyly type
cat: Tristylous flower
cat: Heterostylous flower
cat: Homostylous flower
cat: Distylous flower
definition: a feature of the flower (PO:flower) characterizing the formations of styles (PO:style) and filaments (PO:filament) with different length (PATO:length) occurring on different plant individuals of a plant species (Mayr:species)
pref unit: unitless (nominal)
related match: PO_0009067
related match: PO_0009046
related match: PO_0009074
related match: PATO_0000122
reference: Klotz, S., Kühn, I. & Durka, W. (2002): BIOLFLOR - Eine Datenbank zu biologisch-oekologischen Merkmalen der Gefaesspflanzen in Deutschland. - Schriftenreihe fuer Vegetationskunde 38. Bonn: Bundesamt fuer Naturschutz

Homostylous flower
type: Class
type: NamedIndividual
type: Concept
term status: stable
in scheme: Thesaurustrait
related match: PO_0009074
pref unit: unitless (category)
related match: PO_0009046
formal name: flower homostylous
definition: the flowers (PO:flower) of all individuals of a plant species (Mayr:species) are characterized by only one type of style (PO:style) and filament (PO:filament)
reference: Klotz, S., Kühn, I. & Durka, W. (2002): BIOLFLOR - Eine Datenbank zu biologisch-oekologischen Merkmalen der Gefaesspflanzen in Deutschland. - Schriftenreihe fuer Vegetationskunde 38. Bonn: Bundesamt fuer Naturschutz
related match: PO_0009067

Distylous flower
type: Class
type: NamedIndividual
type: Concept
definition: the flowers (PO:flower) of individuals of a plant species (Mayr:species) are characterized by two different types, one is long styled (PO:style) with short filaments (PO:filament) and the other one is short styled with long filaments
term status: stable
in scheme: Thesaurustrait
formal name: flower distylous
pref unit: unitless (category)
related match: PO_0009074
reference: Klotz, S., Kühn, I. & Durka, W. (2002): BIOLFLOR - Eine Datenbank zu biologisch-oekologischen Merkmalen der Gefaesspflanzen in Deutschland. - Schriftenreihe fuer Vegetationskunde 38. Bonn: Bundesamt fuer Naturschutz
related match: PO_0009046
related match: PO_0009067

Tristylous flower
type: Class
type: NamedIndividual
type: Concept
pref unit: unitless (category)
term status: stable
in scheme: Thesaurustrait
formal name: flower tristylous
definition: the flowers (PO:flower) of individuals of a plant species (Mayr:species) are characterized by three different types, the first one is short styled (PO:style) with long and medium filaments (PO:filament), the second one is medium styled with long and short filaments and the last one is short styled with long and medium filaments
related match: PO_0009074
related match: PO_0009046
related match: PO_0009067
reference: Klotz, S., Kühn, I. & Durka, W. (2002): BIOLFLOR - Eine Datenbank zu biologisch-oekologischen Merkmalen der Gefaesspflanzen in Deutschland. - Schriftenreihe fuer Vegetationskunde 38. Bonn: Bundesamt fuer Naturschutz

Heterostylous flower
type: Class
type: NamedIndividual
type: Concept
formal name: flower heterostylous
pref unit: unitless (category)
term status: stable
related match: PO_0009074
in scheme: Thesaurustrait
related match: PO_0009067
definition: the flowers (PO:flower) of individuals of a plant species (Mayr:species) are characterized by varying length of styles (PO:style) and filaments (PO:filament)
related match: PO_0009046
reference: Klotz, S., Kühn, I. & Durka, W. (2002): BIOLFLOR - Eine Datenbank zu biologisch-oekologischen Merkmalen der Gefaesspflanzen in Deutschland. - Schriftenreihe fuer Vegetationskunde 38. Bonn: Bundesamt fuer Naturschutz

Plant dichogamy type
type: Class
subclass of: Flower and dispersule trait
type: NamedIndividual
type: Concept
cat: Protandrous plant
cat: Pronounced protandrous plant
related match: PO_0009046
formal name: whole plant dichogamy type
pref unit: unitless (nominal)
term status: stable
cat: Slightly protandrous plant
definition: a feature of the whole plant (PO:whole plant) defining the temporal separation of sexes realized by the flowers (PO:flower)
cat: Slightly protogynous plant
cat: Homogamous plant
cat: Pronounced protogynous plant
cat: Protogynous plant
reference: Klotz, S., Kühn, I. & Durka, W. (2002): BIOLFLOR - Eine Datenbank zu biologisch-oekologischen Merkmalen der Gefaesspflanzen in Deutschland. - Schriftenreihe fuer Vegetationskunde 38. Bonn: Bundesamt fuer Naturschutz
related match: PO_0000003
in scheme: Thesaurustrait

Pronounced protogynous plant
type: Class
type: NamedIndividual
type: Concept
related match: PO_0009046
pref unit: unitless (category)
definition: the flowers (PO:flower) of individuals of a plant species (Mayr:species) are at first female and later male with no temporal overlap
term status: stable
in scheme: Thesaurustrait
formal name: whole plant pronounced protogynous
reference: Klotz, S., Kühn, I. & Durka, W. (2002): BIOLFLOR - Eine Datenbank zu biologisch-oekologischen Merkmalen der Gefaesspflanzen in Deutschland. - Schriftenreihe fuer Vegetationskunde 38. Bonn: Bundesamt fuer Naturschutz

Protogynous plant
type: Class
type: NamedIndividual
type: Concept
formal name: whole plant protogynous
pref unit: unitless (category)
related match: PO_0009046
term status: stable
in scheme: Thesaurustrait
definition: the flowers (PO:flower) of individuals of a plant species (Mayr:species) are at first female and later male with unclear temporal overlap
reference: Klotz, S., Kühn, I. & Durka, W. (2002): BIOLFLOR - Eine Datenbank zu biologisch-oekologischen Merkmalen der Gefaesspflanzen in Deutschland. - Schriftenreihe fuer Vegetationskunde 38. Bonn: Bundesamt fuer Naturschutz

Slightly protogynous plant
type: Class
type: NamedIndividual
type: Concept
related match: PO_0009046
pref unit: unitless (category)
term status: stable
formal name: whole plant slightly protogynous
definition: the flowers (PO:flower) of individuals of a plant species (Mayr:species) are at first female and later male with long temporal overlap
in scheme: Thesaurustrait
reference: Klotz, S., Kühn, I. & Durka, W. (2002): BIOLFLOR - Eine Datenbank zu biologisch-oekologischen Merkmalen der Gefaesspflanzen in Deutschland. - Schriftenreihe fuer Vegetationskunde 38. Bonn: Bundesamt fuer Naturschutz

Homogamous plant
type: Class
type: NamedIndividual
type: Concept
formal name: whole plant homogamous
related match: PO_0009046
term status: stable
reference: Klotz, S., Kühn, I. & Durka, W. (2002): BIOLFLOR - Eine Datenbank zu biologisch-oekologischen Merkmalen der Gefaesspflanzen in Deutschland. - Schriftenreihe fuer Vegetationskunde 38. Bonn: Bundesamt fuer Naturschutz
definition: the flowers (PO:flower) of individuals of a plant species (Mayr:species) are female and male at the same time
pref unit: unitless (category)
in scheme: Thesaurustrait

Leaflet lamina volume
type: Class
subclass of: Leaf volume trait
type: NamedIndividual
type: Concept
related match: PO_0020049
term status: stable
in scheme: Thesaurustrait
related match: PATO_0000918
formal name: leaflet lamina volume
related match: PO_0020039
reference: Eric Garnier, Jens Kattge, Stefan Klotz, Ingolf Kühn, Ulrike Stahl
definition: the volume (PATO:volume) of a leaflet lamina (PO:leaflet, PO:leaf lamina)
pref unit: volume unit

Slightly protandrous plant
type: Class
type: NamedIndividual
type: Concept
term status: stable
in scheme: Thesaurustrait
pref unit: unitless (category)
definition: the flowers (PO:flower) of individuals of a plant species (Mayr:species) are at first male and later female with long temporal overlap
related match: PO_0009046
formal name: whole plant slightly protandrous
reference: Klotz, S., Kühn, I. & Durka, W. (2002): BIOLFLOR - Eine Datenbank zu biologisch-oekologischen Merkmalen der Gefaesspflanzen in Deutschland. - Schriftenreihe fuer Vegetationskunde 38. Bonn: Bundesamt fuer Naturschutz

Protandrous plant
type: Class
type: NamedIndividual
type: Concept
in scheme: Thesaurustrait
formal name: whole plant protandrous
definition: the flowers (PO:flower) of individuals of a plant species (Mayr:species) are at first male and later female with temporal overlap unclear
term status: stable
pref unit: unitless (category)
related match: PO_0009046
reference: Klotz, S., Kühn, I. & Durka, W. (2002): BIOLFLOR - Eine Datenbank zu biologisch-oekologischen Merkmalen der Gefaesspflanzen in Deutschland. - Schriftenreihe fuer Vegetationskunde 38. Bonn: Bundesamt fuer Naturschutz

Pronounced protandrous plant
type: Class
type: NamedIndividual
type: Concept
term status: stable
in scheme: Thesaurustrait
formal name: whole plant pronounced protandrous
definition: the flowers (PO:flower) of individuals of a plant species (Mayr:species) are at first male and later female with no temporal overlap
pref unit: unitless (category)
related match: PO_0009046
reference: Klotz, S., Kühn, I. & Durka, W. (2002): BIOLFLOR - Eine Datenbank zu biologisch-oekologischen Merkmalen der Gefaesspflanzen in Deutschland. - Schriftenreihe fuer Vegetationskunde 38. Bonn: Bundesamt fuer Naturschutz

Flower pollination syndrome
type: Class
subclass of: Flower and dispersule trait
type: NamedIndividual
type: Concept
cat: Insect pollinated flower
related match: PO_0025281
reference: Klotz, S., Kühn, I. & Durka, W. (2002): BIOLFLOR - Eine Datenbank zu biologisch-oekologischen Merkmalen der Gefaesspflanzen in Deutschland. - Schriftenreihe fuer Vegetationskunde 38. Bonn: Bundesamt fuer Naturschutz
cat: Pseudocleistogamous flower
cat: Self pollinated flower
cat: Water pollinated flower
in scheme: Thesaurustrait
cat: Wind pollinated flower
cat: Animal pollinated flower
cat: Flower is wind or water pollinated flower
formal name: flower pollination syndrom
pref unit: unitless (nominal)
cat: Slug pollinated flower
cat: Bird pollinated flower
definition: a feature of the flower (PO:flower) defining the mode by which the pollen (PO:pollen) is transfered to pollinate the flowers (PO:flowers)
cat: Bat pollinated flower
term status: stable
related match: PO_0009046
cat: Geitonogamous flower
cat: Cleistogamous flower

Wind pollinated flower
type: Class
type: NamedIndividual
type: Concept
in scheme: Thesaurustrait
pref unit: unitless (category)
term status: stable
definition: flowers (PO:flower) are pollinated by wind
related match: PO_0009046
formal name: flower wind pollinated
reference: Klotz, S., Kühn, I. & Durka, W. (2002): BIOLFLOR - Eine Datenbank zu biologisch-oekologischen Merkmalen der Gefaesspflanzen in Deutschland. - Schriftenreihe fuer Vegetationskunde 38. Bonn: Bundesamt fuer Naturschutz

Water pollinated flower
type: Class
type: NamedIndividual
type: Concept
definition: flowers (PO:flower) are pollinated on or below water
pref unit: unitless (category)
term status: stable
related match: PO_0009046
in scheme: Thesaurustrait
formal name: flower water pollinated
reference: Klotz, S., Kühn, I. & Durka, W. (2002): BIOLFLOR - Eine Datenbank zu biologisch-oekologischen Merkmalen der Gefaesspflanzen in Deutschland. - Schriftenreihe fuer Vegetationskunde 38. Bonn: Bundesamt fuer Naturschutz

Self pollinated flower
type: Class
type: NamedIndividual
type: Concept
definition: flowers (PO:flower) are spontaneous self-pollinated
reference: Klotz, S., Kühn, I. & Durka, W. (2002): BIOLFLOR - Eine Datenbank zu biologisch-oekologischen Merkmalen der Gefaesspflanzen in Deutschland. - Schriftenreihe fuer Vegetationskunde 38. Bonn: Bundesamt fuer Naturschutz
pref unit: unitless (category)
related match: PO_0009046
term status: stable
in scheme: Thesaurustrait
formal name: flower self pollinated

Pseudocleistogamous flower
type: Class
type: NamedIndividual
type: Concept
definition: unopened flowers (PO:flower) are spontaneous self-pollinated
reference: Klotz, S., Kühn, I. & Durka, W. (2002): BIOLFLOR - Eine Datenbank zu biologisch-oekologischen Merkmalen der Gefaesspflanzen in Deutschland. - Schriftenreihe fuer Vegetationskunde 38. Bonn: Bundesamt fuer Naturschutz
formal name: flower pseudocleistogamous
related match: PO_0009046
pref unit: unitless (category)
in scheme: Thesaurustrait
term status: stable

Cleistogamous flower
type: Class
type: NamedIndividual
type: Concept
related match: PO_0009046
reference: Klotz, S., Kühn, I. & Durka, W. (2002): BIOLFLOR - Eine Datenbank zu biologisch-oekologischen Merkmalen der Gefaesspflanzen in Deutschland. - Schriftenreihe fuer Vegetationskunde 38. Bonn: Bundesamt fuer Naturschutz
pref unit: unitless (category)
in scheme: Thesaurustrait
term status: stable
definition: unopened and rudimentary flowers (PO:flower) are spontaneous self-pollinated
formal name: flower cleistogamous

Geitonogamous flower
type: Class
type: NamedIndividual
type: Concept
formal name: flower geitonogamous
related match: PO_0009046
pref unit: unitless (category)
reference: Klotz, S., Kühn, I. & Durka, W. (2002): BIOLFLOR - Eine Datenbank zu biologisch-oekologischen Merkmalen der Gefaesspflanzen in Deutschland. - Schriftenreihe fuer Vegetationskunde 38. Bonn: Bundesamt fuer Naturschutz
definition: flowers (PO:flower) are spontaneous pollinated by a neighbouring flower
term status: stable
in scheme: Thesaurustrait

Leaf fresh mass trait
type: Class
subclass of: Leaf trait
type: NamedIndividual
type: Concept
related match: PO_0025034
related match: PO_0020049
related match: PATO_0000125
related match: PO_0020039
pref unit: mass unit
in scheme: Thesaurustrait
term status: stable
alternative label: leaf fresh weight
definition: the mass (PATO:mass) of a leaf (PO:leaf) or component thereof, i.e. leaf lamina or leaflet (PO:leaf lamina, PO:leaflet) assessed without drying
reference: http://prometheuswiki.publish.csiro.au/tiki-index.php
formal name: leaf fresh mass trait

Insect pollinated flower
type: Class
type: NamedIndividual
type: Concept
related match: PO_0009046
formal name: flower insects pollinated
pref unit: unitless (category)
term status: stable
definition: flowers (PO:flower) are pollinated by insects
in scheme: Thesaurustrait
reference: Klotz, S., Kühn, I. & Durka, W. (2002): BIOLFLOR - Eine Datenbank zu biologisch-oekologischen Merkmalen der Gefaesspflanzen in Deutschland. - Schriftenreihe fuer Vegetationskunde 38. Bonn: Bundesamt fuer Naturschutz

Bat pollinated flower
type: Class
type: NamedIndividual
type: Concept
related match: PO_0009046
definition: flowers (PO:flower) are pollinated by bats
pref unit: unitless (category)
term status: stable
in scheme: Thesaurustrait
formal name: flower bats pollinated
reference: Klotz, S., Kühn, I. & Durka, W. (2002): BIOLFLOR - Eine Datenbank zu biologisch-oekologischen Merkmalen der Gefaesspflanzen in Deutschland. - Schriftenreihe fuer Vegetationskunde 38. Bonn: Bundesamt fuer Naturschutz

Bird pollinated flower
type: Class
type: NamedIndividual
type: Concept
formal name: flower birds pollinated
in scheme: Thesaurustrait
pref unit: unitless (category)
term status: stable
definition: flowers (PO:flower) are pollinated by birds
related match: PO_0009046
reference: Klotz, S., Kühn, I. & Durka, W. (2002): BIOLFLOR - Eine Datenbank zu biologisch-oekologischen Merkmalen der Gefaesspflanzen in Deutschland. - Schriftenreihe fuer Vegetationskunde 38. Bonn: Bundesamt fuer Naturschutz

Slug pollinated flower
type: Class
type: NamedIndividual
type: Concept
in scheme: Thesaurustrait
definition: flowers (PO:flower) are pollinated by slugs
term status: stable
reference: Klotz, S., Kühn, I. & Durka, W. (2002): BIOLFLOR - Eine Datenbank zu biologisch-oekologischen Merkmalen der Gefaesspflanzen in Deutschland. - Schriftenreihe fuer Vegetationskunde 38. Bonn: Bundesamt fuer Naturschutz
pref unit: unitless (category)
related match: PO_0009046
formal name: flower slug pollinated

Flower is wind or water pollinated flower
type: Class
type: NamedIndividual
type: Concept
term status: stable
in scheme: Thesaurustrait
pref unit: unitless (category)
reference: Klotz, S., Kühn, I. & Durka, W. (2002): BIOLFLOR - Eine Datenbank zu biologisch-oekologischen Merkmalen der Gefaesspflanzen in Deutschland. - Schriftenreihe fuer Vegetationskunde 38. Bonn: Bundesamt fuer Naturschutz
formal name: flower wind or water pollinated
related match: PO_0009046
definition: flowers (PO:flower) are pollinated by wind or water

Animal pollinated flower
type: Class
type: NamedIndividual
type: Concept
formal name: flower animals pollinated
term status: stable
in scheme: Thesaurustrait
related match: PO_0009046
definition: flowers (PO:flower) are pollinated by animals
reference: Klotz, S., Kühn, I. & Durka, W. (2002): BIOLFLOR - Eine Datenbank zu biologisch-oekologischen Merkmalen der Gefaesspflanzen in Deutschland. - Schriftenreihe fuer Vegetationskunde 38. Bonn: Bundesamt fuer Naturschutz
pref unit: unitless (category)

Plant dispersal syndrome
type: Class
subclass of: Flower and dispersule trait
type: NamedIndividual
type: Concept
cat: Bristle contraction dispersed plant
cat: Launching dispersed plant
cat: Water dispersed plant
term status: stable
cat: Myrmecochory
cat: Animal hoarding dispersed plant
pref unit: unitless (nominal)
cat: Animal external dispersed plant
formal name: whole plant dispersal syndrome
definition: a feature of the whole plant (PO:whole plant) defining the mode by which the dispersule (Perez:dispersule) is dispersed
cat: Animals internal dispersed plant
cat: Anemochory
cat: Unassisted dispersed plant
reference: Klotz, S., Kühn, I. & Durka, W. (2002): BIOLFLOR - Eine Datenbank zu biologisch-oekologischen Merkmalen der Gefaesspflanzen in Deutschland. - Schriftenreihe fuer Vegetationskunde 38. Bonn: Bundesamt fuer Naturschutz
related match: PO_0000003
in scheme: Thesaurustrait

Unassisted dispersed plant
type: Class
type: NamedIndividual
type: Concept
formal name: dispersule unassisted
reference: Klotz, S., Kühn, I. & Durka, W. (2002): BIOLFLOR - Eine Datenbank zu biologisch-oekologischen Merkmalen der Gefaesspflanzen in Deutschland. - Schriftenreihe fuer Vegetationskunde 38. Bonn: Bundesamt fuer Naturschutz
term status: stable
definition: dispersule (Perez:dispersule) has no obvious aids for longer-distance transport and merely falls passively from the plant
pref unit: unitless (category)
in scheme: Thesaurustrait

Anemochory
type: Class
type: NamedIndividual
type: Concept
pref unit: unitless (category)
reference: Klotz, S., Kühn, I. & Durka, W. (2002): BIOLFLOR - Eine Datenbank zu biologisch-oekologischen Merkmalen der Gefaesspflanzen in Deutschland. - Schriftenreihe fuer Vegetationskunde 38. Bonn: Bundesamt fuer Naturschutz
formal name: dispersule anemochorous
term status: stable
in scheme: Thesaurustrait
definition: dispersule (Perez:dispersule) is dispersed by wind force, flying in the air or rolling on the ground

Animals internal dispersed plant
type: Class
type: NamedIndividual
type: Concept
reference: Klotz, S., Kühn, I. & Durka, W. (2002): BIOLFLOR - Eine Datenbank zu biologisch-oekologischen Merkmalen der Gefaesspflanzen in Deutschland. - Schriftenreihe fuer Vegetationskunde 38. Bonn: Bundesamt fuer Naturschutz
pref unit: unitless (category)
definition: dispersule (Perez:dispersule) is dispersed by animals which had eaten it, thus passing through them before arriving germination places
formal name: dispersule animal internal dispersed
term status: stable
in scheme: Thesaurustrait

Leaf fresh mass
type: Class
subclass of: Leaf fresh mass trait
type: NamedIndividual
type: Concept
related match: PO_0025034
pref unit: mass unit
alternative label: leaf fresh weight
in scheme: Thesaurustrait
related match: PATO_0000125
term status: stable
formal name: leaf fresh mass
reference: http://prometheuswiki.publish.csiro.au/tiki-index.php
definition: the mass (PATO:mass) of a leaf (PO:leaf) assessed without drying

Animal external dispersed plant
type: Class
type: NamedIndividual
type: Concept
reference: Klotz, S., Kühn, I. & Durka, W. (2002): BIOLFLOR - Eine Datenbank zu biologisch-oekologischen Merkmalen der Gefaesspflanzen in Deutschland. - Schriftenreihe fuer Vegetationskunde 38. Bonn: Bundesamt fuer Naturschutz
pref unit: unitless (category)
formal name: dispersule animal external dispersed
term status: stable
definition: dispersule (Perez:dispersule) is dispersed by animals at which they become attached (e.g. by certain appandages)
in scheme: Thesaurustrait

Animal hoarding dispersed plant
type: Class
type: NamedIndividual
type: Concept
pref unit: unitless (category)
term status: stable
in scheme: Thesaurustrait
definition: dispersule (Perez:dispersule) is dispersed by animals which hoard and bury them
formal name: dispersule animal hoarding dispersed
reference: Klotz, S., Kühn, I. & Durka, W. (2002): BIOLFLOR - Eine Datenbank zu biologisch-oekologischen Merkmalen der Gefaesspflanzen in Deutschland. - Schriftenreihe fuer Vegetationskunde 38. Bonn: Bundesamt fuer Naturschutz

Myrmecochory
type: Class
type: NamedIndividual
type: Concept
pref unit: unitless (category)
term status: stable
in scheme: Thesaurustrait
formal name: dispersule myrmecochorous
definition: dispersule (Perez:dispersule) is dispersed by ants or similar insects
reference: Klotz, S., Kühn, I. & Durka, W. (2002): BIOLFLOR - Eine Datenbank zu biologisch-oekologischen Merkmalen der Gefaesspflanzen in Deutschland. - Schriftenreihe fuer Vegetationskunde 38. Bonn: Bundesamt fuer Naturschutz

Water dispersed plant
type: Class
type: NamedIndividual
type: Concept
term status: stable
pref unit: unitless (category)
definition: dispersule (Perez:dispersule) is dispersed by water due to prolonged floating
reference: Klotz, S., Kühn, I. & Durka, W. (2002): BIOLFLOR - Eine Datenbank zu biologisch-oekologischen Merkmalen der Gefaesspflanzen in Deutschland. - Schriftenreihe fuer Vegetationskunde 38. Bonn: Bundesamt fuer Naturschutz
in scheme: Thesaurustrait
formal name: dispersule water dispersed

Launching dispersed plant
type: Class
type: NamedIndividual
type: Concept
term status: stable
formal name: dispersule launching dispersed
reference: Klotz, S., Kühn, I. & Durka, W. (2002): BIOLFLOR - Eine Datenbank zu biologisch-oekologischen Merkmalen der Gefaesspflanzen in Deutschland. - Schriftenreihe fuer Vegetationskunde 38. Bonn: Bundesamt fuer Naturschutz
pref unit: unitless (category)
definition: dispersule (Perez:dispersule) is launched away from the plant by �explosion�
in scheme: Thesaurustrait

Bristle contraction dispersed plant
type: Class
type: NamedIndividual
type: Concept
term status: stable
definition: dispersule (Perez:dispersule) has hygroscopic bristles on promoting movement with varying humidity
reference: Klotz, S., Kühn, I. & Durka, W. (2002): BIOLFLOR - Eine Datenbank zu biologisch-oekologischen Merkmalen der Gefaesspflanzen in Deutschland. - Schriftenreihe fuer Vegetationskunde 38. Bonn: Bundesamt fuer Naturschutz
pref unit: unitless (category)
formal name: dispersule bristle contraction dispersed
in scheme: Thesaurustrait

Plant relative growth rate
type: Class
subclass of: Whole plant trait
type: NamedIndividual
type: Concept
term status: stable
in scheme: Thesaurustrait
reference: Garnier E., Navas M.-L., Grigulis K. (2016) Plant Functional Diversity, Oxford University Press
definition: The absolute growth rate of a whole plant or a part of the plant, expressed relative to a measure of the whole plant or plant part being considered
pref unit: mass unit / mass unit / time unit
abbreviation: RGR
formal name: whole plant relative growth rate

Leaf photosynthetic rate per leaf area
type: Class
subclass of: Leaf trait
type: NamedIndividual
type: Concept
related match: PO_0025034
related match: CHEBI_27594
alternative label: leaf photosynthesis per leaf area
formal name: leaf photosynthetic rate per leaf area
term status: stable
reference: after Pérez-Harguindeguy N., Díaz S., Garnier E., Lavorel S., Poorter H., Jaureguiberry P., Bret-Harte M. S., Cornwell W. K., Craine J. M., Gurvich D. E., Urcelay C., Veneklaas E. J., Reich P. B., Poorter L., Wright I. J., Ray P., Enrico L., Pausas J. G., de Vos A. C., Buchmann N., Funes G., Quétier F., Hodgson J. G., Thompson K., Morgan H. D., ter Steege H., van der Heijden M. G. A., Sack L., Blonder B., Poschlod P., Vaieretti M. V., Conti G., Staver A. C., Aquino S., Cornelissen J. H. C. (2013) New handbook for standardised measurement of plant functional traits worldwide. Australian Journal of Botany 61, 167_234
definition: the amount of carbon (CHEBI:carbon atom) assimilated via photosynthesis by leaves (PO:leaf) per unit leaf area (TOP:leaf area) and unit time
in scheme: Thesaurustrait
pref unit: amount unit / area unit / time unit

Shoot photosynthetic rate per shoot dry mass
type: Class
subclass of: Shoot trait
type: NamedIndividual
type: Concept
related match: PO_0025034
related match: CHEBI_27594
alternative label: shoot photosynthesis per shoot dry mass
in scheme: Thesaurustrait
pref unit: amount unit / mass unit / time unit
related match: PO_0009006
term status: stable
reference: after Pérez-Harguindeguy N., Díaz S., Garnier E., Lavorel S., Poorter H., Jaureguiberry P., Bret-Harte M. S., Cornwell W. K., Craine J. M., Gurvich D. E., Urcelay C., Veneklaas E. J., Reich P. B., Poorter L., Wright I. J., Ray P., Enrico L., Pausas J. G., de Vos A. C., Buchmann N., Funes G., Quétier F., Hodgson J. G., Thompson K., Morgan H. D., ter Steege H., van der Heijden M. G. A., Sack L., Blonder B., Poschlod P., Vaieretti M. V., Conti G., Staver A. C., Aquino S., Cornelissen J. H. C. (2013) New handbook for standardised measurement of plant functional traits worldwide. Australian Journal of Botany 61, 167_234
related match: PO_0009047
definition: the amount of carbon (CHEBI:carbon atom) assimilated via photosynthesis by the shoot (PO:shoot system) including leaves (PO:leaf) and stem (PO:stem) per unit mass (PATO:mass) of the respective shoot system assessed after drying and unit time
formal name: shoot photosynthetic rate per shoot dry mass
related match: PATO_0000125

Leaf photosynthetic rate per leaf dry mass
type: Class
subclass of: Leaf trait
type: NamedIndividual
type: Concept
pref unit: amount unit / mass unit / time unit
related match: CHEBI_27594
related match: PO_0025034
reference: after Pérez-Harguindeguy N., Díaz S., Garnier E., Lavorel S., Poorter H., Jaureguiberry P., Bret-Harte M. S., Cornwell W. K., Craine J. M., Gurvich D. E., Urcelay C., Veneklaas E. J., Reich P. B., Poorter L., Wright I. J., Ray P., Enrico L., Pausas J. G., de Vos A. C., Buchmann N., Funes G., Quétier F., Hodgson J. G., Thompson K., Morgan H. D., ter Steege H., van der Heijden M. G. A., Sack L., Blonder B., Poschlod P., Vaieretti M. V., Conti G., Staver A. C., Aquino S., Cornelissen J. H. C. (2013) New handbook for standardised measurement of plant functional traits worldwide. Australian Journal of Botany 61, 167_234
definition: the amount of carbon (CHEBI:carbon atom) assimilated via photosynthesis by leaves (PO:leaf) per unit leaf dry mass (TOP:leaf dry mass) and unit time
alternative label: leaf photosynthesis per leaf dry mass
in scheme: Thesaurustrait
formal name: leaf photosynthetic rate per leaf dry mass
term status: stable

Leaf lamina fresh mass
type: Class
subclass of: Leaf fresh mass trait
type: NamedIndividual
type: Concept
pref unit: mass unit
term status: stable
related match: PATO_0000125
related match: PO_0020039
formal name: leaf lamina fresh mass
alternative label: leaf lamina fresh weight
definition: the mass (PATO:mass) of the leaf lamina (PO:leaf lamina) assessed without drying
in scheme: Thesaurustrait
reference: http://prometheuswiki.publish.csiro.au/tiki-index.php

Stem photosynthetic rate per stem dry mass
type: Class
subclass of: Stem and branch trait
type: NamedIndividual
type: Concept
related match: CHEBI_27594
pref unit: amount unit / time unit / mass unit
term status: stable
related match: PO_0009047
alternative label: stem photosynthesis per stem dry mass
definition: the amount of carbon (CHEBI:carbon atom) assimilated via photosynthesis by stem tissue (PO:stem) per unit stem dry mass and unit time
reference: after Pérez-Harguindeguy N., Díaz S., Garnier E., Lavorel S., Poorter H., Jaureguiberry P., Bret-Harte M. S., Cornwell W. K., Craine J. M., Gurvich D. E., Urcelay C., Veneklaas E. J., Reich P. B., Poorter L., Wright I. J., Ray P., Enrico L., Pausas J. G., de Vos A. C., Buchmann N., Funes G., Quétier F., Hodgson J. G., Thompson K., Morgan H. D., ter Steege H., van der Heijden M. G. A., Sack L., Blonder B., Poschlod P., Vaieretti M. V., Conti G., Staver A. C., Aquino S., Cornelissen J. H. C. (2013) New handbook for standardised measurement of plant functional traits worldwide. Australian Journal of Botany 61, 167_234
formal name: stem photosynthetic rate per stem dry mass
in scheme: Thesaurustrait

Leaf dark respiration rate per leaf area
type: Class
subclass of: Leaf trait
type: NamedIndividual
type: Concept
formal name: leaf dark respiration rate per leaf area
definition: the amount of carbon (CHEBI:carbon atom) metabolized via maintenance respiration in the dark by leaves (PO:leaf) per unit time and unit leaf area (TOP:leaf area)
related match: CHEBI_27594
term status: stable
related match: PO_0025034
in scheme: Thesaurustrait
pref unit: amount unit / time unit / area unit
abbreviation: R leaf
alternative label: leaf dark respiration per leaf area
reference: Pérez-Harguindeguy N., Díaz S., Garnier E., Lavorel S., Poorter H., Jaureguiberry P., Bret-Harte M. S., Cornwell W. K., Craine J. M., Gurvich D. E., Urcelay C., Veneklaas E. J., Reich P. B., Poorter L., Wright I. J., Ray P., Enrico L., Pausas J. G., de Vos A. C., Buchmann N., Funes G., Quétier F., Hodgson J. G., Thompson K., Morgan H. D., ter Steege H., van der Heijden M. G. A., Sack L., Blonder B., Poschlod P., Vaieretti M. V., Conti G., Staver A. C., Aquino S., Cornelissen J. H. C. (2013) New handbook for standardised measurement of plant functional traits worldwide. Australian Journal of Botany 61, 167_234 (adapted)

Leaf dark respiration rate per leaf dry mass
type: Class
subclass of: Leaf trait
type: NamedIndividual
type: Concept
abbreviation: R leaf
definition: the amount of carbon (CHEBI:carbon atom) metabolized via maintenance respiration in the dark by leaves (PO:leaf) per unit time and unit leaf dry mass (TOP:leaf dry mass)
related match: PO_0025034
pref unit: amount unit / time unit / mass unit
alternative label: leaf dark respiration per leaf dry mass
term status: stable
in scheme: Thesaurustrait
related match: CHEBI_27594
formal name: leaf dark respiration rate per leaf dry mass
reference: Pérez-Harguindeguy N., Díaz S., Garnier E., Lavorel S., Poorter H., Jaureguiberry P., Bret-Harte M. S., Cornwell W. K., Craine J. M., Gurvich D. E., Urcelay C., Veneklaas E. J., Reich P. B., Poorter L., Wright I. J., Ray P., Enrico L., Pausas J. G., de Vos A. C., Buchmann N., Funes G., Quétier F., Hodgson J. G., Thompson K., Morgan H. D., ter Steege H., van der Heijden M. G. A., Sack L., Blonder B., Poschlod P., Vaieretti M. V., Conti G., Staver A. C., Aquino S., Cornelissen J. H. C. (2013) New handbook for standardised measurement of plant functional traits worldwide. Australian Journal of Botany 61, 167_234 (adapted)

Stem respiration rate per stem surface area
type: Class
subclass of: Stem and branch trait
type: NamedIndividual
type: Concept
related match: PO_0009047
pref unit: amount unit / time unit / area unit
definition: the amount of carbon (CHEBI:carbon atom) metabolized via respiration by the stem (PO:stem) per unit time and stem surface area
formal name: stem respiration rate per stem surface area
alternative label: stem respiration per stem area
in scheme: Thesaurustrait
term status: stable
reference: Eric Garnier, Jens Kattge, Stefan Klotz, Ingolf Kühn, Ulrike Stahl
related match: CHEBI_27594

Stem respiration rate per stem dry mass
type: Class
subclass of: Stem and branch trait
type: NamedIndividual
type: Concept
formal name: stem respiration rate per stem dry mass
alternative label: stem respiration per stem dry mass
definition: the amount of carbon (CHEBI:carbon atom) metabolized via respiration by stem (PO:stem) per unit time and stem dry mass
related match: PO_0009047
reference: Eric Garnier, Jens Kattge, Stefan Klotz, Ingolf Kühn, Ulrike Stahl
pref unit: amount unit / time unit /mass unit
term status: stable
related match: CHEBI_27594
in scheme: Thesaurustrait

Root respiration rate per root surface area
type: Class
subclass of: Root trait
type: NamedIndividual
type: Concept
formal name: root respiration rate per root surface area
term status: stable
related match: PO_0009005
alternative label: root respiration per root area
definition: the amount of carbon (CHEBI:carbon atom) metabolized via respiration by the root (PO:root) per unit time and root surface area
related match: CHEBI_27594
reference: Eric Garnier, Jens Kattge, Stefan Klotz, Ingolf Kühn, Ulrike Stahl
pref unit: amount unit / time unit / area unit
in scheme: Thesaurustrait

Root respiration rate per root dry mass
type: Class
subclass of: Root trait
type: NamedIndividual
type: Concept
definition: the amount of carbon (CHEBI:carbon atom) metabolized via respiration by the root (PO:root) per unit time and root dry mass (TOP:root dry mass)
term status: stable
pref unit: amount unit / time unit / mass unit
related match: PO_0009005
alternative label: root respiration per root dry mass
related match: CHEBI_27594
formal name: root respiration rate per root dry mass
reference: Eric Garnier, Jens Kattge, Stefan Klotz, Ingolf Kühn, Ulrike Stahl
in scheme: Thesaurustrait

Stomatal conductance trait
type: Class
subclass of: Leaf trait
type: NamedIndividual
type: Concept
term status: stable
formal name: leaf stomatal conductance per leaf area
definition: conductivity for water vapour or CO2 through the stomata (PO:stomatal complex) of a leaf (PO:leaf) or component thereof, i.e. leaflet or leaf lamina (PO:leaflet, PO:leaf lamina) per respective unit area of the leaf, leaflet or leaf lamina (TOP:leaf area, TOP:leaflet area, TOP:leaf lamina area) and unit time
alternative label: stomatal resistance
related match: PO_0020049
related match: PO_0020039
related match: PO_0025034
related match: PO_0002000
reference: Jens Kattge, Eric Garnier, Ulrike Stahl
in scheme: Thesaurustrait
pref unit: amount unit / area unit / time unit

Stomatal conductance for h2o
type: Class
subclass of: Stomatal conductance trait
type: NamedIndividual
type: Concept
in scheme: Thesaurustrait
term status: stable
alternative label: stomatal resistance
related match: PO_0020049
definition: conductivity for water vapour through the stomata (PO:stomatal complex) of a leaf (PO:leaf) or component thereof, i.e. leaflet or leaf lamina (PO:leaflet, PO:leaf lamina) per respective unit area of the leaf, leaflet or leaf lamina (TOP:leaf area, TOP:leaflet area, TOP:leaf lamina area) and unit time
related match: PO_0025034
related match: PO_0020039
formal name: leaf stomatal conductance for H2O per leaf area
reference: Jens Kattge, Eric Garnier, Ulrike Stahl
pref unit: amount unit / area unit / time unit
related match: PO_0002000

Stomatal conductance for co2
type: Class
subclass of: Stomatal conductance trait
type: NamedIndividual
type: Concept
in scheme: Thesaurustrait
term status: stable
definition: conductivity for CO2 through the stomata (PO:stomatal complex) of a leaf (PO:leaf) or component thereof, i.e. leaflet or leaf lamina (PO:leaflet, PO:leaf lamina) per respective unit area of the leaf, leaflet or leaf lamina (TOP:leaf area, TOP:leaflet area, TOP:leaf lamina area) and unit time
alternative label: stomatal resistance
related match: PO_0020039
related match: PO_0025034
related match: PO_0020049
reference: Jens Kattge, Eric Garnier, Ulrike Stahl
pref unit: amount unit / area unit / time unit
formal name: leaf stomatal conductance for CO2 per leaf area
related match: PO_0002000

Leaflet fresh mass
type: Class
subclass of: Leaf fresh mass trait
type: NamedIndividual
type: Concept
reference: http://prometheuswiki.publish.csiro.au/tiki-index.php
alternative label: leaflet fresh weight
formal name: leaflet fresh mass
pref unit: mass unit
related match: PO_0020049
term status: stable
related match: PATO_0000125
in scheme: Thesaurustrait
definition: the mass (PATO:mass) of a leaflet (PO:leaflet) assessed without drying

Stomata density trait
type: Class
subclass of: Leaf trait
type: NamedIndividual
type: Concept
related match: PATO_0001323
term status: stable
in scheme: Thesaurustrait
pref unit: amount unit / area unit
definition: the number of stomata (PO:stomatal complex) per unit area (PATO:area) of a leaf (PO:leaf) or component thereof, i.e. leaflet or leaf lamina (PO:leaflet, PO:leaf lamina)
related match: PO_0002000
formal name: stomata density
reference: http://prometheuswiki.publish.csiro.au/tiki-index.php
related match: PO_0020039
related match: PO_0020049
related match: PO_0025034

Stomata density abaxial
type: Class
subclass of: Stomata density trait
type: NamedIndividual
type: Concept
definition: the number of stomata (PO:stomatal complex) per unit area (PATO:area) of a leaf (PO:leaf) or component thereof, i.e. leaflet or leaf lamina (PO:leaflet, PO:leaf lamina), which is abaxial (PATO:abaxial to) to the stem (PO:stem)
related match: PATO_0001323
pref unit: amount unit / area unit
related match: PO_0009047
term status: stable
related match: PO_0002000
in scheme: Thesaurustrait
formal name: stomata density abaxial
reference: http://prometheuswiki.publish.csiro.au/tiki-index.php
related match: PO_0025034
related match: PO_0020039
related match: PO_0020049
related match: PATO_0002046

Stomata density adaxial
type: Class
subclass of: Stomata density trait
type: NamedIndividual
type: Concept
related match: PATO_0001323
pref unit: amount unit / area unit
term status: stable
related match: PO_0009047
related match: Pato adaxial to
formal name: stomata density adaxial
in scheme: Thesaurustrait
related match: PO_0002000
reference: http://prometheuswiki.publish.csiro.au/tiki-index.php
related match: PO_0025034
related match: PO_0020049
related match: PO_0020039
definition: the number of stomata (PO:stomatal complex) per unit area (PATO:area) of a leaf (PO:leaf) or component thereof, i.e. leaflet or leaf lamina (PO:leaflet, PO:leaf lamina), which is adaxial (PATO:adaxial to) to the stem (PO:stem)

Bark aluminium content per bark dry mass
type: Class
subclass of: Stem and branch trait
type: NamedIndividual
type: Concept
pref unit: mass unit / mass unit or amount unit / mass unit or amount unit / mass unit
related match: CHEBI_28984
term status: stable
reference: Eric Garnier, Jens Kattge, Stefan Klotz, Ingolf Kühn, Ulrike Stahl
in scheme: Thesaurustrait
formal name: bark aluminium content per bark dry mass
alternative label: bark Al content per dry mass
related match: PO_0004518
related match: PATO_0000125
definition: The ratio of the quantity (SEP:quantity) of aluminium (CHEBI:aluminium atom) in the bark (PO:bark) to the corresponding bark (PO:bark) mass (PATO:mass) assessed after drying
related match: SEP_00055

Bark boron content per bark dry mass
type: Class
subclass of: Stem and branch trait
type: NamedIndividual
type: Concept
term status: stable
in scheme: Thesaurustrait
reference: Eric Garnier, Jens Kattge, Stefan Klotz, Ingolf Kühn, Ulrike Stahl
related match: CHEBI_27560
pref unit: mass unit / mass unit or amount unit / mass unit
related match: PATO_0000125
related match: PO_0004518
alternative label: bark B content per dry mass
definition: The ratio of the quantity (SEP:quantity) of boron (CHEBI:boron atom) in the bark (PO:bark) to the corresponding bark (PO:bark) mass (PATO:mass) assessed after drying
related match: SEP_00055
formal name: bark boron content per bark dry mass

Bark calcium content per bark dry mass
type: Class
subclass of: Stem and branch trait
type: NamedIndividual
type: Concept
formal name: bark calcium content per bark dry mass
alternative label: bark Ca content per dry mass
in scheme: Thesaurustrait
pref unit: mass unit / mass unit or amount unit / mass unit
term status: stable
related match: CHEBI_22984
reference: Eric Garnier, Jens Kattge, Stefan Klotz, Ingolf Kühn, Ulrike Stahl
related match: PATO_0000125
related match: PO_0004518
definition: The ratio of the quantity (SEP:quantity) of calcium (CHEBI:calcium atom) in the bark (PO:bark) to the corresponding bark (PO:bark) mass (PATO:mass) assessed after drying
related match: SEP_00055

Bark carbon content per bark dry mass
type: Class
subclass of: Stem and branch trait
type: NamedIndividual
type: Concept
alternative label: bark C content per dry mass
pref unit: mass unit / mass unit or amount unit / mass unit
reference: Eric Garnier, Jens Kattge, Stefan Klotz, Ingolf Kühn, Ulrike Stahl
term status: stable
definition: The ratio of the quantity (SEP:quantity) of carbon (CHEBI:carbon atom) in the bark (PO:bark) to the corresponding bark (PO:bark) mass (PATO:mass) assessed after drying
in scheme: Thesaurustrait
formal name: bark carbon content per bark dry mass
related match: PO_0004518
related match: CHEBI_27594
related match: PATO_0000125
related match: SEP_00055

Bark chlorine content per bark dry mass
type: Class
subclass of: Stem and branch trait
type: NamedIndividual
type: Concept
pref unit: mass unit / mass unit or amount unit / mass unit
related match: CHEBI_23116
term status: stable
in scheme: Thesaurustrait
reference: Eric Garnier, Jens Kattge, Stefan Klotz, Ingolf Kühn, Ulrike Stahl
definition: The ratio of the quantity (SEP:quantity) of chlorine (CHEBI:chlorine atom) in the bark (PO:bark) to the corresponding bark (PO:bark) mass (PATO:mass) assessed after drying
related match: PO_0004518
alternative label: bark Cl content per dry mass
formal name: bark chlorine content per bark dry mass
related match: PATO_0000125
related match: SEP_00055

Bark cobalt content per bark dry mass
type: Class
subclass of: Stem and branch trait
type: NamedIndividual
type: Concept
pref unit: mass unit / mass unit or amount unit / mass unit
term status: stable
related match: CHEBI_27638
in scheme: Thesaurustrait
reference: Eric Garnier, Jens Kattge, Stefan Klotz, Ingolf Kühn, Ulrike Stahl
related match: PO_0004518
alternative label: bark Co content per dry mass
definition: The ratio of the quantity (SEP:quantity) of cobalt (CHEBI:cobalt atom) in the bark (PO:bark) to the corresponding bark (PO:bark) mass (PATO:mass) assessed after drying
formal name: bark cobalt content per bark dry mass
related match: SEP_00055
related match: PATO_0000125

Bark copper content per bark dry mass
type: Class
subclass of: Stem and branch trait
type: NamedIndividual
type: Concept
definition: The ratio of the quantity (SEP:quantity) of copper (CHEBI:copper atom) in the bark (PO:bark) to the corresponding bark (PO:bark) mass (PATO:mass) assessed after drying
pref unit: mass unit / mass unit or amount unit / mass unit
reference: Eric Garnier, Jens Kattge, Stefan Klotz, Ingolf Kühn, Ulrike Stahl
term status: stable
related match: PO_0004518
in scheme: Thesaurustrait
related match: CHEBI_28694
formal name: bark copper content per bark dry mass
related match: SEP_00055
alternative label: bark Cu content per dry mass
related match: PATO_0000125

Leaflet lamina fresh mass
type: Class
subclass of: Leaf fresh mass trait
type: NamedIndividual
type: Concept
reference: http://prometheuswiki.publish.csiro.au/tiki-index.php
formal name: leaflet lamina fresh mass
related match: PO_0020049
related match: PATO_0000125
related match: PO_0020039
alternative label: leaflet lamina fresh weight
term status: stable
in scheme: Thesaurustrait
pref unit: mass unit
definition: the mass (PATO:mass) of a leaflet lamina (PO:leaflet, PO:leaf lamina) assessed without drying

Bark iron content per bark dry mass
type: Class
subclass of: Stem and branch trait
type: NamedIndividual
type: Concept
pref unit: mass unit / mass unit or amount unit / mass unit
related match: PATO_0000125
related match: SEP_00055
related match: PO_0004518
alternative label: bark Fe content per dry mass
term status: stable
definition: The ratio of the quantity (SEP:quantity) of iron (CHEBI:iron atom) in the bark (PO:bark) to the corresponding bark (PO:bark) mass (PATO:mass) assessed after drying
formal name: bark iron content per bark dry mass
reference: Eric Garnier, Jens Kattge, Stefan Klotz, Ingolf Kühn, Ulrike Stahl
in scheme: Thesaurustrait
related match: CHEBI_18248

Bark magnesium content per bark dry mass
type: Class
subclass of: Stem and branch trait
type: NamedIndividual
type: Concept
related match: PATO_0000125
pref unit: mass unit / mass unit or amount unit / mass unit
related match: SEP_00055
in scheme: Thesaurustrait
term status: stable
definition: The ratio of the quantity (SEP:quantity) of magnesium (CHEBI:magnesium atom) in the bark (PO:bark) to the corresponding bark (PO:bark) mass (PATO:mass) assessed after drying
related match: PO_0004518
related match: CHEBI_25107
formal name: bark magnesium content per bark dry mass
alternative label: bark Mg content per dry mass
reference: Eric Garnier, Jens Kattge, Stefan Klotz, Ingolf Kühn, Ulrike Stahl

Bark manganese content per bark dry mass
type: Class
subclass of: Stem and branch trait
type: NamedIndividual
type: Concept
pref unit: mass unit / mass unit or amount unit / mass unit
related match: PATO_0000125
formal name: bark manganese content per bark dry mass
definition: The ratio of the quantity (SEP:quantity) of manganese (CHEBI:manganese atom) in the bark (PO:bark) to the corresponding bark (PO:bark) mass (PATO:mass) assessed after drying
related match: SEP_00055
related match: CHEBI_18291
term status: stable
related match: PO_0004518
alternative label: bark Mn content per dry mass
reference: Eric Garnier, Jens Kattge, Stefan Klotz, Ingolf Kühn, Ulrike Stahl
in scheme: Thesaurustrait

Bark molybdenum content per bark dry mass
type: Class
subclass of: Stem and branch trait
type: NamedIndividual
type: Concept
related match: SEP_00055
pref unit: mass unit / mass unit or amount unit / mass unit
formal name: bark molybdenum content per bark dry mass
related match: PATO_0000125
related match: CHEBI_28685
definition: The ratio of the quantity (SEP:quantity) of molybdenum (CHEBI:molybdenum atom) in the bark (PO:bark) to the corresponding bark (PO:bark) mass (PATO:mass) assessed after drying
term status: stable
related match: PO_0004518
alternative label: bark Mo content per dry mass
in scheme: Thesaurustrait
reference: Eric Garnier, Jens Kattge, Stefan Klotz, Ingolf Kühn, Ulrike Stahl

Bark sodium content per bark dry mass
type: Class
subclass of: Stem and branch trait
type: NamedIndividual
type: Concept
definition: The ratio of the quantity (SEP:quantity) of sodium (CHEBI:sodium atom) in the bark (PO:bark) to the corresponding bark (PO:bark) mass (PATO:mass) assessed after drying
pref unit: mass unit / mass unit or amount unit / mass unit
alternative label: bark Na content per dry mass
related match: PO_0004518
related match: CHEBI_26708
related match: PATO_0000125
related match: SEP_00055
formal name: bark sodium content per bark dry mass
term status: stable
in scheme: Thesaurustrait
reference: Eric Garnier, Jens Kattge, Stefan Klotz, Ingolf Kühn, Ulrike Stahl

Bark nickel content per bark dry mass
type: Class
subclass of: Stem and branch trait
type: NamedIndividual
type: Concept
definition: The ratio of the quantity (SEP:quantity) of nickel (CHEBI:nickel atom) in the bark (PO:bark) to the corresponding bark (PO:bark) mass (PATO:mass) assessed after drying
pref unit: mass unit / mass unit or amount unit / mass unit
formal name: bark nickel content per bark dry mass
related match: PO_0004518
related match: PATO_0000125
related match: SEP_00055
related match: CHEBI_28112
alternative label: bark Ni content per dry mass
term status: stable
reference: Eric Garnier, Jens Kattge, Stefan Klotz, Ingolf Kühn, Ulrike Stahl
in scheme: Thesaurustrait

Bark nitrogen content per bark dry mass
type: Class
subclass of: Stem and branch trait
type: NamedIndividual
type: Concept
definition: The ratio of the quantity (SEP:quantity) of nitrogen (CHEBI:nitrogen atom) in the bark (PO:bark) to the corresponding bark (PO:bark) mass (PATO:mass) assessed after drying
pref unit: mass unit / mass unit or amount unit / mass unit
related match: PATO_0000125
related match: PO_0004518
related match: SEP_00055
related match: CHEBI_25555
formal name: bark nitrogen content per bark dry mass
term status: stable
in scheme: Thesaurustrait
alternative label: bark N content per dry mass
reference: Eric Garnier, Jens Kattge, Stefan Klotz, Ingolf Kühn, Ulrike Stahl

Bark phosphorus content per bark dry mass
type: Class
subclass of: Stem and branch trait
type: NamedIndividual
type: Concept
pref unit: mass unit / mass unit or amount unit / mass unit
related match: PO_0004518
formal name: bark phosphorus content per bark dry mass
definition: The ratio of the quantity (SEP:quantity) of phosphorus (CHEBI:phosphorus atom) in the bark (PO:bark) to the corresponding bark (PO:bark) mass (PATO:mass) assessed after drying
related match: CHEBI_28659
related match: SEP_00055
related match: PATO_0000125
in scheme: Thesaurustrait
term status: stable
reference: Eric Garnier, Jens Kattge, Stefan Klotz, Ingolf Kühn, Ulrike Stahl
alternative label: bark P content per dry mass

Bark potassium content per bark dry mass
type: Class
subclass of: Stem and branch trait
type: NamedIndividual
type: Concept
related match: SEP_00055
pref unit: mass unit / mass unit or amount unit / mass unit
related match: PO_0004518
related match: PATO_0000125
related match: CHEBI_26216
definition: The ratio of the quantity (SEP:quantity) of potassium (CHEBI:potassium atom) in the bark (PO:bark) to the corresponding bark (PO:bark) mass (PATO:mass) assessed after drying
alternative label: bark K content per dry mass
reference: Eric Garnier, Jens Kattge, Stefan Klotz, Ingolf Kühn, Ulrike Stahl
formal name: bark potassium content per bark dry mass
in scheme: Thesaurustrait
term status: stable

Bark silicon content per bark dry mass
type: Class
subclass of: Stem and branch trait
type: NamedIndividual
type: Concept
related match: SEP_00055
related match: PATO_0000125
related match: PO_0004518
definition: The ratio of the quantity (SEP:quantity) of silicon (CHEBI:silicon atom) in the bark (PO:bark) to the corresponding bark (PO:bark) mass (PATO:mass) assessed after drying
formal name: bark silicon content per bark dry mass
alternative label: bark Si content per dry mass
pref unit: mass unit / mass unit or amount unit / mass unit
related match: CHEBI_27573
reference: Eric Garnier, Jens Kattge, Stefan Klotz, Ingolf Kühn, Ulrike Stahl
in scheme: Thesaurustrait
term status: stable

Leaf dry mass trait
type: Class
subclass of: Leaf trait
type: NamedIndividual
type: Concept
formal name: leaf dry mass trait
related match: PO_0025034
pref unit: mass unit
related match: PATO_0000125
definition: the mass (PATO:mass) of a leaf (PO:leaf) or component thereof, i.e. leaf lamina or leaflet (PO:leaf lamina, PO:leaflet) assessed after drying
related match: PO_0020039
related match: PO_0020049
reference: Eric Garnier, Jens Kattge, Stefan Klotz, Ingolf Kühn, Ulrike Stahl
in scheme: Thesaurustrait
term status: stable
alternative label: leaf dry weight

Bark sulfur content per bark dry mass
type: Class
subclass of: Stem and branch trait
type: NamedIndividual
type: Concept
alternative label: bark S content per dry mass
term status: stable
related match: CHEBI_26833
related match: PO_0004518
definition: The ratio of the quantity (SEP:quantity) of sulfur (CHEBI:sulfur atom) in the bark (PO:bark) to the corresponding bark (PO:bark) mass (PATO:mass) assessed after drying
reference: Eric Garnier, Jens Kattge, Stefan Klotz, Ingolf Kühn, Ulrike Stahl
in scheme: Thesaurustrait
pref unit: mass unit / mass unit or amount unit / mass unit
related match: SEP_00055
formal name: bark sulfur content per bark dry mass
related match: PATO_0000125

Bark zinc content per bark dry mass
type: Class
subclass of: Stem and branch trait
type: NamedIndividual
type: Concept
related match: PO_0004518
term status: stable
formal name: bark zinc content per bark dry mass
in scheme: Thesaurustrait
reference: Eric Garnier, Jens Kattge, Stefan Klotz, Ingolf Kühn, Ulrike Stahl
alternative label: bark Zn content per dry mass
pref unit: mass unit / mass unit or amount unit / mass unit
related match: CHEBI_27363
related match: PATO_0000125
related match: SEP_00055
definition: The ratio of the quantity (SEP:quantity) of zinc (CHEBI:zinc atom) in the bark (PO:bark) to the corresponding bark (PO:bark) mass (PATO:mass) assessed after drying

Coarse root aluminium content per coarse root dry mass
type: Class
subclass of: Root aluminum content per root dry mass trait
type: NamedIndividual
type: Concept
alternative label: coarse root Al content per dry mass
related match: PATO_0000125
related match: CHEBI_28984
definition: The ratio of the quantity (SEP:quantity) of aluminium (CHEBI:aluminium atom) in the coarse root (Def:coarse root) to the corresponding coarse root mass (PATO:mass) assessed after drying
term status: stable
pref unit: mass unit / mass unit or amount unit / mass unit
reference: Eric Garnier, Jens Kattge, Stefan Klotz, Ingolf Kühn, Ulrike Stahl
formal name: coarse root aluminium content per coarse root dry mass
in scheme: Thesaurustrait
related match: SEP_00055

Coarse root boron content per coarse root dry mass
type: Class
subclass of: Root boron content per root dry mass trait
type: NamedIndividual
type: Concept
term status: stable
in scheme: Thesaurustrait
related match: PATO_0000125
alternative label: coarse root B content per dry mass
related match: CHEBI_27560
formal name: coarse root boron content per coarse root dry mass
pref unit: mass unit / mass unit or amount unit / mass unit
reference: Eric Garnier, Jens Kattge, Stefan Klotz, Ingolf Kühn, Ulrike Stahl
definition: The ratio of the quantity (SEP:quantity) of boron (CHEBI:boron atom) in the coarse root (Def:coarse root) to the corresponding coarse root mass (PATO:mass) assessed after drying
related match: SEP_00055

Coarse root calcium content per coarse root dry mass
type: Class
subclass of: Root calcium content per root dry mass trait
type: NamedIndividual
type: Concept
pref unit: mass unit / mass unit or amount unit / mass unit
in scheme: Thesaurustrait
reference: Eric Garnier, Jens Kattge, Stefan Klotz, Ingolf Kühn, Ulrike Stahl
term status: stable
related match: CHEBI_22984
alternative label: coarse root Ca content per dry mass
definition: The ratio of the quantity (SEP:quantity) of calcium (CHEBI:calcium atom) in the coarse root (Def:coarse root) to the corresponding coarse root mass (PATO:mass) assessed after drying
related match: SEP_00055
related match: PATO_0000125
formal name: coarse root calcium content per coarse root dry mass

Coarse root carbon content per coarse root dry mass
type: Class
subclass of: Root carbon content per root dry mass trait
type: NamedIndividual
type: Concept
related match: SEP_00055
related match: CHEBI_27594
reference: Eric Garnier, Jens Kattge, Stefan Klotz, Ingolf Kühn, Ulrike Stahl
formal name: coarse root carbon content per coarse root dry mass
alternative label: coarse root C content per dry mass
pref unit: mass unit / mass unit or amount unit / mass unit
in scheme: Thesaurustrait
term status: stable
definition: The ratio of the quantity (SEP:quantity) of carbon (CHEBI:carbon atom) in the coarse root (Def:coarse root) to the corresponding coarse root mass (PATO:mass) assessed after drying
related match: PATO_0000125

Coarse root chlorine content per coarse root dry mass
type: Class
subclass of: Root chlorine content per root dry mass trait
type: NamedIndividual
type: Concept
related match: SEP_00055
reference: Eric Garnier, Jens Kattge, Stefan Klotz, Ingolf Kühn, Ulrike Stahl
alternative label: coarse root Cl content per dry mass
related match: CHEBI_23116
pref unit: mass unit / mass unit or amount unit / mass unit
definition: The ratio of the quantity (SEP:quantity) of chlorine (CHEBI:chlorine atom) in the coarse root (Def:coarse root) to the corresponding coarse root mass (PATO:mass) assessed after drying
formal name: coarse root chlorine content per coarse root dry mass
term status: stable
in scheme: Thesaurustrait
related match: PATO_0000125

Coarse root cobalt content per coarse root dry mass
type: Class
subclass of: Root cobalt content per root dry mass trait
type: NamedIndividual
type: Concept
related match: CHEBI_27638
definition: The ratio of the quantity (SEP:quantity) of cobalt (CHEBI:cobalt atom) in the coarse root (Def:coarse root) to the corresponding coarse root mass (PATO:mass) assessed after drying
pref unit: mass unit / mass unit or amount unit / mass unit
formal name: coarse root cobalt content per coarse root dry mass
alternative label: coarse root Co content per dry mass
in scheme: Thesaurustrait
reference: Eric Garnier, Jens Kattge, Stefan Klotz, Ingolf Kühn, Ulrike Stahl
related match: SEP_00055
term status: stable
related match: PATO_0000125

Coarse root copper content per coarse root dry mass
type: Class
subclass of: Root copper content per root dry mass trait
type: NamedIndividual
type: Concept
formal name: coarse root copper content per coarse root dry mass
definition: The ratio of the quantity (SEP:quantity) of copper (CHEBI:copper atom) in the coarse root (Def:coarse root) to the corresponding coarse root mass (PATO:mass) assessed after drying
related match: CHEBI_28694
alternative label: coarse root Cu content per dry mass
related match: PATO_0000125
pref unit: mass unit / mass unit or amount unit / mass unit
in scheme: Thesaurustrait
reference: Eric Garnier, Jens Kattge, Stefan Klotz, Ingolf Kühn, Ulrike Stahl
related match: SEP_00055
term status: stable

Coarse root iron content per coarse root dry mass
type: Class
subclass of: Root iron content per root dry mass trait
type: NamedIndividual
type: Concept
formal name: coarse root iron content per coarse root dry mass
related match: CHEBI_18248
definition: The ratio of the quantity (SEP:quantity) of iron (CHEBI:iron atom) in the coarse root (Def:coarse root) to the corresponding coarse root mass (PATO:mass) assessed after drying
pref unit: mass unit / mass unit or amount unit / mass unit
in scheme: Thesaurustrait
related match: PATO_0000125
related match: SEP_00055
reference: Eric Garnier, Jens Kattge, Stefan Klotz, Ingolf Kühn, Ulrike Stahl
alternative label: coarse root Fe content per dry mass
term status: stable

Root trait
type: Class
subclass of: Plant trait
type: NamedIndividual
type: Concept
definition: a plant trait (TOP:plant trait) referring to the root system (PO:root system)
term status: testing
reference: Eric Garnier, Jens Kattge, Stefan Klotz, Ingolf Kühn, Ulrike Stahl
in scheme: Thesaurustrait

Leaf dry mass
type: Class
subclass of: Leaf dry mass trait
type: NamedIndividual
type: Concept
formal name: leaf dry mass
related match: PATO_0000125
term status: stable
reference: Eric Garnier, Jens Kattge, Stefan Klotz, Ingolf Kühn, Ulrike Stahl
in scheme: Thesaurustrait
pref unit: mass unit
related match: PO_0025034
definition: the mass (PATO:mass) of a leaf (PO:leaf) assessed after drying
alternative label: leaf dry weight

Coarse root magnesium content per coarse root dry mass
type: Class
subclass of: Root magnesium content per root dry mass trait
type: NamedIndividual
type: Concept
pref unit: mass unit / mass unit or amount unit / mass unit
formal name: coarse root magnesium content per coarse root dry mass
related match: SEP_00055
reference: Eric Garnier, Jens Kattge, Stefan Klotz, Ingolf Kühn, Ulrike Stahl
in scheme: Thesaurustrait
related match: PATO_0000125
related match: CHEBI_25107
term status: stable
alternative label: coarse root Mg content per dry mass
definition: The ratio of the quantity (SEP:quantity) of magnesium (CHEBI:magnesium atom) in the coarse root (Def:coarse root) to the corresponding coarse root mass (PATO:mass) assessed after drying

Coarse root manganese content per coarse root dry mass
type: Class
subclass of: Root manganese content per root dry mass trait
type: NamedIndividual
type: Concept
formal name: coarse root manganese content per coarse root dry mass
definition: The ratio of the quantity (SEP:quantity) of manganese (CHEBI:manganese atom) in the coarse root (Def:coarse root) to the corresponding coarse root mass (PATO:mass) assessed after drying
in scheme: Thesaurustrait
pref unit: mass unit / mass unit or amount unit / mass unit
related match: CHEBI_18291
related match: SEP_00055
reference: Eric Garnier, Jens Kattge, Stefan Klotz, Ingolf Kühn, Ulrike Stahl
alternative label: coarse root Mn content per dry mass
related match: PATO_0000125
term status: stable

Coarse root molybdenum content per coarse root dry mass
type: Class
subclass of: Root molybdenum content per root dry mass trait
type: NamedIndividual
type: Concept
formal name: coarse root molybdenum content per coarse root dry mass
related match: PATO_0000125
pref unit: mass unit / mass unit or amount unit / mass unit
in scheme: Thesaurustrait
reference: Eric Garnier, Jens Kattge, Stefan Klotz, Ingolf Kühn, Ulrike Stahl
definition: The ratio of the quantity (SEP:quantity) of molybdenum (CHEBI:molybdenum atom) in the coarse root (Def:coarse root) to the corresponding coarse root mass (PATO:mass) assessed after drying
alternative label: coarse root Mo content per dry mass
related match: CHEBI_28685
related match: SEP_00055
term status: stable

Coarse root sodium content per coarse root dry mass
type: Class
subclass of: Root sodium content per root dry mass trait
type: NamedIndividual
type: Concept
related match: PATO_0000125
in scheme: Thesaurustrait
term status: stable
reference: Eric Garnier, Jens Kattge, Stefan Klotz, Ingolf Kühn, Ulrike Stahl
pref unit: mass unit / mass unit or amount unit / mass unit
related match: SEP_00055
related match: CHEBI_26708
formal name: coarse root sodium content per coarse root dry mass
definition: The ratio of the quantity (SEP:quantity) of sodium (CHEBI:sodium atom) in the coarse root (Def:coarse root) to the corresponding coarse root mass (PATO:mass) assessed after drying
alternative label: coarse root Na content per dry mass

Coarse root nickel content per coarse root dry mass
type: Class
subclass of: Root nickel content per root dry mass trait
type: NamedIndividual
type: Concept
term status: stable
in scheme: Thesaurustrait
reference: Eric Garnier, Jens Kattge, Stefan Klotz, Ingolf Kühn, Ulrike Stahl
related match: SEP_00055
related match: PATO_0000125
alternative label: coarse root Ni content per dry mass
pref unit: mass unit / mass unit or amount unit / mass unit
definition: The ratio of the quantity (SEP:quantity) of nickel (CHEBI:nickel atom) in the coarse root (Def:coarse root) to the corresponding coarse root mass (PATO:mass) assessed after drying
formal name: coarse root nickel content per coarse root dry mass
related match: CHEBI_28112

Coarse root nitrogen content per coarse root dry mass
type: Class
subclass of: Root nitrogen content per root dry mass trait
type: NamedIndividual
type: Concept
related match: SEP_00055
definition: The ratio of the quantity (SEP:quantity) of nitrogen (CHEBI:nitrogen atom) in the coarse root (Def:coarse root) to the corresponding coarse root mass (PATO:mass) assessed after drying
reference: Eric Garnier, Jens Kattge, Stefan Klotz, Ingolf Kühn, Ulrike Stahl
pref unit: mass unit / mass unit or amount unit / mass unit
alternative label: coarse root N content per dry mass
related match: PATO_0000125
in scheme: Thesaurustrait
formal name: coarse root nitrogen content per coarse root dry mass
term status: stable
related match: CHEBI_25555

Coarse root phosphorus content per coarse root dry mass
type: Class
subclass of: Root phosphorus content per root dry mass trait
type: NamedIndividual
type: Concept
alternative label: coarse root P content per dry mass
related match: SEP_00055
in scheme: Thesaurustrait
reference: Eric Garnier, Jens Kattge, Stefan Klotz, Ingolf Kühn, Ulrike Stahl
related match: CHEBI_28659
formal name: coarse root phosphorus content per coarse root dry mass
definition: The ratio of the quantity (SEP:quantity) of phosphorus (CHEBI:phosphorus atom) in the coarse root (Def:coarse root) to the corresponding coarse root mass (PATO:mass) assessed after drying
related match: PATO_0000125
term status: stable
pref unit: mass unit / mass unit or amount unit / mass unit

Coarse root potassium content per coarse root dry mass
type: Class
subclass of: Root potassium content per root dry mass trait
type: NamedIndividual
type: Concept
formal name: coarse root potassium content per coarse root dry mass
reference: Eric Garnier, Jens Kattge, Stefan Klotz, Ingolf Kühn, Ulrike Stahl
related match: SEP_00055
in scheme: Thesaurustrait
definition: The ratio of the quantity (SEP:quantity) of potassium (CHEBI:potassium atom) in the coarse root (Def:coarse root) to the corresponding coarse root mass (PATO:mass) assessed after drying
related match: PATO_0000125
term status: stable
related match: CHEBI_26216
pref unit: mass unit / mass unit or amount unit / mass unit
alternative label: coarse root K content per dry mass

Coarse root silicon content per coarse root dry mass
type: Class
subclass of: Root silicon content per root dry mass trait
type: NamedIndividual
type: Concept
alternative label: coarse root Si content per dry mass
related match: SEP_00055
in scheme: Thesaurustrait
reference: Eric Garnier, Jens Kattge, Stefan Klotz, Ingolf Kühn, Ulrike Stahl
related match: PATO_0000125
definition: The ratio of the quantity (SEP:quantity) of silicon (CHEBI:silicon atom) in the coarse root (Def:coarse root) to the corresponding coarse root mass (PATO:mass) assessed after drying
term status: stable
formal name: coarse root silicon content per coarse root dry mass
related match: CHEBI_27573
pref unit: mass unit / mass unit or amount unit / mass unit

Coarse root sulfur content per coarse root dry mass
type: Class
subclass of: Root sulfur content per root dry mass trait
type: NamedIndividual
type: Concept
related match: CHEBI_26833
related match: SEP_00055
reference: Eric Garnier, Jens Kattge, Stefan Klotz, Ingolf Kühn, Ulrike Stahl
alternative label: coarse root S content per dry mass
pref unit: mass unit / mass unit or amount unit / mass unit
in scheme: Thesaurustrait
related match: PATO_0000125
term status: stable
definition: The ratio of the quantity (SEP:quantity) of sulfur (CHEBI:sulfur atom) in the coarse root (Def:coarse root) to the corresponding coarse root mass (PATO:mass) assessed after drying
formal name: coarse root sulfur content per coarse root dry mass

Leaf lamina dry mass
type: Class
subclass of: Leaf dry mass trait
type: NamedIndividual
type: Concept
related match: PO_0020039
definition: the mass (PATO:mass) of the leaf lamina (PO:leaf lamina) assessed after drying
term status: stable
related match: PATO_0000125
alternative label: leaf lamina dry weight
reference: Eric Garnier, Jens Kattge, Stefan Klotz, Ingolf Kühn, Ulrike Stahl
pref unit: mass unit
in scheme: Thesaurustrait
formal name: leaf lamina dry mass

Coarse root zinc content per coarse root dry mass
type: Class
subclass of: Root zinc content per root dry mass trait
type: NamedIndividual
type: Concept
related match: CHEBI_27363
alternative label: coarse root Zn content per dry mass
in scheme: Thesaurustrait
pref unit: mass unit / mass unit or amount unit / mass unit
related match: PATO_0000125
related match: SEP_00055
definition: The ratio of the quantity (SEP:quantity) of zinc (CHEBI:zinc atom) in the coarse root (Def:coarse root) to the corresponding coarse root mass (PATO:mass) assessed after drying
reference: Eric Garnier, Jens Kattge, Stefan Klotz, Ingolf Kühn, Ulrike Stahl
formal name: coarse root zinc content per coarse root dry mass
term status: stable

Branch aluminium content per branch dry mass
type: Class
subclass of: Stem and branch trait
type: NamedIndividual
type: Concept
reference: Eric Garnier, Jens Kattge, Stefan Klotz, Ingolf Kühn, Ulrike Stahl
in scheme: Thesaurustrait
alternative label: branch Al content per dry mass
term status: stable
related match: PO_0025073
formal name: branch aluminium content per branch dry mass
related match: PATO_0000125
related match: SEP_00055
pref unit: mass unit / mass unit or amount unit / mass unit
definition: The ratio of the quantity (SEP:quantity) of aluminium (CHEBI:aluminium atom) in the branch (PO:branch) to the corresponding branch (PO:branch) mass (PATO:mass) assessed after drying
related match: CHEBI_28984

Branch boron content per branch dry mass
type: Class
subclass of: Stem and branch trait
type: NamedIndividual
type: Concept
related match: CHEBI_27560
reference: Eric Garnier, Jens Kattge, Stefan Klotz, Ingolf Kühn, Ulrike Stahl
term status: stable
definition: The ratio of the quantity (SEP:quantity) of boron (CHEBI:boron atom) in the branch (PO:branch) to the corresponding branch (PO:branch) mass (PATO:mass) assessed after drying
related match: PO_0025073
formal name: branch boron content per branch dry mass
in scheme: Thesaurustrait
alternative label: branch B content per dry mass
pref unit: mass unit / mass unit or amount unit / mass unit
related match: SEP_00055
related match: PATO_0000125

Branch calcium content per branch dry mass
type: Class
subclass of: Stem and branch trait
type: NamedIndividual
type: Concept
related match: CHEBI_22984
related match: PATO_0000125
reference: Eric Garnier, Jens Kattge, Stefan Klotz, Ingolf Kühn, Ulrike Stahl
formal name: branch calcium content per branch dry mass
term status: stable
definition: The ratio of the quantity (SEP:quantity) of calcium (CHEBI:calcium atom) in the branch (PO:branch) to the corresponding branch (PO:branch) mass (PATO:mass) assessed after drying
in scheme: Thesaurustrait
related match: SEP_00055
related match: PO_0025073
pref unit: mass unit / mass unit or amount unit / mass unit
alternative label: branch Ca content per dry mass

Branch carbon content per branch dry mass
type: Class
subclass of: Stem and branch trait
type: NamedIndividual
type: Concept
definition: The ratio of the quantity (SEP:quantity) of carbon (CHEBI:carbon atom) in the branch (PO:branch) to the corresponding branch (PO:branch) mass (PATO:mass) assessed after drying
pref unit: mass unit / mass unit or amount unit / mass unit
related match: PATO_0000125
related match: SEP_00055
reference: Eric Garnier, Jens Kattge, Stefan Klotz, Ingolf Kühn, Ulrike Stahl
related match: CHEBI_27594
formal name: branch carbon content per branch dry mass
term status: stable
in scheme: Thesaurustrait
alternative label: branch C content per dry mass
related match: PO_0025073

Branch chlorine content per branch dry mass
type: Class
subclass of: Stem and branch trait
type: NamedIndividual
type: Concept
related match: PATO_0000125
formal name: branch chlorine content per branch dry mass
pref unit: mass unit / mass unit or amount unit / mass unit
related match: SEP_00055
reference: Eric Garnier, Jens Kattge, Stefan Klotz, Ingolf Kühn, Ulrike Stahl
related match: CHEBI_23116
term status: stable
alternative label: branch Cl content per dry mass
in scheme: Thesaurustrait
related match: PO_0025073
definition: The ratio of the quantity (SEP:quantity) of chlorine (CHEBI:chlorine atom) in the branch (PO:branch) to the corresponding branch (PO:branch) mass (PATO:mass) assessed after drying

Branch cobalt content per branch dry mass
type: Class
subclass of: Stem and branch trait
type: NamedIndividual
type: Concept
pref unit: mass unit / mass unit or amount unit / mass unit
related match: PATO_0000125
related match: SEP_00055
reference: Eric Garnier, Jens Kattge, Stefan Klotz, Ingolf Kühn, Ulrike Stahl
formal name: branch cobalt content per branch dry mass
alternative label: branch Co content per dry mass
term status: stable
in scheme: Thesaurustrait
related match: CHEBI_27638
definition: The ratio of the quantity (SEP:quantity) of cobalt (CHEBI:cobalt atom) in the branch (PO:branch) to the corresponding branch (PO:branch) mass (PATO:mass) assessed after drying
related match: PO_0025073

Branch copper content per branch dry mass
type: Class
subclass of: Stem and branch trait
type: NamedIndividual
type: Concept
related match: SEP_00055
formal name: branch copper content per branch dry mass
definition: The ratio of the quantity (SEP:quantity) of copper (CHEBI:copper atom) in the branch (PO:branch) to the corresponding branch (PO:branch) mass (PATO:mass) assessed after drying
related match: PATO_0000125
reference: Eric Garnier, Jens Kattge, Stefan Klotz, Ingolf Kühn, Ulrike Stahl
alternative label: branch Cu content per dry mass
term status: stable
in scheme: Thesaurustrait
related match: PO_0025073
pref unit: mass unit / mass unit or amount unit / mass unit
related match: CHEBI_28694

Branch iron content per branch dry mass
type: Class
subclass of: Stem and branch trait
type: NamedIndividual
type: Concept
related match: PATO_0000125
related match: CHEBI_18248
reference: Eric Garnier, Jens Kattge, Stefan Klotz, Ingolf Kühn, Ulrike Stahl
related match: SEP_00055
formal name: branch iron content per branch dry mass
term status: stable
in scheme: Thesaurustrait
alternative label: branch Fe content per dry mass
related match: PO_0025073
pref unit: mass unit / mass unit or amount unit / mass unit
definition: The ratio of the quantity (SEP:quantity) of iron (CHEBI:iron atom) in the branch (PO:branch) to the corresponding branch (PO:branch) mass (PATO:mass) assessed after drying

Branch magnesium content per branch dry mass
type: Class
subclass of: Stem and branch trait
type: NamedIndividual
type: Concept
formal name: branch magnesium content per branch dry mass
reference: Eric Garnier, Jens Kattge, Stefan Klotz, Ingolf Kühn, Ulrike Stahl
related match: PATO_0000125
related match: SEP_00055
alternative label: branch Mg content per dry mass
term status: stable
in scheme: Thesaurustrait
related match: CHEBI_25107
definition: The ratio of the quantity (SEP:quantity) of magnesium (CHEBI:magnesium atom) in the branch (PO:branch) to the corresponding branch (PO:branch) mass (PATO:mass) assessed after drying
related match: PO_0025073
pref unit: mass unit / mass unit or amount unit / mass unit

Leaflet dry mass
type: Class
subclass of: Leaf dry mass trait
type: NamedIndividual
type: Concept
formal name: leaflet dry mass
related match: PATO_0000125
term status: stable
related match: PO_0020049
in scheme: Thesaurustrait
definition: the mass (PATO:mass) of a leaflet (PO:leaflet) assessed after drying
alternative label: leaflet dry weight
pref unit: mass unit
reference: Eric Garnier, Jens Kattge, Stefan Klotz, Ingolf Kühn, Ulrike Stahl

Branch manganese content per branch dry mass
type: Class
subclass of: Stem and branch trait
type: NamedIndividual
type: Concept
related match: PO_0025073
related match: SEP_00055
reference: Eric Garnier, Jens Kattge, Stefan Klotz, Ingolf Kühn, Ulrike Stahl
definition: The ratio of the quantity (SEP:quantity) of manganese (CHEBI:manganese atom) in the branch (PO:branch) to the corresponding branch (PO:branch) mass (PATO:mass) assessed after drying
related match: PATO_0000125
pref unit: mass unit / mass unit or amount unit / mass unit
formal name: branch manganese content per branch dry mass
related match: CHEBI_18291
alternative label: branch Mn content per dry mass
in scheme: Thesaurustrait
term status: stable

Branch molybdenum content per branch dry mass
type: Class
subclass of: Stem and branch trait
type: NamedIndividual
type: Concept
related match: PO_0025073
related match: SEP_00055
reference: Eric Garnier, Jens Kattge, Stefan Klotz, Ingolf Kühn, Ulrike Stahl
related match: PATO_0000125
pref unit: mass unit / mass unit or amount unit / mass unit
related match: CHEBI_28685
alternative label: branch Mo content per dry mass
definition: The ratio of the quantity (SEP:quantity) of molybdenum (CHEBI:molybdenum atom) in the branch (PO:branch) to the corresponding branch (PO:branch) mass (PATO:mass) assessed after drying
term status: stable
in scheme: Thesaurustrait
formal name: branch molybdenum content per branch dry mass

Branch sodium content per branch dry mass
type: Class
subclass of: Stem and branch trait
type: NamedIndividual
type: Concept
alternative label: branch Na content per dry mass
related match: PO_0025073
definition: The ratio of the quantity (SEP:quantity) of sodium (CHEBI:sodium atom) in the branch (PO:branch) to the corresponding branch (PO:branch) mass (PATO:mass) assessed after drying
formal name: branch sodium content per branch dry mass
pref unit: mass unit / mass unit or amount unit / mass unit
related match: SEP_00055
related match: PATO_0000125
in scheme: Thesaurustrait
related match: CHEBI_26708
term status: stable
reference: Eric Garnier, Jens Kattge, Stefan Klotz, Ingolf Kühn, Ulrike Stahl

Branch nickel content per branch dry mass
type: Class
subclass of: Stem and branch trait
type: NamedIndividual
type: Concept
related match: PO_0025073
in scheme: Thesaurustrait
definition: The ratio of the quantity (SEP:quantity) of nickel (CHEBI:nickel atom) in the branch (PO:branch) to the corresponding branch (PO:branch) mass (PATO:mass) assessed after drying
pref unit: mass unit / mass unit or amount unit / mass unit
related match: SEP_00055
related match: PATO_0000125
related match: CHEBI_28112
alternative label: branch Ni content per dry mass
reference: Eric Garnier, Jens Kattge, Stefan Klotz, Ingolf Kühn, Ulrike Stahl
formal name: branch nickel content per branch dry mass
term status: stable

Branch nitrogen content per branch dry mass
type: Class
subclass of: Stem and branch trait
type: NamedIndividual
type: Concept
in scheme: Thesaurustrait
related match: SEP_00055
formal name: branch nitrogen content per branch dry mass
definition: The ratio of the quantity (SEP:quantity) of nitrogen (CHEBI:nitrogen atom) in the branch (PO:branch) to the corresponding branch (PO:branch) mass (PATO:mass) assessed after drying
related match: PO_0025073
pref unit: mass unit / mass unit or amount unit / mass unit
related match: PATO_0000125
reference: Eric Garnier, Jens Kattge, Stefan Klotz, Ingolf Kühn, Ulrike Stahl
term status: stable
alternative label: branch N content per dry mass
related match: CHEBI_25555

Branch phosphorus content per branch dry mass
type: Class
subclass of: Stem and branch trait
type: NamedIndividual
type: Concept
definition: The ratio of the quantity (SEP:quantity) of phosphorus (CHEBI:phosphorus atom) in the branch (PO:branch) to the corresponding branch (PO:branch) mass (PATO:mass) assessed after drying
term status: stable
related match: CHEBI_28659
in scheme: Thesaurustrait
pref unit: mass unit / mass unit or amount unit / mass unit
related match: PO_0025073
formal name: branch phosphorus content per branch dry mass
related match: PATO_0000125
related match: SEP_00055
reference: Eric Garnier, Jens Kattge, Stefan Klotz, Ingolf Kühn, Ulrike Stahl
alternative label: branch P content per dry mass

Branch potassium content per branch dry mass
type: Class
subclass of: Stem and branch trait
type: NamedIndividual
type: Concept
term status: stable
definition: The ratio of the quantity (SEP:quantity) of potassium (CHEBI:potassium atom) in the branch (PO:branch) to the corresponding branch (PO:branch) mass (PATO:mass) assessed after drying
related match: CHEBI_26216
in scheme: Thesaurustrait
related match: PO_0025073
pref unit: mass unit / mass unit or amount unit / mass unit
related match: PATO_0000125
related match: SEP_00055
formal name: branch potassium content per branch dry mass
reference: Eric Garnier, Jens Kattge, Stefan Klotz, Ingolf Kühn, Ulrike Stahl
alternative label: branch K content per dry mass

Branch silicon content per branch dry mass
type: Class
subclass of: Stem and branch trait
type: NamedIndividual
type: Concept
term status: stable
in scheme: Thesaurustrait
definition: The ratio of the quantity (SEP:quantity) of silicon (CHEBI:silicon atom) in the branch (PO:branch) to the corresponding branch (PO:branch) mass (PATO:mass) assessed after drying
related match: PO_0025073
pref unit: mass unit / mass unit or amount unit / mass unit
related match: PATO_0000125
alternative label: branch Si content per dry mass
formal name: branch silicon content per branch dry mass
reference: Eric Garnier, Jens Kattge, Stefan Klotz, Ingolf Kühn, Ulrike Stahl
related match: SEP_00055
related match: CHEBI_27573

Branch sulfur content per branch dry mass
type: Class
subclass of: Stem and branch trait
type: NamedIndividual
type: Concept
term status: stable
in scheme: Thesaurustrait
related match: CHEBI_26833
definition: The ratio of the quantity (SEP:quantity) of sulfur (CHEBI:sulfur atom) in the branch (PO:branch) to the corresponding branch (PO:branch) mass (PATO:mass) assessed after drying
related match: PO_0025073
pref unit: mass unit / mass unit or amount unit / mass unit
alternative label: branch S content per dry mass
formal name: branch sulfur content per branch dry mass
reference: Eric Garnier, Jens Kattge, Stefan Klotz, Ingolf Kühn, Ulrike Stahl
related match: SEP_00055
related match: PATO_0000125

Branch zinc content per branch dry mass
type: Class
subclass of: Stem and branch trait
type: NamedIndividual
type: Concept
definition: The ratio of the quantity (SEP:quantity) of zinc (CHEBI:zinc atom) in the branch (PO:branch) to the corresponding branch (PO:branch) mass (PATO:mass) assessed after drying
in scheme: Thesaurustrait
term status: stable
formal name: branch zinc content per branch dry mass
pref unit: mass unit / mass unit or amount unit / mass unit
related match: PO_0025073
related match: SEP_00055
reference: Eric Garnier, Jens Kattge, Stefan Klotz, Ingolf Kühn, Ulrike Stahl
related match: PATO_0000125
alternative label: branch Zn content per dry mass
related match: CHEBI_27363

Leaflet lamina dry mass
type: Class
subclass of: Leaf dry mass trait
type: NamedIndividual
type: Concept
formal name: leaflet lamina dry mass
in scheme: Thesaurustrait
related match: PO_0020049
related match: PATO_0000125
related match: PO_0020039
term status: stable
pref unit: mass unit
reference: Eric Garnier, Jens Kattge, Stefan Klotz, Ingolf Kühn, Ulrike Stahl
alternative label: leaflet lamina fresh weight
definition: the mass (PATO:mass) of a leaflet lamina (PO:leaflet, PO:leaf lamina) assessed after drying

Cotyledon aluminium content per cotyledon dry mass
type: Class
subclass of: Leaf trait
type: NamedIndividual
type: Concept
formal name: cotyledon aluminium content per cotyledon dry mass
in scheme: Thesaurustrait
term status: stable
related match: SEP_00055
reference: Eric Garnier, Jens Kattge, Stefan Klotz, Ingolf Kühn, Ulrike Stahl
pref unit: mass unit / mass unit or amount unit / mass unit
definition: The ratio of the quantity (SEP:quantity) of aluminium (CHEBI:aluminium atom) in the cotyledon (PO:cotyledon) to the corresponding cotyledon (PO:cotyledon) mass (PATO:mass) assessed after drying
alternative label: cotyledon Al content per dry mass
related match: PATO_0000125
related match: PO_0020030
related match: CHEBI_28984

Cotyledon boron content per cotyledon dry mass
type: Class
subclass of: Leaf trait
type: NamedIndividual
type: Concept
in scheme: Thesaurustrait
term status: stable
related match: CHEBI_27560
related match: SEP_00055
definition: The ratio of the quantity (SEP:quantity) of boron (CHEBI:boron atom) in the cotyledon (PO:cotyledon) to the corresponding cotyledon (PO:cotyledon) mass (PATO:mass) assessed after drying
related match: PO_0020030
reference: Eric Garnier, Jens Kattge, Stefan Klotz, Ingolf Kühn, Ulrike Stahl
alternative label: cotyledon B content per dry mass
related match: PATO_0000125
pref unit: mass unit / mass unit or amount unit / mass unit
formal name: cotyledon boron content per cotyledon dry mass

Cotyledon calcium content per cotyledon dry mass
type: Class
subclass of: Leaf trait
type: NamedIndividual
type: Concept
alternative label: cotyledon Ca content per dry mass
in scheme: Thesaurustrait
term status: stable
definition: The ratio of the quantity (SEP:quantity) of calcium (CHEBI:calcium atom) in the cotyledon (PO:cotyledon) to the corresponding cotyledon (PO:cotyledon) mass (PATO:mass) assessed after drying
reference: Eric Garnier, Jens Kattge, Stefan Klotz, Ingolf Kühn, Ulrike Stahl
related match: SEP_00055
formal name: cotyledon calcium content per cotyledon dry mass
related match: PO_0020030
related match: CHEBI_22984
related match: PATO_0000125
pref unit: mass unit / mass unit or amount unit / mass unit

Cotyledon carbon content per cotyledon dry mass
type: Class
subclass of: Leaf trait
type: NamedIndividual
type: Concept
definition: The ratio of the quantity (SEP:quantity) of carbon (CHEBI:carbon atom) in the cotyledon (PO:cotyledon) to the corresponding cotyledon (PO:cotyledon) mass (PATO:mass) assessed after drying
formal name: cotyledon carbon content per cotyledon dry mass
in scheme: Thesaurustrait
term status: stable
related match: CHEBI_27594
related match: PO_0020030
related match: SEP_00055
reference: Eric Garnier, Jens Kattge, Stefan Klotz, Ingolf Kühn, Ulrike Stahl
related match: PATO_0000125
alternative label: cotyledon C content per dry mass
pref unit: mass unit / mass unit or amount unit / mass unit

Cotyledon chlorine content per cotyledon dry mass
type: Class
subclass of: Leaf trait
type: NamedIndividual
type: Concept
term status: stable
related match: CHEBI_23116
alternative label: cotyledon Cl content per dry mass
related match: PO_0020030
formal name: cotyledon chlorine content per cotyledon dry mass
related match: SEP_00055
reference: Eric Garnier, Jens Kattge, Stefan Klotz, Ingolf Kühn, Ulrike Stahl
in scheme: Thesaurustrait
pref unit: mass unit / mass unit or amount unit / mass unit
related match: PATO_0000125
definition: The ratio of the quantity (SEP:quantity) of chlorine (CHEBI:chlorine atom) in the cotyledon (PO:cotyledon) to the corresponding cotyledon (PO:cotyledon) mass (PATO:mass) assessed after drying

Cotyledon cobalt content per cotyledon dry mass
type: Class
subclass of: Leaf trait
type: NamedIndividual
type: Concept
related match: CHEBI_27638
related match: PATO_0000125
alternative label: cotyledon Co content per dry mass
term status: stable
definition: The ratio of the quantity (SEP:quantity) of cobalt (CHEBI:cobalt atom) in the cotyledon (PO:cotyledon) to the corresponding cotyledon (PO:cotyledon) mass (PATO:mass) assessed after drying
related match: PO_0020030
formal name: cotyledon cobalt content per cotyledon dry mass
in scheme: Thesaurustrait
related match: SEP_00055
reference: Eric Garnier, Jens Kattge, Stefan Klotz, Ingolf Kühn, Ulrike Stahl
pref unit: mass unit / mass unit or amount unit / mass unit

Cotyledon copper content per cotyledon dry mass
type: Class
subclass of: Leaf trait
type: NamedIndividual
type: Concept
definition: The ratio of the quantity (SEP:quantity) of copper (CHEBI:copper atom) in the cotyledon (PO:cotyledon) to the corresponding cotyledon (PO:cotyledon) mass (PATO:mass) assessed after drying
related match: PATO_0000125
alternative label: cotyledon Cu content per dry mass
reference: Eric Garnier, Jens Kattge, Stefan Klotz, Ingolf Kühn, Ulrike Stahl
related match: SEP_00055
related match: PO_0020030
term status: stable
in scheme: Thesaurustrait
formal name: cotyledon copper content per cotyledon dry mass
related match: CHEBI_28694
pref unit: mass unit / mass unit or amount unit / mass unit

Cotyledon iron content per cotyledon dry mass
type: Class
subclass of: Leaf trait
type: NamedIndividual
type: Concept
reference: Eric Garnier, Jens Kattge, Stefan Klotz, Ingolf Kühn, Ulrike Stahl
related match: SEP_00055
definition: The ratio of the quantity (SEP:quantity) of iron (CHEBI:iron atom) in the cotyledon (PO:cotyledon) to the corresponding cotyledon (PO:cotyledon) mass (PATO:mass) assessed after drying
related match: PATO_0000125
related match: PO_0020030
formal name: cotyledon iron content per cotyledon dry mass
alternative label: cotyledon Fe content per dry mass
term status: stable
in scheme: Thesaurustrait
related match: CHEBI_18248
pref unit: mass unit / mass unit or amount unit / mass unit

Cotyledon magnesium content per cotyledon dry mass
type: Class
subclass of: Leaf trait
type: NamedIndividual
type: Concept
related match: SEP_00055
reference: Eric Garnier, Jens Kattge, Stefan Klotz, Ingolf Kühn, Ulrike Stahl
related match: PATO_0000125
related match: CHEBI_25107
formal name: cotyledon magnesium content per cotyledon dry mass
related match: PO_0020030
in scheme: Thesaurustrait
term status: stable
definition: The ratio of the quantity (SEP:quantity) of magnesium (CHEBI:magnesium atom) in the cotyledon (PO:cotyledon) to the corresponding cotyledon (PO:cotyledon) mass (PATO:mass) assessed after drying
pref unit: mass unit / mass unit or amount unit / mass unit
alternative label: cotyledon Mg content per dry mass

Cotyledon manganese content per cotyledon dry mass
type: Class
subclass of: Leaf trait
type: NamedIndividual
type: Concept
related match: PATO_0000125
pref unit: mass unit / mass unit or amount unit / mass unit
reference: Eric Garnier, Jens Kattge, Stefan Klotz, Ingolf Kühn, Ulrike Stahl
related match: SEP_00055
related match: PO_0020030
related match: CHEBI_18291
term status: stable
in scheme: Thesaurustrait
alternative label: cotyledon Mn content per dry mass
formal name: cotyledon manganese content per cotyledon dry mass
definition: The ratio of the quantity (SEP:quantity) of manganese (CHEBI:manganese atom) in the cotyledon (PO:cotyledon) to the corresponding cotyledon (PO:cotyledon) mass (PATO:mass) assessed after drying

Leaf dry matter content trait
type: Class
subclass of: Leaf trait
type: NamedIndividual
type: Concept
pref unit: mass unit / mass unit
in scheme: Thesaurustrait
reference: Eric Garnier, Jens Kattge, Stefan Klotz, Ingolf Kühn, Ulrike Stahl
definition: the ratio of the dry mass of the leaf (TOP:leaf dry mass) or component thereof, i.e. leaf lamina (TOP:leaf lamina dry mass), to the corresponding water saturated fresh mass
formal name: leaf dry mass per leaf fresh mass trait
term status: stable
abbreviation: LDMC

Cotyledon molybdenum content per cotyledon dry mass
type: Class
subclass of: Leaf trait
type: NamedIndividual
type: Concept
related match: PATO_0000125
pref unit: mass unit / mass unit or amount unit / mass unit
related match: SEP_00055
reference: Eric Garnier, Jens Kattge, Stefan Klotz, Ingolf Kühn, Ulrike Stahl
definition: The ratio of the quantity (SEP:quantity) of molybdenum (CHEBI:molybdenum atom) in the cotyledon (PO:cotyledon) to the corresponding cotyledon (PO:cotyledon) mass (PATO:mass) assessed after drying
related match: CHEBI_28685
term status: stable
in scheme: Thesaurustrait
formal name: cotyledon molybdenum content per cotyledon dry mass
alternative label: cotyledon Mo content per dry mass
related match: PO_0020030

Cotyledon sodium content per cotyledon dry mass
type: Class
subclass of: Leaf trait
type: NamedIndividual
type: Concept
related match: CHEBI_26708
pref unit: mass unit / mass unit or amount unit / mass unit
related match: PATO_0000125
related match: SEP_00055
reference: Eric Garnier, Jens Kattge, Stefan Klotz, Ingolf Kühn, Ulrike Stahl
alternative label: cotyledon Na content per dry mass
formal name: cotyledon sodium content per cotyledon dry mass
term status: stable
in scheme: Thesaurustrait
related match: PO_0020030
definition: The ratio of the quantity (SEP:quantity) of sodium (CHEBI:sodium atom) in the cotyledon (PO:cotyledon) to the corresponding cotyledon (PO:cotyledon) mass (PATO:mass) assessed after drying

Cotyledon nickel content per cotyledon dry mass
type: Class
subclass of: Leaf trait
type: NamedIndividual
type: Concept
related match: SEP_00055
related match: PO_0020030
related match: PATO_0000125
reference: Eric Garnier, Jens Kattge, Stefan Klotz, Ingolf Kühn, Ulrike Stahl
related match: CHEBI_28112
pref unit: mass unit / mass unit or amount unit / mass unit
alternative label: cotyledon Ni content per dry mass
term status: stable
in scheme: Thesaurustrait
definition: The ratio of the quantity (SEP:quantity) of nickel (CHEBI:nickel atom) in the cotyledon (PO:cotyledon) to the corresponding cotyledon (PO:cotyledon) mass (PATO:mass) assessed after drying
formal name: cotyledon nickel content per cotyledon dry mass

Cotyledon nitrogen content per cotyledon dry mass
type: Class
subclass of: Leaf trait
type: NamedIndividual
type: Concept
related match: PO_0020030
related match: PATO_0000125
reference: Eric Garnier, Jens Kattge, Stefan Klotz, Ingolf Kühn, Ulrike Stahl
related match: SEP_00055
formal name: cotyledon nitrogen content per cotyledon dry mass
pref unit: mass unit / mass unit or amount unit / mass unit
alternative label: cotyledon N content per dry mass
in scheme: Thesaurustrait
term status: stable
definition: The ratio of the quantity (SEP:quantity) of nitrogen (CHEBI:nitrogen atom) in the cotyledon (PO:cotyledon) to the corresponding cotyledon (PO:cotyledon) mass (PATO:mass) assessed after drying
related match: CHEBI_25555

Cotyledon phosphorus content per cotyledon dry mass
type: Class
subclass of: Leaf trait
type: NamedIndividual
type: Concept
definition: The ratio of the quantity (SEP:quantity) of phosphorus (CHEBI:phosphorus atom) in the cotyledon (PO:cotyledon) to the corresponding cotyledon (PO:cotyledon) mass (PATO:mass) assessed after drying
related match: PO_0020030
reference: Eric Garnier, Jens Kattge, Stefan Klotz, Ingolf Kühn, Ulrike Stahl
related match: CHEBI_28659
related match: PATO_0000125
related match: SEP_00055
formal name: cotyledon phosphorus content per cotyledon dry mass
pref unit: mass unit / mass unit or amount unit / mass unit
in scheme: Thesaurustrait
alternative label: cotyledon P content per dry mass
term status: stable

Cotyledon potassium content per cotyledon dry mass
type: Class
subclass of: Leaf trait
type: NamedIndividual
type: Concept
related match: PO_0020030
related match: CHEBI_26216
related match: SEP_00055
reference: Eric Garnier, Jens Kattge, Stefan Klotz, Ingolf Kühn, Ulrike Stahl
related match: PATO_0000125
in scheme: Thesaurustrait
alternative label: cotyledon K content per dry mass
pref unit: mass unit / mass unit or amount unit / mass unit
definition: The ratio of the quantity (SEP:quantity) of potassium (CHEBI:potassium atom) in the cotyledon (PO:cotyledon) to the corresponding cotyledon (PO:cotyledon) mass (PATO:mass) assessed after drying
formal name: cotyledon potassium content per cotyledon dry mass
term status: stable

Cotyledon silicon content per cotyledon dry mass
type: Class
subclass of: Leaf trait
type: NamedIndividual
type: Concept
related match: PO_0020030
related match: SEP_00055
pref unit: mass unit / mass unit or amount unit / mass unit
formal name: cotyledon silicon content per cotyledon dry mass
in scheme: Thesaurustrait
reference: Eric Garnier, Jens Kattge, Stefan Klotz, Ingolf Kühn, Ulrike Stahl
definition: The ratio of the quantity (SEP:quantity) of silicon (CHEBI:silicon atom) in the cotyledon (PO:cotyledon) to the corresponding cotyledon (PO:cotyledon) mass (PATO:mass) assessed after drying
alternative label: cotyledon Si content per dry mass
related match: PATO_0000125
term status: stable
related match: CHEBI_27573

Cotyledon sulfur content per cotyledon dry mass
type: Class
subclass of: Leaf trait
type: NamedIndividual
type: Concept
alternative label: cotyledon S content per dry mass
related match: PO_0020030
related match: CHEBI_26833
term status: stable
reference: Eric Garnier, Jens Kattge, Stefan Klotz, Ingolf Kühn, Ulrike Stahl
pref unit: mass unit / mass unit or amount unit / mass unit
in scheme: Thesaurustrait
formal name: cotyledon sulfur content per cotyledon dry mass
related match: PATO_0000125
definition: The ratio of the quantity (SEP:quantity) of sulfur (CHEBI:sulfur atom) in the cotyledon (PO:cotyledon) to the corresponding cotyledon (PO:cotyledon) mass (PATO:mass) assessed after drying
related match: SEP_00055

Cotyledon zinc content per cotyledon dry mass
type: Class
subclass of: Leaf trait
type: NamedIndividual
type: Concept
term status: stable
reference: Eric Garnier, Jens Kattge, Stefan Klotz, Ingolf Kühn, Ulrike Stahl
in scheme: Thesaurustrait
pref unit: mass unit / mass unit or amount unit / mass unit
definition: The ratio of the quantity (SEP:quantity) of zinc (CHEBI:zinc atom) in the cotyledon (PO:cotyledon) to the corresponding cotyledon (PO:cotyledon) mass (PATO:mass) assessed after drying
alternative label: cotyledon Zn content per dry mass
related match: PATO_0000125
formal name: cotyledon zinc content per cotyledon dry mass
related match: SEP_00055
related match: CHEBI_27363
related match: PO_0020030

Leaf aluminium content per leaf dry mass
type: Class
subclass of: Leaf trait
type: NamedIndividual
type: Concept
related match: CHEBI_28984
in scheme: Thesaurustrait
alternative label: leaf Al content per dry mass
term status: stable
definition: The ratio of the quantity (SEP:quantity) of aluminium (CHEBI:aluminium atom) in the leaf (PO:leaf) or component thereof, i.e. leaf lamina or leaflet (PO:leaf lamina, PO:leaflet) per respective unit dry mass (TOP:leaf dry mass, TOP:leaf lamina dry mass, TOP:leaflet dry mass)
formal name: leaf aluminium content per leaf dry mass
reference: Eric Garnier, Jens Kattge, Stefan Klotz, Ingolf Kühn, Ulrike Stahl
pref unit: mass unit / mass unit or amount unit / mass unit
related match: PO_0020049
related match: PO_0020039
related match: PO_0025034
related match: SEP_00055

Leaf dry matter content
type: Class
subclass of: Leaf dry matter content trait
type: NamedIndividual
type: Concept
term status: stable
in scheme: Thesaurustrait
reference: Eric Garnier, Jens Kattge, Stefan Klotz, Ingolf Kühn, Ulrike Stahl
pref unit: mass unit / mass unit
definition: the ratio of the dry mass of a leaf (TOP:leaf dry mass) to its water saturated fresh mass
formal name: leaf dry mass per leaf fresh mass
abbreviation: LDMC

Leaf boron content per leaf dry mass
type: Class
subclass of: Leaf trait
type: NamedIndividual
type: Concept
term status: stable
definition: The ratio of the quantity (SEP:quantity) of boron (CHEBI:boron atom) in the leaf (PO:leaf) or component thereof, i.e. leaf lamina or leaflet (PO:leaf lamina, PO:leaflet) per respective unit dry mass (TOP:leaf dry mass, TOP:leaf lamina dry mass, TOP:leaflet dry mass)
formal name: leaf boron content per leaf dry mass
in scheme: Thesaurustrait
related match: CHEBI_27560
related match: PO_0020049
related match: PO_0020039
related match: SEP_00055
reference: Eric Garnier, Jens Kattge, Stefan Klotz, Ingolf Kühn, Ulrike Stahl
related match: PO_0025034
pref unit: mass unit / mass unit or amount unit / mass unit
alternative label: leaf B content per dry mass

Leaf calcium content per leaf dry mass
type: Class
subclass of: Leaf trait
type: NamedIndividual
type: Concept
term status: stable
definition: The ratio of the quantity (SEP:quantity) of calcium (CHEBI:calcium atom) in the leaf (PO:leaf) or component thereof, i.e. leaf lamina or leaflet (PO:leaf lamina, PO:leaflet) per respective unit dry mass (TOP:leaf dry mass, TOP:leaf lamina dry mass, TOP:leaflet dry mass)
in scheme: Thesaurustrait
formal name: leaf calcium content per leaf dry mass
related match: PO_0020049
related match: CHEBI_22984
related match: PO_0020039
related match: SEP_00055
reference: Eric Garnier, Jens Kattge, Stefan Klotz, Ingolf Kühn, Ulrike Stahl
alternative label: leaf Ca content per dry mass
related match: PO_0025034
pref unit: mass unit / mass unit or amount unit / mass unit

Leaf carbon content per leaf dry mass
type: Class
subclass of: Leaf trait
type: NamedIndividual
type: Concept
in scheme: Thesaurustrait
term status: stable
related match: CHEBI_27594
related match: PO_0020049
related match: PO_0020039
related match: PO_0025034
definition: The ratio of the quantity (SEP:quantity) of carbon (CHEBI:carbon atom) in the leaf (PO:leaf) or component thereof, i.e. leaf lamina or leaflet (PO:leaf lamina, PO:leaflet) per respective unit dry mass (TOP:leaf dry mass, TOP:leaf lamina dry mass, TOP:leaflet dry mass)
reference: Eric Garnier, Jens Kattge, Stefan Klotz, Ingolf Kühn, Ulrike Stahl
formal name: leaf carbon content per leaf dry mass
related match: SEP_00055
alternative label: leaf C content per dry mass
pref unit: mass unit / mass unit or amount unit / mass unit

Leaf chlorine content per leaf dry mass
type: Class
subclass of: Leaf trait
type: NamedIndividual
type: Concept
term status: stable
in scheme: Thesaurustrait
related match: CHEBI_23116
definition: The ratio of the quantity (SEP:quantity) of chlorine (CHEBI:chlorine atom) in the leaf (PO:leaf) or component thereof, i.e. leaf lamina or leaflet (PO:leaf lamina, PO:leaflet) per respective unit dry mass (TOP:leaf dry mass, TOP:leaf lamina dry mass, TOP:leaflet dry mass)
alternative label: leaf Cl content per dry mass
reference: Eric Garnier, Jens Kattge, Stefan Klotz, Ingolf Kühn, Ulrike Stahl
related match: PO_0020039
related match: PO_0020049
related match: PO_0025034
related match: SEP_00055
pref unit: mass unit / mass unit or amount unit / mass unit
formal name: leaf chlorine content per leaf dry mass

Leaf cobalt content per leaf dry mass
type: Class
subclass of: Leaf trait
type: NamedIndividual
type: Concept
in scheme: Thesaurustrait
related match: CHEBI_27638
term status: stable
alternative label: leaf Co content per dry mass
related match: SEP_00055
related match: PO_0025034
reference: Eric Garnier, Jens Kattge, Stefan Klotz, Ingolf Kühn, Ulrike Stahl
formal name: leaf cobalt content per leaf dry mass
related match: PO_0020049
related match: PO_0020039
definition: The ratio of the quantity (SEP:quantity) of cobalt (CHEBI:cobalt atom) in the leaf (PO:leaf) or component thereof, i.e. leaf lamina or leaflet (PO:leaf lamina, PO:leaflet) per respective unit dry mass (TOP:leaf dry mass, TOP:leaf lamina dry mass, TOP:leaflet dry mass)
pref unit: mass unit / mass unit or amount unit / mass unit

Leaf copper content per leaf dry mass
type: Class
subclass of: Leaf trait
type: NamedIndividual
type: Concept
related match: CHEBI_28694
definition: The ratio of the quantity (SEP:quantity) of copper (CHEBI:copper atom) in the leaf (PO:leaf) or component thereof, i.e. leaf lamina or leaflet (PO:leaf lamina, PO:leaflet) per respective unit dry mass (TOP:leaf dry mass, TOP:leaf lamina dry mass, TOP:leaflet dry mass)
in scheme: Thesaurustrait
term status: stable
related match: SEP_00055
alternative label: leaf Cu content per dry mass
reference: Eric Garnier, Jens Kattge, Stefan Klotz, Ingolf Kühn, Ulrike Stahl
related match: PO_0025034
related match: PO_0020049
related match: PO_0020039
formal name: leaf copper content per leaf dry mass
pref unit: mass unit / mass unit or amount unit / mass unit

Leaf iron content per leaf dry mass
type: Class
subclass of: Leaf trait
type: NamedIndividual
type: Concept
alternative label: leaf Fe content per dry mass
formal name: leaf iron content per leaf dry mass
term status: stable
related match: PO_0020039
related match: PO_0020049
definition: The ratio of the quantity (SEP:quantity) of iron (CHEBI:iron atom) in the leaf (PO:leaf) or component thereof, i.e. leaf lamina or leaflet (PO:leaf lamina, PO:leaflet) per respective unit dry mass (TOP:leaf dry mass, TOP:leaf lamina dry mass, TOP:leaflet dry mass)
related match: CHEBI_18248
reference: Eric Garnier, Jens Kattge, Stefan Klotz, Ingolf Kühn, Ulrike Stahl
related match: SEP_00055
related match: PO_0025034
in scheme: Thesaurustrait
pref unit: mass unit / mass unit or amount unit / mass unit

Leaf magnesium content per leaf dry mass
type: Class
subclass of: Leaf trait
type: NamedIndividual
type: Concept
related match: CHEBI_25107
alternative label: leaf Mg content per dry mass
term status: stable
related match: PO_0020039
related match: PO_0020049
related match: PO_0025034
related match: SEP_00055
definition: The ratio of the quantity (SEP:quantity) of magnesium (CHEBI:magnesium atom) in the leaf (PO:leaf) or component thereof, i.e. leaf lamina or leaflet (PO:leaf lamina, PO:leaflet) per respective unit dry mass (TOP:leaf dry mass, TOP:leaf lamina dry mass, TOP:leaflet dry mass)
pref unit: mass unit / mass unit or amount unit / mass unit
in scheme: Thesaurustrait
reference: Eric Garnier, Jens Kattge, Stefan Klotz, Ingolf Kühn, Ulrike Stahl
formal name: leaf magnesium content per leaf dry mass

Leaf manganese content per leaf dry mass
type: Class
subclass of: Leaf trait
type: NamedIndividual
type: Concept
related match: PO_0020039
related match: PO_0020049
related match: SEP_00055
related match: CHEBI_18291
formal name: leaf manganese content per leaf dry mass
related match: PO_0025034
term status: stable
definition: The ratio of the quantity (SEP:quantity) of manganese (CHEBI:manganese atom) in the leaf (PO:leaf) or component thereof, i.e. leaf lamina or leaflet (PO:leaf lamina, PO:leaflet) per respective unit dry mass (TOP:leaf dry mass, TOP:leaf lamina dry mass, TOP:leaflet dry mass)
pref unit: mass unit / mass unit or amount unit / mass unit
in scheme: Thesaurustrait
reference: Eric Garnier, Jens Kattge, Stefan Klotz, Ingolf Kühn, Ulrike Stahl
alternative label: leaf Mn content per dry mass

Leaf molybdenum content per leaf dry mass
type: Class
subclass of: Leaf trait
type: NamedIndividual
type: Concept
related match: PO_0020049
related match: PO_0020039
related match: SEP_00055
term status: stable
related match: PO_0025034
formal name: leaf molybdenum content per leaf dry mass
reference: Eric Garnier, Jens Kattge, Stefan Klotz, Ingolf Kühn, Ulrike Stahl
related match: CHEBI_28685
in scheme: Thesaurustrait
pref unit: mass unit / mass unit or amount unit / mass unit
definition: The ratio of the quantity (SEP:quantity) of molybdenum (CHEBI:molybdenum atom) in the leaf (PO:leaf) or component thereof, i.e. leaf lamina or leaflet (PO:leaf lamina, PO:leaflet) per respective unit dry mass (TOP:leaf dry mass, TOP:leaf lamina dry mass, TOP:leaflet dry mass)
alternative label: leaf Mo content per dry mass

Leaf lamina dry matter content
type: Class
subclass of: Leaf dry matter content trait
type: NamedIndividual
type: Concept
reference: Eric Garnier, Jens Kattge, Stefan Klotz, Ingolf Kühn, Ulrike Stahl
in scheme: Thesaurustrait
pref unit: mass unit / mass unit
formal name: leaf lamina dry mass per leaf lamina fresh mass
term status: stable
definition: the ratio of the dry mass of a leaf lamina (TOP:leaf lamina dry mass) to its water saturated fresh mass

Leaf sodium content per leaf dry mass
type: Class
subclass of: Leaf trait
type: NamedIndividual
type: Concept
reference: Eric Garnier, Jens Kattge, Stefan Klotz, Ingolf Kühn, Ulrike Stahl
related match: PO_0025034
pref unit: mass unit / mass unit or amount unit / mass unit
formal name: leaf sodium content per leaf dry mass
in scheme: Thesaurustrait
related match: SEP_00055
alternative label: leaf Na content per dry mass
term status: stable
related match: PO_0020049
related match: CHEBI_26708
definition: The ratio of the quantity (SEP:quantity) of sodium (CHEBI:sodium atom) in the leaf (PO:leaf) or component thereof, i.e. leaf lamina or leaflet (PO:leaf lamina, PO:leaflet) per respective unit dry mass (TOP:leaf dry mass, TOP:leaf lamina dry mass, TOP:leaflet dry mass)
related match: PO_0020039

Leaf nickel content per leaf dry mass
type: Class
subclass of: Leaf trait
type: NamedIndividual
type: Concept
alternative label: leaf Ni content per dry mass
formal name: leaf nickel content per leaf dry mass
related match: PO_0020039
reference: Eric Garnier, Jens Kattge, Stefan Klotz, Ingolf Kühn, Ulrike Stahl
related match: SEP_00055
related match: CHEBI_28112
related match: PO_0025034
pref unit: mass unit / mass unit or amount unit / mass unit
term status: stable
in scheme: Thesaurustrait
related match: PO_0020049
definition: The ratio of the quantity (SEP:quantity) of nickel (CHEBI:nickel atom) in the leaf (PO:leaf) or component thereof, i.e. leaf lamina or leaflet (PO:leaf lamina, PO:leaflet) per respective unit dry mass (TOP:leaf dry mass, TOP:leaf lamina dry mass, TOP:leaflet dry mass)

Leaf nitrogen content per leaf dry mass
type: Class
subclass of: Leaf trait
type: NamedIndividual
type: Concept
related match: PO_0020039
related match: PO_0020049
reference: Eric Garnier, Jens Kattge, Stefan Klotz, Ingolf Kühn, Ulrike Stahl
related match: SEP_00055
related match: PO_0025034
pref unit: mass unit / mass unit or amount unit / mass unit
formal name: leaf nitrogen content per leaf dry mass
alternative label: leaf N content per dry mass
term status: stable
in scheme: Thesaurustrait
related match: CHEBI_25555
definition: The ratio of the quantity (SEP:quantity) of nitrogen (CHEBI:nitrogen atom) in the leaf (PO:leaf) or component thereof, i.e. leaf lamina or leaflet (PO:leaf lamina, PO:leaflet) per respective unit dry mass (TOP:leaf dry mass, TOP:leaf lamina dry mass, TOP:leaflet dry mass)

Leaf phosphorus content per leaf dry mass
type: Class
subclass of: Leaf trait
type: NamedIndividual
type: Concept
related match: PO_0020039
related match: PO_0020049
related match: SEP_00055
related match: PO_0025034
reference: Eric Garnier, Jens Kattge, Stefan Klotz, Ingolf Kühn, Ulrike Stahl
pref unit: mass unit / mass unit or amount unit / mass unit
formal name: leaf phosphorus content per leaf dry mass
in scheme: Thesaurustrait
definition: The ratio of the quantity (SEP:quantity) of phosphorus (CHEBI:phosphorus atom) in the leaf (PO:leaf) or component thereof, i.e. leaf lamina or leaflet (PO:leaf lamina, PO:leaflet) per respective unit dry mass (TOP:leaf dry mass, TOP:leaf lamina dry mass, TOP:leaflet dry mass)
related match: CHEBI_28659
term status: stable
alternative label: leaf P content per dry mass

Leaf potassium content per leaf dry mass
type: Class
subclass of: Leaf trait
type: NamedIndividual
type: Concept
related match: PO_0020049
related match: PO_0020039
pref unit: mass unit / mass unit or amount unit / mass unit
reference: Eric Garnier, Jens Kattge, Stefan Klotz, Ingolf Kühn, Ulrike Stahl
formal name: leaf potassium content per leaf dry mass
related match: PO_0025034
related match: SEP_00055
term status: stable
in scheme: Thesaurustrait
definition: The ratio of the quantity (SEP:quantity) of potassium (CHEBI:potassium atom) in the leaf (PO:leaf) or component thereof, i.e. leaf lamina or leaflet (PO:leaf lamina, PO:leaflet) per respective unit dry mass (TOP:leaf dry mass, TOP:leaf lamina dry mass, TOP:leaflet dry mass)
alternative label: leaf K content per dry mass
related match: CHEBI_26216

Leaf silicon content per leaf dry mass
type: Class
subclass of: Leaf trait
type: NamedIndividual
type: Concept
pref unit: mass unit / mass unit or amount unit / mass unit
related match: CHEBI_27573
related match: PO_0020049
related match: PO_0025034
related match: SEP_00055
reference: Eric Garnier, Jens Kattge, Stefan Klotz, Ingolf Kühn, Ulrike Stahl
alternative label: leaf Si content per dry mass
formal name: leaf silicon content per leaf dry mass
related match: PO_0020039
in scheme: Thesaurustrait
definition: The ratio of the quantity (SEP:quantity) of silicon (CHEBI:silicon atom) in the leaf (PO:leaf) or component thereof, i.e. leaf lamina or leaflet (PO:leaf lamina, PO:leaflet) per respective unit dry mass (TOP:leaf dry mass, TOP:leaf lamina dry mass, TOP:leaflet dry mass)
term status: stable

Leaf sulfur content per leaf dry mass
type: Class
subclass of: Leaf trait
type: NamedIndividual
type: Concept
related match: PO_0025034
related match: SEP_00055
pref unit: mass unit / mass unit or amount unit / mass unit
reference: Eric Garnier, Jens Kattge, Stefan Klotz, Ingolf Kühn, Ulrike Stahl
related match: PO_0020039
related match: CHEBI_26833
related match: PO_0020049
formal name: leaf sulfur content per leaf dry mass
in scheme: Thesaurustrait
term status: stable
alternative label: leaf S content per dry mass
definition: The ratio of the quantity (SEP:quantity) of sulfur (CHEBI:sulfur atom) in the leaf (PO:leaf) or component thereof, i.e. leaf lamina or leaflet (PO:leaf lamina, PO:leaflet) per respective unit dry mass (TOP:leaf dry mass, TOP:leaf lamina dry mass, TOP:leaflet dry mass)

Leaf zinc content per leaf dry mass
type: Class
subclass of: Leaf trait
type: NamedIndividual
type: Concept
related match: CHEBI_27363
reference: Eric Garnier, Jens Kattge, Stefan Klotz, Ingolf Kühn, Ulrike Stahl
pref unit: mass unit / mass unit or amount unit / mass unit
related match: SEP_00055
related match: PO_0020049
related match: PO_0025034
definition: The ratio of the quantity (SEP:quantity) of zinc (CHEBI:zinc atom) in the leaf (PO:leaf) or component thereof, i.e. leaf lamina or leaflet (PO:leaf lamina, PO:leaflet) per respective unit dry mass (TOP:leaf dry mass, TOP:leaf lamina dry mass, TOP:leaflet dry mass)
related match: PO_0020039
in scheme: Thesaurustrait
formal name: leaf zinc content per leaf dry mass
term status: stable
alternative label: leaf Zn content per dry mass

Leaf aluminium content per leaf area
type: Class
subclass of: Leaf trait
type: NamedIndividual
type: Concept
related match: SEP_00055
formal name: leaf aluminium content per leaf area
related match: PO_0020049
related match: PO_0025034
related match: PO_0020039
alternative label: leaf Al content per area
in scheme: Thesaurustrait
pref unit: mass unit / area unit or amount unit / area unit
definition: The ratio of the quantity (SEP:quantity) of aluminium (CHEBI:aluminium atom) in the leaf (PO:leaf) or component thereof, i.e. leaf lamina or leaflet (PO:leaf lamina, PO:leaflet) per respective area (TOP:leaf area, TOP:leaf lamina area, TOP:leaflet area)
reference: Eric Garnier, Jens Kattge, Stefan Klotz, Ingolf Kühn, Ulrike Stahl
term status: stable
related match: CHEBI_28984

Leaf boron content per leaf area
type: Class
subclass of: Leaf trait
type: NamedIndividual
type: Concept
related match: PO_0025034
related match: PO_0020049
related match: PO_0020039
term status: stable
in scheme: Thesaurustrait
pref unit: mass unit / area unit or amount unit / area unit
reference: Eric Garnier, Jens Kattge, Stefan Klotz, Ingolf Kühn, Ulrike Stahl
definition: The ratio of the quantity (SEP:quantity) of boron (CHEBI:boron atom) in the leaf (PO:leaf) or component thereof, i.e. leaf lamina or leaflet (PO:leaf lamina, PO:leaflet) per respective area (TOP:leaf area, TOP:leaf lamina area, TOP:leaflet area)
alternative label: leaf B content per area
related match: SEP_00055
related match: CHEBI_27560
formal name: leaf boron content per leaf area

Leaf relative water content
type: Class
subclass of: Leaf trait
type: NamedIndividual
type: Concept
formal name: leaf fresh mass minus leaf dry mass per leaf water saturated mass minus leaf dry mass
pref unit: mass unit / mass unit
term status: stable
reference: http://prometheuswiki.publish.csiro.au/tiki-index.php
definition: the ratio of the difference between leaf fresh mass (TOP:leaf fresh mass) and leaf dry mass (TOP:leaf dry mass) to the difference between leaf water saturated fresh mass and leaf dry mass
in scheme: Thesaurustrait

Leaf calcium content per leaf area
type: Class
subclass of: Leaf trait
type: NamedIndividual
type: Concept
related match: SEP_00055
related match: PO_0025034
reference: Eric Garnier, Jens Kattge, Stefan Klotz, Ingolf Kühn, Ulrike Stahl
related match: PO_0020039
term status: stable
related match: PO_0020049
alternative label: leaf Ca content per area
formal name: leaf calcium content per leaf area
in scheme: Thesaurustrait
related match: CHEBI_22984
definition: The ratio of the quantity (SEP:quantity) of calcium (CHEBI:calcium atom) in the leaf (PO:leaf) or component thereof, i.e. leaf lamina or leaflet (PO:leaf lamina, PO:leaflet) per respective area (TOP:leaf area, TOP:leaf lamina area, TOP:leaflet area)
pref unit: mass unit / area unit or amount unit / area unit

Leaf carbon content per leaf area
type: Class
subclass of: Leaf trait
type: NamedIndividual
type: Concept
related match: SEP_00055
related match: PO_0020049
term status: stable
related match: PO_0020039
definition: The ratio of the quantity (SEP:quantity) of carbon (CHEBI:carbon atom) in the leaf (PO:leaf) or component thereof, i.e. leaf lamina or leaflet (PO:leaf lamina, PO:leaflet) per respective area (TOP:leaf area, TOP:leaf lamina area, TOP:leaflet area)
related match: CHEBI_27594
alternative label: leaf C content per area
pref unit: mass unit / area unit or amount unit / area unit
reference: Eric Garnier, Jens Kattge, Stefan Klotz, Ingolf Kühn, Ulrike Stahl
in scheme: Thesaurustrait
related match: PO_0025034
formal name: leaf carbon content per leaf area

Leaf chlorine content per leaf area
type: Class
subclass of: Leaf trait
type: NamedIndividual
type: Concept
formal name: leaf chlorine content per leaf area
term status: stable
related match: SEP_00055
related match: PO_0020049
related match: CHEBI_23116
related match: PO_0020039
reference: Eric Garnier, Jens Kattge, Stefan Klotz, Ingolf Kühn, Ulrike Stahl
related match: PO_0025034
pref unit: mass unit / area unit or amount unit / area unit
definition: The ratio of the quantity (SEP:quantity) of chlorine (CHEBI:chlorine atom) in the leaf (PO:leaf) or component thereof, i.e. leaf lamina or leaflet (PO:leaf lamina, PO:leaflet) per respective area (TOP:leaf area, TOP:leaf lamina area, TOP:leaflet area)
in scheme: Thesaurustrait
alternative label: leaf Cl content per area

Leaf cobalt content per leaf area
type: Class
subclass of: Leaf trait
type: NamedIndividual
type: Concept
term status: stable
alternative label: leaf Co content per area
related match: SEP_00055
related match: CHEBI_27638
related match: PO_0020039
related match: PO_0020049
related match: PO_0025034
reference: Eric Garnier, Jens Kattge, Stefan Klotz, Ingolf Kühn, Ulrike Stahl
in scheme: Thesaurustrait
formal name: leaf cobalt content per leaf area
pref unit: mass unit / area unit or amount unit / area unit
definition: The ratio of the quantity (SEP:quantity) of cobalt (CHEBI:cobalt atom) in the leaf (PO:leaf) or component thereof, i.e. leaf lamina or leaflet (PO:leaf lamina, PO:leaflet) per respective area (TOP:leaf area, TOP:leaf lamina area, TOP:leaflet area)

Leaf copper content per leaf area
type: Class
subclass of: Leaf trait
type: NamedIndividual
type: Concept
formal name: leaf copper content per leaf area
in scheme: Thesaurustrait
term status: stable
alternative label: leaf Cu content per area
related match: SEP_00055
related match: PO_0020049
definition: The ratio of the quantity (SEP:quantity) of copper (CHEBI:copper atom) in the leaf (PO:leaf) or component thereof, i.e. leaf lamina or leaflet (PO:leaf lamina, PO:leaflet) per respective area (TOP:leaf area, TOP:leaf lamina area, TOP:leaflet area)
related match: PO_0025034
related match: PO_0020039
related match: CHEBI_28694
reference: Eric Garnier, Jens Kattge, Stefan Klotz, Ingolf Kühn, Ulrike Stahl
pref unit: mass unit / area unit or amount unit / area unit

Leaf iron content per leaf area
type: Class
subclass of: Leaf trait
type: NamedIndividual
type: Concept
in scheme: Thesaurustrait
term status: stable
pref unit: mass unit / area unit or amount unit / area unit
reference: Eric Garnier, Jens Kattge, Stefan Klotz, Ingolf Kühn, Ulrike Stahl
related match: PO_0025034
related match: SEP_00055
alternative label: leaf Fe content per area
related match: PO_0020049
formal name: leaf iron content per leaf area
related match: PO_0020039
definition: The ratio of the quantity (SEP:quantity) of iron (CHEBI:iron atom) in the leaf (PO:leaf) or component thereof, i.e. leaf lamina or leaflet (PO:leaf lamina, PO:leaflet) per respective area (TOP:leaf area, TOP:leaf lamina area, TOP:leaflet area)
related match: CHEBI_18248

Leaf magnesium content per leaf area
type: Class
subclass of: Leaf trait
type: NamedIndividual
type: Concept
term status: stable
in scheme: Thesaurustrait
related match: PO_0020049
reference: Eric Garnier, Jens Kattge, Stefan Klotz, Ingolf Kühn, Ulrike Stahl
alternative label: leaf Mg content per area
pref unit: mass unit / area unit or amount unit / area unit
related match: SEP_00055
related match: PO_0020039
related match: PO_0025034
formal name: leaf magnesium content per leaf area
related match: CHEBI_25107
definition: The ratio of the quantity (SEP:quantity) of magnesium (CHEBI:magnesium atom) in the leaf (PO:leaf) or component thereof, i.e. leaf lamina or leaflet (PO:leaf lamina, PO:leaflet) per respective area (TOP:leaf area, TOP:leaf lamina area, TOP:leaflet area)

Leaf manganese content per leaf area
type: Class
subclass of: Leaf trait
type: NamedIndividual
type: Concept
term status: stable
in scheme: Thesaurustrait
related match: CHEBI_18291
formal name: leaf manganese content per leaf area
definition: The ratio of the quantity (SEP:quantity) of manganese (CHEBI:manganese atom) in the leaf (PO:leaf) or component thereof, i.e. leaf lamina or leaflet (PO:leaf lamina, PO:leaflet) per respective area (TOP:leaf area, TOP:leaf lamina area, TOP:leaflet area)
reference: Eric Garnier, Jens Kattge, Stefan Klotz, Ingolf Kühn, Ulrike Stahl
related match: SEP_00055
pref unit: mass unit / area unit or amount unit / area unit
related match: PO_0020039
related match: PO_0020049
related match: PO_0025034
alternative label: leaf Mn content per area

Leaf molybdenum content per leaf area
type: Class
subclass of: Leaf trait
type: NamedIndividual
type: Concept
alternative label: leaf Mo content per dry mass
related match: CHEBI_28685
term status: stable
related match: SEP_00055
related match: PO_0025034
reference: Eric Garnier, Jens Kattge, Stefan Klotz, Ingolf Kühn, Ulrike Stahl
pref unit: mass unit / area unit or amount unit / area unit
related match: PO_0020039
formal name: leaf molybdenum content per leaf area
definition: The ratio of the quantity (SEP:quantity) of molybdenum (CHEBI:molybdenum atom) in the leaf (PO:leaf) or component thereof, i.e. leaf lamina or leaflet (PO:leaf lamina, PO:leaflet) per respective area (TOP:leaf area, TOP:leaf lamina area, TOP:leaflet area)
related match: PO_0020049
in scheme: Thesaurustrait

Leaf sodium content per leaf area
type: Class
subclass of: Leaf trait
type: NamedIndividual
type: Concept
term status: stable
definition: The ratio of the quantity (SEP:quantity) of sodium (CHEBI:sodium atom) in the leaf (PO:leaf) or component thereof, i.e. leaf lamina or leaflet (PO:leaf lamina, PO:leaflet) per respective area (TOP:leaf area, TOP:leaf lamina area, TOP:leaflet area)
formal name: leaf sodium content per leaf area
related match: CHEBI_26708
related match: SEP_00055
alternative label: leaf Na content per area
related match: PO_0020049
related match: PO_0020039
pref unit: mass unit / area unit or amount unit / area unit
related match: PO_0025034
in scheme: Thesaurustrait
reference: Eric Garnier, Jens Kattge, Stefan Klotz, Ingolf Kühn, Ulrike Stahl

Leaf lamina relative water content
type: Class
subclass of: Leaf trait
type: NamedIndividual
type: Concept
reference: http://prometheuswiki.publish.csiro.au/tiki-index.php
term status: stable
pref unit: mass unit / mass unit
definition: the ratio of the difference between leaf lamina fresh mass (TOP:leaf lamina fresh mass) and leaf lamina dry mass (TOP:leaf lamina dry mass) to the difference between leaf lamina water saturated fresh mass and the leaf lamina dry mass
formal name: leaf lamina fresh mass minus leaf lamina dry mass per leaf lamina water saturated mass minus leaf lamina dry mass
in scheme: Thesaurustrait

Leaf nickel content per leaf area
type: Class
subclass of: Leaf trait
type: NamedIndividual
type: Concept
related match: CHEBI_28112
term status: stable
in scheme: Thesaurustrait
pref unit: mass unit / area unit or amount unit / area unit
related match: SEP_00055
related match: PO_0025034
reference: Eric Garnier, Jens Kattge, Stefan Klotz, Ingolf Kühn, Ulrike Stahl
related match: PO_0020049
related match: PO_0020039
alternative label: leaf Ni content per area
formal name: leaf nickel content per leaf area
definition: The ratio of the quantity (SEP:quantity) of nickel (CHEBI:nickel atom) in the leaf (PO:leaf) or component thereof, i.e. leaf lamina or leaflet (PO:leaf lamina, PO:leaflet) per respective area (TOP:leaf area, TOP:leaf lamina area, TOP:leaflet area)

Leaf nitrogen content per leaf area
type: Class
subclass of: Leaf trait
type: NamedIndividual
type: Concept
definition: The ratio of the quantity (SEP:quantity) of nitrogen (CHEBI:nitrogen atom) in the leaf (PO:leaf) or component thereof, i.e. leaf lamina or leaflet (PO:leaf lamina, PO:leaflet) per respective area (TOP:leaf area, TOP:leaf lamina area, TOP:leaflet area)
related match: CHEBI_25555
term status: stable
alternative label: leaf N content per area
in scheme: Thesaurustrait
pref unit: mass unit / area unit or amount unit / area unit
reference: Eric Garnier, Jens Kattge, Stefan Klotz, Ingolf Kühn, Ulrike Stahl
related match: PO_0025034
related match: SEP_00055
formal name: leaf nitrogen content per leaf area
related match: PO_0020039
related match: PO_0020049

Leaf phosphorus content per leaf area
type: Class
subclass of: Leaf trait
type: NamedIndividual
type: Concept
term status: stable
pref unit: mass unit / area unit or amount unit / area unit
in scheme: Thesaurustrait
reference: Eric Garnier, Jens Kattge, Stefan Klotz, Ingolf Kühn, Ulrike Stahl
definition: The ratio of the quantity (SEP:quantity) of phosphorus (CHEBI:phosphorus atom) in the leaf (PO:leaf) or component thereof, i.e. leaf lamina or leaflet (PO:leaf lamina, PO:leaflet) per respective area (TOP:leaf area, TOP:leaf lamina area, TOP:leaflet area)
formal name: leaf phosphorus content per leaf area
related match: PO_0025034
related match: SEP_00055
alternative label: leaf P content per area
related match: PO_0020039
related match: PO_0020049
related match: CHEBI_28659

Leaf potassium content per leaf area
type: Class
subclass of: Leaf trait
type: NamedIndividual
type: Concept
related match: PO_0020039
pref unit: mass unit / area unit or amount unit / area unit
definition: The ratio of the quantity (SEP:quantity) of potassium (CHEBI:potassium atom) in the leaf (PO:leaf) or component thereof, i.e. leaf lamina or leaflet (PO:leaf lamina, PO:leaflet) per respective area (TOP:leaf area, TOP:leaf lamina area, TOP:leaflet area)
alternative label: leaf K content per area
in scheme: Thesaurustrait
reference: Eric Garnier, Jens Kattge, Stefan Klotz, Ingolf Kühn, Ulrike Stahl
formal name: leaf potassium content per leaf area
related match: CHEBI_26216
related match: PO_0025034
term status: stable
related match: PO_0020049
related match: SEP_00055

Leaf silicon content per leaf area
type: Class
subclass of: Leaf trait
type: NamedIndividual
type: Concept
related match: PO_0020049
related match: PO_0020039
reference: Eric Garnier, Jens Kattge, Stefan Klotz, Ingolf Kühn, Ulrike Stahl
definition: The ratio of the quantity (SEP:quantity) of silicon (CHEBI:silicon atom) in the leaf (PO:leaf) or component thereof, i.e. leaf lamina or leaflet (PO:leaf lamina, PO:leaflet) per respective area (TOP:leaf area, TOP:leaf lamina area, TOP:leaflet area)
in scheme: Thesaurustrait
pref unit: mass unit / area unit or amount unit / area unit
formal name: leaf silicon content per leaf area
term status: stable
related match: PO_0025034
related match: CHEBI_27573
related match: SEP_00055
alternative label: leaf Si content per area

Leaf sulfur content per leaf area
type: Class
subclass of: Leaf trait
type: NamedIndividual
type: Concept
related match: PO_0020039
definition: The ratio of the quantity (SEP:quantity) of sulfur (CHEBI:sulfur atom) in the leaf (PO:leaf) or component thereof, i.e. leaf lamina or leaflet (PO:leaf lamina, PO:leaflet) per respective area (TOP:leaf area, TOP:leaf lamina area, TOP:leaflet area)
related match: PO_0020049
related match: PO_0025034
reference: Eric Garnier, Jens Kattge, Stefan Klotz, Ingolf Kühn, Ulrike Stahl
pref unit: mass unit / area unit or amount unit / area unit
in scheme: Thesaurustrait
formal name: leaf sulfur content per leaf area
term status: stable
related match: CHEBI_26833
alternative label: leaf S content per area
related match: SEP_00055

Leaf zinc content per leaf area
type: Class
subclass of: Leaf trait
type: NamedIndividual
type: Concept
pref unit: mass unit / area unit or amount unit / area unit
formal name: leaf zinc content per leaf area
related match: PO_0020039
related match: PO_0025034
related match: PO_0020049
definition: The ratio of the quantity (SEP:quantity) of zinc (CHEBI:zinc atom) in the leaf (PO:leaf) or component thereof, i.e. leaf lamina or leaflet (PO:leaf lamina, PO:leaflet) per respective area (TOP:leaf area, TOP:leaf lamina area, TOP:leaflet area)
reference: Eric Garnier, Jens Kattge, Stefan Klotz, Ingolf Kühn, Ulrike Stahl
in scheme: Thesaurustrait
term status: stable
alternative label: leaf Zn content per area
related match: SEP_00055
related match: CHEBI_27363

Stem aluminium content per stem dry mass
type: Class
subclass of: Stem and branch trait
type: NamedIndividual
type: Concept
related match: PATO_0000125
pref unit: mass unit / mass unit or amount unit / mass unit
formal name: stem aluminium content per stem dry mass
alternative label: stem Al content per dry mass
reference: Eric Garnier, Jens Kattge, Stefan Klotz, Ingolf Kühn, Ulrike Stahl
in scheme: Thesaurustrait
term status: stable
definition: The ratio of the quantity (SEP:quantity) of aluminium (CHEBI:aluminium atom) in the stem (PO:stem) to the corresponding stem (PO:stem) mass (PATO:mass) assessed after drying
related match: CHEBI_28984
related match: PO_0009047
related match: SEP_00055

Stem boron content per stem dry mass
type: Class
subclass of: Stem and branch trait
type: NamedIndividual
type: Concept
pref unit: mass unit / mass unit or amount unit / mass unit
related match: PATO_0000125
related match: CHEBI_27560
alternative label: stem B content per dry mass
reference: Eric Garnier, Jens Kattge, Stefan Klotz, Ingolf Kühn, Ulrike Stahl
in scheme: Thesaurustrait
term status: stable
related match: PO_0009047
definition: The ratio of the quantity (SEP:quantity) of boron (CHEBI:boron atom) in the stem (PO:stem) to the corresponding stem (PO:stem) mass (PATO:mass) assessed after drying
related match: SEP_00055
formal name: stem boron content per stem dry mass

Specific leaf area trait
type: Class
subclass of: Leaf trait
type: NamedIndividual
type: Concept
pref unit: area unit / mass unit
abbreviation: SLA
definition: the ratio of the area of a leaf (TOP:leaf area) or component thereof, i.e. leaf lamina (TOP:leaf lamina area), to the corresponding dry mass (TOP:leaf dry mass, TOP:leaf lamina dry mass)
term status: stable
reference: Eric Garnier, Jens Kattge, Stefan Klotz, Ingolf Kühn, Ulrike Stahl
formal name: leaf area per leaf dry mass trait
in scheme: Thesaurustrait

Stem calcium content per stem dry mass
type: Class
subclass of: Stem and branch trait
type: NamedIndividual
type: Concept
alternative label: stem Ca content per dry mass
pref unit: mass unit / mass unit or amount unit / mass unit
related match: SEP_00055
reference: Eric Garnier, Jens Kattge, Stefan Klotz, Ingolf Kühn, Ulrike Stahl
related match: PATO_0000125
formal name: stem calcium content per stem dry mass
related match: PO_0009047
in scheme: Thesaurustrait
term status: stable
definition: The ratio of the quantity (SEP:quantity) of calcium (CHEBI:calcium atom) in the stem (PO:stem) to the corresponding stem (PO:stem) mass (PATO:mass) assessed after drying
related match: CHEBI_22984

Stem carbon content per stem dry mass
type: Class
subclass of: Stem and branch trait
type: NamedIndividual
type: Concept
related match: CHEBI_27594
related match: SEP_00055
pref unit: mass unit / mass unit or amount unit / mass unit
reference: Eric Garnier, Jens Kattge, Stefan Klotz, Ingolf Kühn, Ulrike Stahl
related match: PATO_0000125
definition: The ratio of the quantity (SEP:quantity) of carbon (CHEBI:carbon atom) in the stem (PO:stem) to the corresponding stem (PO:stem) mass (PATO:mass) assessed after drying
alternative label: stem C content per dry mass
related match: PO_0009047
in scheme: Thesaurustrait
term status: stable
formal name: stem carbon content per stem dry mass

Stem chlorine content per stem dry mass
type: Class
subclass of: Stem and branch trait
type: NamedIndividual
type: Concept
reference: Eric Garnier, Jens Kattge, Stefan Klotz, Ingolf Kühn, Ulrike Stahl
pref unit: mass unit / mass unit or amount unit / mass unit
related match: SEP_00055
related match: PATO_0000125
definition: The ratio of the quantity (SEP:quantity) of chlorine (CHEBI:chlorine atom) in the stem (PO:stem) to the corresponding stem (PO:stem) mass (PATO:mass) assessed after drying
formal name: stem chlorine content per stem dry mass
related match: CHEBI_23116
alternative label: stem Cl content per dry mass
related match: PO_0009047
term status: stable
in scheme: Thesaurustrait

Stem cobalt content per stem dry mass
type: Class
subclass of: Stem and branch trait
type: NamedIndividual
type: Concept
related match: SEP_00055
formal name: stem cobalt content per stem dry mass
related match: PATO_0000125
definition: The ratio of the quantity (SEP:quantity) of cobalt (CHEBI:cobalt atom) in the stem (PO:stem) to the corresponding stem (PO:stem) mass (PATO:mass) assessed after drying
related match: CHEBI_27638
related match: PO_0009047
term status: stable
in scheme: Thesaurustrait
pref unit: mass unit / mass unit or amount unit / mass unit
reference: Eric Garnier, Jens Kattge, Stefan Klotz, Ingolf Kühn, Ulrike Stahl
alternative label: stem Co content per dry mass

Stem copper content per stem dry mass
type: Class
subclass of: Stem and branch trait
type: NamedIndividual
type: Concept
definition: The ratio of the quantity (SEP:quantity) of copper (CHEBI:copper atom) in the stem (PO:stem) to the corresponding stem (PO:stem) mass (PATO:mass) assessed after drying
related match: PATO_0000125
related match: SEP_00055
formal name: stem copper content per stem dry mass
related match: PO_0009047
related match: CHEBI_28694
in scheme: Thesaurustrait
term status: stable
pref unit: mass unit / mass unit or amount unit / mass unit
alternative label: stem Cu content per dry mass
reference: Eric Garnier, Jens Kattge, Stefan Klotz, Ingolf Kühn, Ulrike Stahl

Stem iron content per stem dry mass
type: Class
subclass of: Stem and branch trait
type: NamedIndividual
type: Concept
definition: The ratio of the quantity (SEP:quantity) of iron (CHEBI:iron atom) in the stem (PO:stem) to the corresponding stem (PO:stem) mass (PATO:mass) assessed after drying
alternative label: stem Fe content per dry mass
related match: SEP_00055
related match: PATO_0000125
related match: PO_0009047
pref unit: mass unit / mass unit or amount unit / mass unit
in scheme: Thesaurustrait
term status: stable
reference: Eric Garnier, Jens Kattge, Stefan Klotz, Ingolf Kühn, Ulrike Stahl
formal name: stem iron content per stem dry mass
related match: CHEBI_18248

Stem magnesium content per stem dry mass
type: Class
subclass of: Stem and branch trait
type: NamedIndividual
type: Concept
definition: The ratio of the quantity (SEP:quantity) of magnesium (CHEBI:magnesium atom) in the stem (PO:stem) to the corresponding stem (PO:stem) mass (PATO:mass) assessed after drying
alternative label: stem Mg content per dry mass
related match: SEP_00055
related match: PATO_0000125
related match: CHEBI_25107
related match: PO_0009047
reference: Eric Garnier, Jens Kattge, Stefan Klotz, Ingolf Kühn, Ulrike Stahl
pref unit: mass unit / mass unit or amount unit / mass unit
term status: stable
formal name: stem magnesium content per stem dry mass
in scheme: Thesaurustrait

Stem manganese content per stem dry mass
type: Class
subclass of: Stem and branch trait
type: NamedIndividual
type: Concept
definition: The ratio of the quantity (SEP:quantity) of manganese (CHEBI:manganese atom) in the stem (PO:stem) to the corresponding stem (PO:stem) mass (PATO:mass) assessed after drying
term status: stable
formal name: stem manganese content per stem dry mass
related match: CHEBI_18291
related match: SEP_00055
related match: PATO_0000125
alternative label: stem Mn content per dry mass
pref unit: mass unit / mass unit or amount unit / mass unit
related match: PO_0009047
reference: Eric Garnier, Jens Kattge, Stefan Klotz, Ingolf Kühn, Ulrike Stahl
in scheme: Thesaurustrait

Stem molybdenum content per stem dry mass
type: Class
subclass of: Stem and branch trait
type: NamedIndividual
type: Concept
formal name: stem molybdenum content per stem dry mass
term status: stable
related match: CHEBI_28685
definition: The ratio of the quantity (SEP:quantity) of molybdenum (CHEBI:molybdenum atom) in the stem (PO:stem) to the corresponding stem (PO:stem) mass (PATO:mass) assessed after drying
related match: PATO_0000125
related match: SEP_00055
alternative label: stem Mo content per dry mass
pref unit: mass unit / mass unit or amount unit / mass unit
related match: PO_0009047
in scheme: Thesaurustrait
reference: Eric Garnier, Jens Kattge, Stefan Klotz, Ingolf Kühn, Ulrike Stahl

Stem sodium content per stem dry mass
type: Class
subclass of: Stem and branch trait
type: NamedIndividual
type: Concept
alternative label: stem Na content per dry mass
term status: stable
formal name: stem sodium content per stem dry mass
related match: SEP_00055
related match: PATO_0000125
related match: CHEBI_26708
related match: PO_0009047
pref unit: mass unit / mass unit or amount unit / mass unit
definition: The ratio of the quantity (SEP:quantity) of sodium (CHEBI:sodium atom) in the stem (PO:stem) to the corresponding stem (PO:stem) mass (PATO:mass) assessed after drying
in scheme: Thesaurustrait
reference: Eric Garnier, Jens Kattge, Stefan Klotz, Ingolf Kühn, Ulrike Stahl

Shoot trait
type: Class
subclass of: Plant trait
type: NamedIndividual
type: Concept
in scheme: Thesaurustrait
term status: testing
reference: Eric Garnier, Jens Kattge, Stefan Klotz, Ingolf Kühn, Ulrike Stahl
definition: a plant trait (TOP:plant trait) referring to the shoot system (PO:shoot system)

Specific leaf area
type: Class
subclass of: Specific leaf area trait
type: NamedIndividual
type: Concept
definition: the ratio of the area of a leaf (TOP:leaf area) to its dry mass (TOP:leaf dry mass)
reference: Eric Garnier, Jens Kattge, Stefan Klotz, Ingolf Kühn, Ulrike Stahl
term status: stable
pref unit: area unit / mass unit
abbreviation: SLA
in scheme: Thesaurustrait
formal name: leaf area per leaf dry mass

Stem nickel content per stem dry mass
type: Class
subclass of: Stem and branch trait
type: NamedIndividual
type: Concept
definition: The ratio of the quantity (SEP:quantity) of nickel (CHEBI:nickel atom) in the stem (PO:stem) to the corresponding stem (PO:stem) mass (PATO:mass) assessed after drying
pref unit: mass unit / mass unit or amount unit / mass unit
related match: PATO_0000125
formal name: stem nickel content per stem dry mass
alternative label: stem Ni content per dry mass
in scheme: Thesaurustrait
reference: Eric Garnier, Jens Kattge, Stefan Klotz, Ingolf Kühn, Ulrike Stahl
term status: stable
related match: CHEBI_28112
related match: PO_0009047
related match: SEP_00055

Stem nitrogen content per stem dry mass
type: Class
subclass of: Stem and branch trait
type: NamedIndividual
type: Concept
definition: The ratio of the quantity (SEP:quantity) of nitrogen (CHEBI:nitrogen atom) in the stem (PO:stem) to the corresponding stem (PO:stem) mass (PATO:mass) assessed after drying
related match: SEP_00055
pref unit: mass unit / mass unit or amount unit / mass unit
in scheme: Thesaurustrait
reference: Eric Garnier, Jens Kattge, Stefan Klotz, Ingolf Kühn, Ulrike Stahl
formal name: stem nitrogen content per stem dry mass
term status: stable
related match: CHEBI_25555
related match: PO_0009047
related match: PATO_0000125
alternative label: stem N content per dry mass

Stem phosphorus content per stem dry mass
type: Class
subclass of: Stem and branch trait
type: NamedIndividual
type: Concept
pref unit: mass unit / mass unit or amount unit / mass unit
term status: stable
in scheme: Thesaurustrait
reference: Eric Garnier, Jens Kattge, Stefan Klotz, Ingolf Kühn, Ulrike Stahl
related match: PO_0009047
definition: The ratio of the quantity (SEP:quantity) of phosphorus (CHEBI:phosphorus atom) in the stem (PO:stem) to the corresponding stem (PO:stem) mass (PATO:mass) assessed after drying
alternative label: stem P content per dry mass
related match: PATO_0000125
related match: CHEBI_28659
formal name: stem phosphorus content per stem dry mass
related match: SEP_00055

Stem potassium content per stem dry mass
type: Class
subclass of: Stem and branch trait
type: NamedIndividual
type: Concept
alternative label: stem K content per dry mass
pref unit: mass unit / mass unit or amount unit / mass unit
term status: stable
formal name: stem potassium content per stem dry mass
reference: Eric Garnier, Jens Kattge, Stefan Klotz, Ingolf Kühn, Ulrike Stahl
in scheme: Thesaurustrait
related match: PO_0009047
definition: The ratio of the quantity (SEP:quantity) of potassium (CHEBI:potassium atom) in the stem (PO:stem) to the corresponding stem (PO:stem) mass (PATO:mass) assessed after drying
related match: CHEBI_26216
related match: PATO_0000125
related match: SEP_00055

Stem silicon content per stem dry mass
type: Class
subclass of: Stem and branch trait
type: NamedIndividual
type: Concept
alternative label: stem Si content per dry mass
pref unit: mass unit / mass unit or amount unit / mass unit
related match: CHEBI_27573
term status: stable
in scheme: Thesaurustrait
formal name: stem silicon content per stem dry mass
reference: Eric Garnier, Jens Kattge, Stefan Klotz, Ingolf Kühn, Ulrike Stahl
related match: PO_0009047
related match: PATO_0000125
related match: SEP_00055
definition: The ratio of the quantity (SEP:quantity) of silicon (CHEBI:silicon atom) in the stem (PO:stem) to the corresponding stem (PO:stem) mass (PATO:mass) assessed after drying

Stem sulfur content per stem dry mass
type: Class
subclass of: Stem and branch trait
type: NamedIndividual
type: Concept
related match: CHEBI_26833
definition: The ratio of the quantity (SEP:quantity) of sulfur (CHEBI:sulfur atom) in the stem (PO:stem) to the corresponding stem (PO:stem) mass (PATO:mass) assessed after drying
in scheme: Thesaurustrait
reference: Eric Garnier, Jens Kattge, Stefan Klotz, Ingolf Kühn, Ulrike Stahl
term status: stable
related match: PO_0009047
alternative label: stem S content per dry mass
formal name: stem sulfur content per stem dry mass
pref unit: mass unit / mass unit or amount unit / mass unit
related match: SEP_00055
related match: PATO_0000125

Stem zinc content per stem dry mass
type: Class
subclass of: Stem and branch trait
type: NamedIndividual
type: Concept
related match: CHEBI_27363
reference: Eric Garnier, Jens Kattge, Stefan Klotz, Ingolf Kühn, Ulrike Stahl
in scheme: Thesaurustrait
formal name: stem zinc content per stem dry mass
alternative label: stem Zn content per dry mass
term status: stable
related match: PO_0009047
pref unit: mass unit / mass unit or amount unit / mass unit
related match: SEP_00055
definition: The ratio of the quantity (SEP:quantity) of zinc (CHEBI:zinc atom) in the stem (PO:stem) to the corresponding stem (PO:stem) mass (PATO:mass) assessed after drying
related match: PATO_0000125

Plant aluminium content per plant dry mass
type: Class
subclass of: Whole plant trait
type: NamedIndividual
type: Concept
related match: PO_0000003
definition: The ratio of the quantity (SEP:quantity) of aluminium (CHEBI:aluminium atom) in the whole plant (PO:whole plant) to the corresponding whole plant (PO:whole plant) mass (PATO:mass) assessed after drying
reference: Eric Garnier, Jens Kattge, Stefan Klotz, Ingolf Kühn, Ulrike Stahl
in scheme: Thesaurustrait
term status: stable
alternative label: whole plant Al content per dry mass
formal name: whole plant aluminium content per plant dry mass
pref unit: mass unit / mass unit or amount unit / mass unit
related match: SEP_00055
related match: CHEBI_28984
related match: PATO_0000125

Plant boron content per plant dry mass
type: Class
subclass of: Whole plant trait
type: NamedIndividual
type: Concept
formal name: whole plant boron content per plant dry mass
related match: PO_0000003
in scheme: Thesaurustrait
alternative label: whole plant B content per dry mass
reference: Eric Garnier, Jens Kattge, Stefan Klotz, Ingolf Kühn, Ulrike Stahl
term status: stable
pref unit: mass unit / mass unit or amount unit / mass unit
related match: CHEBI_27560
related match: SEP_00055
definition: The ratio of the quantity (SEP:quantity) of boron (CHEBI:boron atom) in the whole plant (PO:whole plant) to the corresponding whole plant (PO:whole plant) mass (PATO:mass) assessed after drying
related match: PATO_0000125

Plant calcium content per plant dry mass
type: Class
subclass of: Whole plant trait
type: NamedIndividual
type: Concept
in scheme: Thesaurustrait
related match: PO_0000003
term status: stable
related match: PATO_0000125
pref unit: mass unit / mass unit or amount unit / mass unit
reference: Eric Garnier, Jens Kattge, Stefan Klotz, Ingolf Kühn, Ulrike Stahl
related match: CHEBI_22984
definition: The ratio of the quantity (SEP:quantity) of calcium (CHEBI:calcium atom) in the whole plant (PO:whole plant) to the corresponding whole plant (PO:whole plant) mass (PATO:mass) assessed after drying
formal name: whole plant calcium content per plant dry mass
alternative label: whole plant Ca content per dry mass
related match: SEP_00055

Specific leaf lamina area
type: Class
subclass of: Specific leaf area trait
type: NamedIndividual
type: Concept
pref unit: area unit / mass unit
formal name: leaf lamina area per leaf lamina dry mass
term status: stable
reference: Eric Garnier, Jens Kattge, Stefan Klotz, Ingolf Kühn, Ulrike Stahl
in scheme: Thesaurustrait
definition: the ratio of the area of the leaf lamina (TOP:leaf lamina area) to its dry mass (TOP:leaf lamina dry mass)

Plant carbon content per plant dry mass
type: Class
subclass of: Whole plant trait
type: NamedIndividual
type: Concept
term status: stable
formal name: whole plant carbon content per plant dry mass
related match: SEP_00055
related match: PATO_0000125
related match: CHEBI_27594
pref unit: mass unit / mass unit or amount unit / mass unit
definition: The ratio of the quantity (SEP:quantity) of carbon (CHEBI:carbon atom) in the whole plant (PO:whole plant) to the corresponding whole plant (PO:whole plant) mass (PATO:mass) assessed after drying
alternative label: whole plant C content per dry mass
in scheme: Thesaurustrait
related match: PO_0000003
reference: Eric Garnier, Jens Kattge, Stefan Klotz, Ingolf Kühn, Ulrike Stahl

Plant chlorine content per plant dry mass
type: Class
subclass of: Whole plant trait
type: NamedIndividual
type: Concept
in scheme: Thesaurustrait
term status: stable
alternative label: whole plant Cl content per dry mass
related match: CHEBI_23116
related match: SEP_00055
related match: PATO_0000125
formal name: whole plant chlorine content per plant dry mass
pref unit: mass unit / mass unit or amount unit / mass unit
definition: The ratio of the quantity (SEP:quantity) of chlorine (CHEBI:chlorine atom) in the whole plant (PO:whole plant) to the corresponding whole plant (PO:whole plant) mass (PATO:mass) assessed after drying
related match: PO_0000003
reference: Eric Garnier, Jens Kattge, Stefan Klotz, Ingolf Kühn, Ulrike Stahl

Plant cobalt content per plant dry mass
type: Class
subclass of: Whole plant trait
type: NamedIndividual
type: Concept
term status: stable
in scheme: Thesaurustrait
definition: The ratio of the quantity (SEP:quantity) of cobalt (CHEBI:cobalt atom) in the whole plant (PO:whole plant) to the corresponding whole plant (PO:whole plant) mass (PATO:mass) assessed after drying
related match: SEP_00055
related match: PATO_0000125
reference: Eric Garnier, Jens Kattge, Stefan Klotz, Ingolf Kühn, Ulrike Stahl
formal name: whole plant cobalt content per plant dry mass
pref unit: mass unit / mass unit or amount unit / mass unit
related match: PO_0000003
alternative label: whole plant Co content per dry mass
related match: CHEBI_27638

Plant copper content per plant dry mass
type: Class
subclass of: Whole plant trait
type: NamedIndividual
type: Concept
related match: CHEBI_28694
related match: PATO_0000125
related match: SEP_00055
reference: Eric Garnier, Jens Kattge, Stefan Klotz, Ingolf Kühn, Ulrike Stahl
definition: The ratio of the quantity (SEP:quantity) of copper (CHEBI:copper atom) in the whole plant (PO:whole plant) to the corresponding whole plant (PO:whole plant) mass (PATO:mass) assessed after drying
alternative label: whole plant Cu content per dry mass
pref unit: mass unit / mass unit or amount unit / mass unit
formal name: whole plant copper content per plant dry mass
related match: PO_0000003
in scheme: Thesaurustrait
term status: stable

Plant iron content per plant dry mass
type: Class
subclass of: Whole plant trait
type: NamedIndividual
type: Concept
alternative label: whole plant Fe content per dry mass
formal name: whole plant iron content per plant dry mass
related match: PATO_0000125
related match: SEP_00055
reference: Eric Garnier, Jens Kattge, Stefan Klotz, Ingolf Kühn, Ulrike Stahl
definition: The ratio of the quantity (SEP:quantity) of iron (CHEBI:iron atom) in the whole plant (PO:whole plant) to the corresponding whole plant (PO:whole plant) mass (PATO:mass) assessed after drying
related match: CHEBI_18248
pref unit: mass unit / mass unit or amount unit / mass unit
related match: PO_0000003
in scheme: Thesaurustrait
term status: stable

Plant magnesium content per plant dry mass
type: Class
subclass of: Whole plant trait
type: NamedIndividual
type: Concept
alternative label: whole plant Mg content per dry mass
related match: SEP_00055
related match: PATO_0000125
definition: The ratio of the quantity (SEP:quantity) of magnesium (CHEBI:magnesium atom) in the whole plant (PO:whole plant) to the corresponding whole plant (PO:whole plant) mass (PATO:mass) assessed after drying
pref unit: mass unit / mass unit or amount unit / mass unit
related match: PO_0000003
in scheme: Thesaurustrait
reference: Eric Garnier, Jens Kattge, Stefan Klotz, Ingolf Kühn, Ulrike Stahl
related match: CHEBI_25107
formal name: whole plant magnesium content per plant dry mass
term status: stable

Plant manganese content per plant dry mass
type: Class
subclass of: Whole plant trait
type: NamedIndividual
type: Concept
formal name: whole plant manganese content per plant dry mass
alternative label: whole plant Mn content per dry mass
related match: CHEBI_18291
related match: PATO_0000125
pref unit: mass unit / mass unit or amount unit / mass unit
related match: SEP_00055
definition: The ratio of the quantity (SEP:quantity) of manganese (CHEBI:manganese atom) in the whole plant (PO:whole plant) to the corresponding whole plant (PO:whole plant) mass (PATO:mass) assessed after drying
reference: Eric Garnier, Jens Kattge, Stefan Klotz, Ingolf Kühn, Ulrike Stahl
related match: PO_0000003
in scheme: Thesaurustrait
term status: stable

Plant molybdenum content per plant dry mass
type: Class
subclass of: Whole plant trait
type: NamedIndividual
type: Concept
alternative label: whole plant Mo content per dry mass
pref unit: mass unit / mass unit or amount unit / mass unit
related match: PATO_0000125
related match: CHEBI_28685
definition: The ratio of the quantity (SEP:quantity) of molybdenum (CHEBI:molybdenum atom) in the whole plant (PO:whole plant) to the corresponding whole plant (PO:whole plant) mass (PATO:mass) assessed after drying
related match: SEP_00055
formal name: whole plant molybdenum content per plant dry mass
related match: PO_0000003
reference: Eric Garnier, Jens Kattge, Stefan Klotz, Ingolf Kühn, Ulrike Stahl
in scheme: Thesaurustrait
term status: stable

Plant sodium content per plant dry mass
type: Class
subclass of: Whole plant trait
type: NamedIndividual
type: Concept
related match: CHEBI_26708
related match: PATO_0000125
pref unit: mass unit / mass unit or amount unit / mass unit
related match: SEP_00055
related match: PO_0000003
alternative label: whole plant Na content per dry mass
reference: Eric Garnier, Jens Kattge, Stefan Klotz, Ingolf Kühn, Ulrike Stahl
definition: The ratio of the quantity (SEP:quantity) of sodium (CHEBI:sodium atom) in the whole plant (PO:whole plant) to the corresponding whole plant (PO:whole plant) mass (PATO:mass) assessed after drying
in scheme: Thesaurustrait
formal name: whole plant sodium content per plant dry mass
term status: stable

Plant nickel content per plant dry mass
type: Class
subclass of: Whole plant trait
type: NamedIndividual
type: Concept
alternative label: whole plant Ni content per dry mass
definition: The ratio of the quantity (SEP:quantity) of nickel (CHEBI:nickel atom) in the whole plant (PO:whole plant) to the corresponding whole plant (PO:whole plant) mass (PATO:mass) assessed after drying
pref unit: mass unit / mass unit or amount unit / mass unit
related match: SEP_00055
related match: PATO_0000125
related match: CHEBI_28112
formal name: whole plant nickel content per plant dry mass
related match: PO_0000003
in scheme: Thesaurustrait
reference: Eric Garnier, Jens Kattge, Stefan Klotz, Ingolf Kühn, Ulrike Stahl
term status: stable

Leaf mass per area trait
type: Class
subclass of: Leaf trait
type: NamedIndividual
type: Concept
pref unit: mass unit / area unit
definition: the ratio of the dry mass of a leaf (TOP:leaf dry mass) or component thereof, i.e. leaf lamina (TOP:leaf lamina dry mass), to the corresponding area (TOP:leaf area, TOP:leaf lamina area)
term status: stable
alternative label: specific leaf weight
in scheme: Thesaurustrait
reference: Eric Garnier, Jens Kattge, Stefan Klotz, Ingolf Kühn, Ulrike Stahl
formal name: leaf dry mass per leaf area trait
abbreviation: LMA

Plant nitrogen content per plant dry mass
type: Class
subclass of: Whole plant trait
type: NamedIndividual
type: Concept
related match: CHEBI_25555
pref unit: mass unit / mass unit or amount unit / mass unit
term status: stable
in scheme: Thesaurustrait
related match: PO_0000003
reference: Eric Garnier, Jens Kattge, Stefan Klotz, Ingolf Kühn, Ulrike Stahl
formal name: whole plant nitrogen content per plant dry mass
definition: The ratio of the quantity (SEP:quantity) of nitrogen (CHEBI:nitrogen atom) in the whole plant (PO:whole plant) to the corresponding whole plant (PO:whole plant) mass (PATO:mass) assessed after drying
alternative label: whole plant N content per dry mass
related match: PATO_0000125
related match: SEP_00055

Plant phosphorus content per plant dry mass
type: Class
subclass of: Whole plant trait
type: NamedIndividual
type: Concept
pref unit: mass unit / mass unit or amount unit / mass unit
formal name: whole plant phosphorus content per plant dry mass
in scheme: Thesaurustrait
reference: Eric Garnier, Jens Kattge, Stefan Klotz, Ingolf Kühn, Ulrike Stahl
term status: stable
related match: CHEBI_28659
related match: PO_0000003
definition: The ratio of the quantity (SEP:quantity) of phosphorus (CHEBI:phosphorus atom) in the whole plant (PO:whole plant) to the corresponding whole plant (PO:whole plant) mass (PATO:mass) assessed after drying
alternative label: whole plant P content per dry mass
related match: SEP_00055
related match: PATO_0000125

Plant potassium content per plant dry mass
type: Class
subclass of: Whole plant trait
type: NamedIndividual
type: Concept
formal name: whole plant potassium content per plant dry mass
pref unit: mass unit / mass unit or amount unit / mass unit
alternative label: whole plant K content per dry mass
reference: Eric Garnier, Jens Kattge, Stefan Klotz, Ingolf Kühn, Ulrike Stahl
term status: stable
related match: PO_0000003
in scheme: Thesaurustrait
definition: The ratio of the quantity (SEP:quantity) of potassium (CHEBI:potassium atom) in the whole plant (PO:whole plant) to the corresponding whole plant (PO:whole plant) mass (PATO:mass) assessed after drying
related match: SEP_00055
related match: CHEBI_26216
related match: PATO_0000125

Plant silicon content per plant dry mass
type: Class
subclass of: Whole plant trait
type: NamedIndividual
type: Concept
related match: PATO_0000125
pref unit: mass unit / mass unit or amount unit / mass unit
reference: Eric Garnier, Jens Kattge, Stefan Klotz, Ingolf Kühn, Ulrike Stahl
alternative label: whole plant Si content per dry mass
related match: CHEBI_27573
formal name: whole plant silicon content per plant dry mass
term status: stable
in scheme: Thesaurustrait
related match: PO_0000003
definition: The ratio of the quantity (SEP:quantity) of silicon (CHEBI:silicon atom) in the whole plant (PO:whole plant) to the corresponding whole plant (PO:whole plant) mass (PATO:mass) assessed after drying
related match: SEP_00055

Plant sulfur content per plant dry mass
type: Class
subclass of: Whole plant trait
type: NamedIndividual
type: Concept
alternative label: whole plant S content per dry mass
pref unit: mass unit / mass unit or amount unit / mass unit
related match: SEP_00055
reference: Eric Garnier, Jens Kattge, Stefan Klotz, Ingolf Kühn, Ulrike Stahl
definition: The ratio of the quantity (SEP:quantity) of sulfur (CHEBI:sulfur atom) in the whole plant (PO:whole plant) to the corresponding whole plant (PO:whole plant) mass (PATO:mass) assessed after drying
formal name: whole plant sulfur content per plant dry mass
term status: stable
related match: PO_0000003
in scheme: Thesaurustrait
related match: PATO_0000125
related match: CHEBI_26833

Plant zinc content per plant dry mass
type: Class
subclass of: Whole plant trait
type: NamedIndividual
type: Concept
related match: SEP_00055
related match: CHEBI_27363
pref unit: mass unit / mass unit or amount unit / mass unit
reference: Eric Garnier, Jens Kattge, Stefan Klotz, Ingolf Kühn, Ulrike Stahl
alternative label: whole plant Zn content per dry mass
related match: PO_0000003
term status: stable
in scheme: Thesaurustrait
formal name: whole plant zinc content per plant dry mass
definition: The ratio of the quantity (SEP:quantity) of zinc (CHEBI:zinc atom) in the whole plant (PO:whole plant) to the corresponding whole plant (PO:whole plant) mass (PATO:mass) assessed after drying
related match: PATO_0000125

Leaf mass per area
type: Class
subclass of: Leaf mass per area trait
type: NamedIndividual
type: Concept
definition: the ratio of the dry mass of a leaf (TOP:leaf dry mass) to its area (TOP:leaf area)
pref unit: mass unit / area unit
term status: stable
reference: Eric Garnier, Jens Kattge, Stefan Klotz, Ingolf Kühn, Ulrike Stahl
in scheme: Thesaurustrait
formal name: leaf dry mass per leaf area
abbreviation: LMA

Leaf lamina mass per area
type: Class
subclass of: Leaf mass per area trait
type: NamedIndividual
type: Concept
definition: the ratio of the dry mass of the leaf lamina (TOP:leaf lamina dry mass) to its area (TOP:leaf lamina area)
term status: stable
pref unit: mass unit / area unit
formal name: leaf lamina dry mass per leaf lamina area
reference: Eric Garnier, Jens Kattge, Stefan Klotz, Ingolf Kühn, Ulrike Stahl
in scheme: Thesaurustrait

Fine root aluminium content per fine root dry mass
type: Class
subclass of: Root aluminum content per root dry mass trait
type: NamedIndividual
type: Concept
related match: PATO_0000125
in scheme: Thesaurustrait
reference: Eric Garnier, Jens Kattge, Stefan Klotz, Ingolf Kühn, Ulrike Stahl
definition: The ratio of the quantity (SEP:quantity) of aluminium (CHEBI:aluminium atom) in the fine root (McCormack:fine root) to the corresponding fine root mass (PATO:mass) assessed after drying
alternative label: fine root Al content per dry mass
related match: SEP_00055
pref unit: mass unit / mass unit or amount unit / mass unit
term status: stable
formal name: fine root aluminium content per fine root dry mass
related match: CHEBI_28984

Fine root boron content per fine root dry mass
type: Class
subclass of: Root boron content per root dry mass trait
type: NamedIndividual
type: Concept
formal name: fine root boron content per fine root dry mass
pref unit: mass unit / mass unit or amount unit / mass unit
term status: stable
alternative label: fine root B content per dry mass
related match: PATO_0000125
related match: SEP_00055
reference: Eric Garnier, Jens Kattge, Stefan Klotz, Ingolf Kühn, Ulrike Stahl
in scheme: Thesaurustrait
definition: The ratio of the quantity (SEP:quantity) of boron (CHEBI:boron atom) in the fine root (McCormack:fine root) to the corresponding fine root mass (PATO:mass) assessed after drying
related match: CHEBI_27560

Fine root calcium content per fine root dry mass
type: Class
subclass of: Root calcium content per root dry mass trait
type: NamedIndividual
type: Concept
related match: PATO_0000125
term status: stable
in scheme: Thesaurustrait
pref unit: mass unit / mass unit or amount unit / mass unit
related match: CHEBI_22984
related match: SEP_00055
definition: The ratio of the quantity (SEP:quantity) of calcium (CHEBI:calcium atom) in the fine root (McCormack:fine root) to the corresponding fine root mass (PATO:mass) assessed after drying
reference: Eric Garnier, Jens Kattge, Stefan Klotz, Ingolf Kühn, Ulrike Stahl
alternative label: fine root Ca content per dry mass
formal name: fine root calcium content per fine root dry mass

Fine root carbon content per fine root dry mass
type: Class
subclass of: Root carbon content per root dry mass trait
type: NamedIndividual
type: Concept
definition: The ratio of the quantity (SEP:quantity) of carbon (CHEBI:carbon atom) in the fine root (McCormack:fine root) to the corresponding fine root mass (PATO:mass) assessed after drying
pref unit: mass unit / mass unit or amount unit / mass unit
related match: PATO_0000125
formal name: fine root carbon content per fine root dry mass
related match: CHEBI_27594
term status: stable
related match: SEP_00055
in scheme: Thesaurustrait
reference: Eric Garnier, Jens Kattge, Stefan Klotz, Ingolf Kühn, Ulrike Stahl
alternative label: fine root C content per dry mass

Fine root chlorine content per fine root dry mass
type: Class
subclass of: Root chlorine content per root dry mass trait
type: NamedIndividual
type: Concept
related match: SEP_00055
related match: CHEBI_23116
term status: stable
related match: PATO_0000125
reference: Eric Garnier, Jens Kattge, Stefan Klotz, Ingolf Kühn, Ulrike Stahl
definition: The ratio of the quantity (SEP:quantity) of chlorine (CHEBI:chlorine atom) in the fine root (McCormack:fine root) to the corresponding fine root mass (PATO:mass) assessed after drying
in scheme: Thesaurustrait
formal name: fine root chlorine content per fine root dry mass
alternative label: fine root Cl content per dry mass
pref unit: mass unit / mass unit or amount unit / mass unit

Leaf density trait
type: Class
subclass of: Leaf trait
type: NamedIndividual
type: Concept
formal name: leaf dry mass per leaf volume trait
term status: stable
in scheme: Thesaurustrait
reference: Eric Garnier, Jens Kattge, Stefan Klotz, Ingolf Kühn, Ulrike Stahl
definition: the ratio of the dry mass of a leaf (TOP:leaf dry mass) or component thereof , i.e. leaf lamina (TOP:leaf lamina dry mass), to the corresponding volume (TOP:leaf volume, TOP:leaf lamina volume)
pref unit: mass unit / volume unit

Fine root cobalt content per fine root dry mass
type: Class
subclass of: Root cobalt content per root dry mass trait
type: NamedIndividual
type: Concept
alternative label: fine root Co content per dry mass
related match: SEP_00055
pref unit: mass unit / mass unit or amount unit / mass unit
in scheme: Thesaurustrait
reference: Eric Garnier, Jens Kattge, Stefan Klotz, Ingolf Kühn, Ulrike Stahl
definition: The ratio of the quantity (SEP:quantity) of cobalt (CHEBI:cobalt atom) in the fine root (McCormack:fine root) to the corresponding fine root mass (PATO:mass) assessed after drying
related match: CHEBI_27638
related match: PATO_0000125
formal name: fine root cobalt content per fine root dry mass
term status: stable

Fine root copper content per fine root dry mass
type: Class
subclass of: Root copper content per root dry mass trait
type: NamedIndividual
type: Concept
related match: CHEBI_28694
reference: Eric Garnier, Jens Kattge, Stefan Klotz, Ingolf Kühn, Ulrike Stahl
formal name: fine root copper content per fine root dry mass
pref unit: mass unit / mass unit or amount unit / mass unit
related match: SEP_00055
in scheme: Thesaurustrait
alternative label: fine root Cu content per dry mass
term status: stable
related match: PATO_0000125
definition: The ratio of the quantity (SEP:quantity) of copper (CHEBI:copper atom) in the fine root (McCormack:fine root) to the corresponding fine root mass (PATO:mass) assessed after drying

Fine root iron content per fine root dry mass
type: Class
subclass of: Root iron content per root dry mass trait
type: NamedIndividual
type: Concept
related match: SEP_00055
reference: Eric Garnier, Jens Kattge, Stefan Klotz, Ingolf Kühn, Ulrike Stahl
related match: CHEBI_18248
in scheme: Thesaurustrait
alternative label: fine root Fe content per dry mass
related match: PATO_0000125
pref unit: mass unit / mass unit or amount unit / mass unit
formal name: fine root iron content per fine root dry mass
definition: The ratio of the quantity (SEP:quantity) of iron (CHEBI:iron atom) in the fine root (McCormack:fine root) to the corresponding fine root mass (PATO:mass) assessed after drying
term status: stable

Fine root magnesium content per fine root dry mass
type: Class
subclass of: Root magnesium content per root dry mass trait
type: NamedIndividual
type: Concept
related match: CHEBI_25107
formal name: fine root magnesium content per fine root dry mass
alternative label: fine root Mg content per dry mass
related match: SEP_00055
reference: Eric Garnier, Jens Kattge, Stefan Klotz, Ingolf Kühn, Ulrike Stahl
definition: The ratio of the quantity (SEP:quantity) of magnesium (CHEBI:magnesium atom) in the fine root (McCormack:fine root) to the corresponding fine root mass (PATO:mass) assessed after drying
related match: PATO_0000125
term status: stable
in scheme: Thesaurustrait
pref unit: mass unit / mass unit or amount unit / mass unit

Fine root manganese content per fine root dry mass
type: Class
subclass of: Root manganese content per root dry mass trait
type: NamedIndividual
type: Concept
formal name: fine root manganese content per fine root dry mass
definition: The ratio of the quantity (SEP:quantity) of manganese (CHEBI:manganese atom) in the fine root (McCormack:fine root) to the corresponding fine root mass (PATO:mass) assessed after drying
pref unit: mass unit / mass unit or amount unit / mass unit
term status: stable
in scheme: Thesaurustrait
reference: Eric Garnier, Jens Kattge, Stefan Klotz, Ingolf Kühn, Ulrike Stahl
related match: SEP_00055
related match: PATO_0000125
alternative label: fine root Mn content per dry mass
related match: CHEBI_18291

Fine root molybdenum content per fine root dry mass
type: Class
subclass of: Root molybdenum content per root dry mass trait
type: NamedIndividual
type: Concept
alternative label: fine root Mo content per dry mass
formal name: fine root molybdenum content per fine root dry mass
in scheme: Thesaurustrait
reference: Eric Garnier, Jens Kattge, Stefan Klotz, Ingolf Kühn, Ulrike Stahl
pref unit: mass unit / mass unit or amount unit / mass unit
related match: SEP_00055
related match: PATO_0000125
term status: stable
definition: The ratio of the quantity (SEP:quantity) of molybdenum (CHEBI:molybdenum atom) in the fine root (McCormack:fine root) to the corresponding fine root mass (PATO:mass) assessed after drying
related match: CHEBI_28685

Fine root sodium content per fine root dry mass
type: Class
subclass of: Root sodium content per root dry mass trait
type: NamedIndividual
type: Concept
alternative label: fine root Na content per dry mass
related match: PATO_0000125
related match: CHEBI_26708
reference: Eric Garnier, Jens Kattge, Stefan Klotz, Ingolf Kühn, Ulrike Stahl
in scheme: Thesaurustrait
related match: SEP_00055
formal name: fine root sodium content per fine root dry mass
term status: stable
pref unit: mass unit / mass unit or amount unit / mass unit
definition: The ratio of the quantity (SEP:quantity) of sodium (CHEBI:sodium atom) in the fine root (McCormack:fine root) to the corresponding fine root mass (PATO:mass) assessed after drying

Fine root nickel content per fine root dry mass
type: Class
subclass of: Root nickel content per root dry mass trait
type: NamedIndividual
type: Concept
term status: stable
related match: PATO_0000125
related match: SEP_00055
reference: Eric Garnier, Jens Kattge, Stefan Klotz, Ingolf Kühn, Ulrike Stahl
in scheme: Thesaurustrait
related match: CHEBI_28112
alternative label: fine root Ni content per dry mass
pref unit: mass unit / mass unit or amount unit / mass unit
formal name: fine root nickel content per fine root dry mass
definition: The ratio of the quantity (SEP:quantity) of nickel (CHEBI:nickel atom) in the fine root (McCormack:fine root) to the corresponding fine root mass (PATO:mass) assessed after drying

Fine root nitrogen content per fine root dry mass
type: Class
subclass of: Root nitrogen content per root dry mass trait
type: NamedIndividual
type: Concept
related match: PATO_0000125
term status: stable
related match: SEP_00055
in scheme: Thesaurustrait
alternative label: fine root N content per dry mass
reference: Eric Garnier, Jens Kattge, Stefan Klotz, Ingolf Kühn, Ulrike Stahl
formal name: fine root nitrogen content per fine root dry mass
related match: CHEBI_25555
pref unit: mass unit / mass unit or amount unit / mass unit
definition: The ratio of the quantity (SEP:quantity) of nitrogen (CHEBI:nitrogen atom) in the fine root (McCormack:fine root) to the corresponding fine root mass (PATO:mass) assessed after drying

Fine root phosphorus content per fine root dry mass
type: Class
subclass of: Root phosphorus content per root dry mass trait
type: NamedIndividual
type: Concept
in scheme: Thesaurustrait
related match: PATO_0000125
term status: stable
definition: The ratio of the quantity (SEP:quantity) of phosphorus (CHEBI:phosphorus atom) in the fine root (McCormack:fine root) to the corresponding fine root mass (PATO:mass) assessed after drying
formal name: fine root phosphorus content per fine root dry mass
related match: CHEBI_28659
reference: Eric Garnier, Jens Kattge, Stefan Klotz, Ingolf Kühn, Ulrike Stahl
alternative label: fine root P content per dry mass
related match: SEP_00055
pref unit: mass unit / mass unit or amount unit / mass unit

Leaf density
type: Class
subclass of: Leaf density trait
type: NamedIndividual
type: Concept
term status: stable
in scheme: Thesaurustrait
definition: the ratio of the dry mass of a leaf (TOP:leaf dry mass) to its volume (TOP:leaf volume)
pref unit: mass unit / volume unit
reference: Eric Garnier, Jens Kattge, Stefan Klotz, Ingolf Kühn, Ulrike Stahl
formal name: leaf dry mass per leaf volume

Fine root potassium content per fine root dry mass
type: Class
subclass of: Root potassium content per root dry mass trait
type: NamedIndividual
type: Concept
related match: PATO_0000125
in scheme: Thesaurustrait
term status: stable
reference: Eric Garnier, Jens Kattge, Stefan Klotz, Ingolf Kühn, Ulrike Stahl
pref unit: mass unit / mass unit or amount unit / mass unit
related match: SEP_00055
alternative label: fine root K content per dry mass
definition: The ratio of the quantity (SEP:quantity) of potassium (CHEBI:potassium atom) in the fine root (McCormack:fine root) to the corresponding fine root mass (PATO:mass) assessed after drying
formal name: fine root potassium content per fine root dry mass
related match: CHEBI_26216

Fine root silicon content per fine root dry mass
type: Class
subclass of: Root silicon content per root dry mass trait
type: NamedIndividual
type: Concept
definition: The ratio of the quantity (SEP:quantity) of silicon (CHEBI:silicon atom) in the fine root (McCormack:fine root) to the corresponding fine root mass (PATO:mass) assessed after drying
formal name: fine root silicon content per fine root dry mass
reference: Eric Garnier, Jens Kattge, Stefan Klotz, Ingolf Kühn, Ulrike Stahl
term status: stable
in scheme: Thesaurustrait
related match: SEP_00055
related match: PATO_0000125
related match: CHEBI_27573
pref unit: mass unit / mass unit or amount unit / mass unit
alternative label: fine root Si content per dry mass

Fine root sulfur content per fine root dry mass
type: Class
subclass of: Root sulfur content per root dry mass trait
type: NamedIndividual
type: Concept
related match: SEP_00055
reference: Eric Garnier, Jens Kattge, Stefan Klotz, Ingolf Kühn, Ulrike Stahl
pref unit: mass unit / mass unit or amount unit / mass unit
related match: PATO_0000125
in scheme: Thesaurustrait
alternative label: fine root S content per dry mass
related match: CHEBI_26833
formal name: fine root sulfur content per fine root dry mass
term status: stable
definition: The ratio of the quantity (SEP:quantity) of sulfur (CHEBI:sulfur atom) in the fine root (McCormack:fine root) to the corresponding fine root mass (PATO:mass) assessed after drying

Fine root zinc content per fine root dry mass
type: Class
subclass of: Root zinc content per root dry mass trait
type: NamedIndividual
type: Concept
related match: CHEBI_27363
definition: The ratio of the quantity (SEP:quantity) of zinc (CHEBI:zinc atom) in the fine root (McCormack:fine root) to the corresponding fine root mass (PATO:mass) assessed after drying
related match: SEP_00055
in scheme: Thesaurustrait
reference: Eric Garnier, Jens Kattge, Stefan Klotz, Ingolf Kühn, Ulrike Stahl
formal name: fine root zinc content per fine root dry mass
related match: PATO_0000125
term status: stable
pref unit: mass unit / mass unit or amount unit / mass unit
alternative label: fine root Zn content per dry mass

Seed aluminium content per seed dry mass
type: Class
subclass of: Flower and dispersule trait
type: NamedIndividual
type: Concept
in scheme: Thesaurustrait
term status: stable
related match: PO_0009010
formal name: seed aluminium content per seed dry mass
reference: Eric Garnier, Jens Kattge, Stefan Klotz, Ingolf Kühn, Ulrike Stahl
related match: SEP_00055
related match: PATO_0000125
definition: The ratio of the quantity (SEP:quantity) of aluminium (CHEBI:aluminium atom) in the seed (PO:seed) to the corresponding seed (PO:seed) mass (PATO:mass) assessed after drying
alternative label: seed Al content per dry mass
pref unit: mass unit / mass unit or amount unit / mass unit
related match: CHEBI_28984

Seed boron content per seed dry mass
type: Class
subclass of: Flower and dispersule trait
type: NamedIndividual
type: Concept
in scheme: Thesaurustrait
formal name: seed boron content per seed dry mass
related match: PO_0009010
term status: stable
related match: CHEBI_27560
alternative label: seed B content per dry mass
related match: SEP_00055
reference: Eric Garnier, Jens Kattge, Stefan Klotz, Ingolf Kühn, Ulrike Stahl
related match: PATO_0000125
definition: The ratio of the quantity (SEP:quantity) of boron (CHEBI:boron atom) in the seed (PO:seed) to the corresponding seed (PO:seed) mass (PATO:mass) assessed after drying
pref unit: mass unit / mass unit or amount unit / mass unit

Seed calcium content per seed dry mass
type: Class
subclass of: Flower and dispersule trait
type: NamedIndividual
type: Concept
formal name: seed calcium content per seed dry mass
related match: PO_0009010
term status: stable
alternative label: seed Ca content per dry mass
definition: The ratio of the quantity (SEP:quantity) of calcium (CHEBI:calcium atom) in the seed (PO:seed) to the corresponding seed (PO:seed) mass (PATO:mass) assessed after drying
related match: SEP_00055
in scheme: Thesaurustrait
reference: Eric Garnier, Jens Kattge, Stefan Klotz, Ingolf Kühn, Ulrike Stahl
pref unit: mass unit / mass unit or amount unit / mass unit
related match: PATO_0000125
related match: CHEBI_22984

Seed carbon content per seed dry mass
type: Class
subclass of: Flower and dispersule trait
type: NamedIndividual
type: Concept
related match: PO_0009010
definition: The ratio of the quantity (SEP:quantity) of carbon (CHEBI:carbon atom) in the seed (PO:seed) to the corresponding seed (PO:seed) mass (PATO:mass) assessed after drying
related match: PATO_0000125
related match: CHEBI_27594
term status: stable
alternative label: seed C content per dry mass
formal name: seed carbon content per seed dry mass
in scheme: Thesaurustrait
related match: SEP_00055
reference: Eric Garnier, Jens Kattge, Stefan Klotz, Ingolf Kühn, Ulrike Stahl
pref unit: mass unit / mass unit or amount unit / mass unit

Seed chlorine content per seed dry mass
type: Class
subclass of: Flower and dispersule trait
type: NamedIndividual
type: Concept
related match: PO_0009010
related match: PATO_0000125
formal name: seed chlorine content per seed dry mass
reference: Eric Garnier, Jens Kattge, Stefan Klotz, Ingolf Kühn, Ulrike Stahl
alternative label: seed Cl content per dry mass
related match: SEP_00055
related match: CHEBI_23116
definition: The ratio of the quantity (SEP:quantity) of chlorine (CHEBI:chlorine atom) in the seed (PO:seed) to the corresponding seed (PO:seed) mass (PATO:mass) assessed after drying
term status: stable
in scheme: Thesaurustrait
pref unit: mass unit / mass unit or amount unit / mass unit

Seed cobalt content per seed dry mass
type: Class
subclass of: Flower and dispersule trait
type: NamedIndividual
type: Concept
alternative label: seed Co content per dry mass
related match: PO_0009010
related match: CHEBI_27638
reference: Eric Garnier, Jens Kattge, Stefan Klotz, Ingolf Kühn, Ulrike Stahl
related match: SEP_00055
related match: PATO_0000125
formal name: seed cobalt content per seed dry mass
definition: The ratio of the quantity (SEP:quantity) of cobalt (CHEBI:cobalt atom) in the seed (PO:seed) to the corresponding seed (PO:seed) mass (PATO:mass) assessed after drying
term status: stable
in scheme: Thesaurustrait
pref unit: mass unit / mass unit or amount unit / mass unit

Leaf lamina density
type: Class
subclass of: Leaf density trait
type: NamedIndividual
type: Concept
term status: stable
in scheme: Thesaurustrait
definition: the ratio of the dry mass of the leaf lamina (TOP:leaf lamina dry mass) to its volume (TOP:leaf lamina volume)
reference: Eric Garnier, Jens Kattge, Stefan Klotz, Ingolf Kühn, Ulrike Stahl
pref unit: mass unit / volume unit
formal name: leaf lamina dry mass per leaf lamina volume

Seed copper content per seed dry mass
type: Class
subclass of: Flower and dispersule trait
type: NamedIndividual
type: Concept
related match: PO_0009010
related match: PATO_0000125
reference: Eric Garnier, Jens Kattge, Stefan Klotz, Ingolf Kühn, Ulrike Stahl
related match: CHEBI_28694
definition: The ratio of the quantity (SEP:quantity) of copper (CHEBI:copper atom) in the seed (PO:seed) to the corresponding seed (PO:seed) mass (PATO:mass) assessed after drying
formal name: seed copper content per seed dry mass
related match: SEP_00055
alternative label: seed Cu content per dry mass
pref unit: mass unit / mass unit or amount unit / mass unit
in scheme: Thesaurustrait
term status: stable

Seed iron content per seed dry mass
type: Class
subclass of: Flower and dispersule trait
type: NamedIndividual
type: Concept
pref unit: mass unit / mass unit or amount unit / mass unit
related match: PO_0009010
related match: PATO_0000125
related match: SEP_00055
reference: Eric Garnier, Jens Kattge, Stefan Klotz, Ingolf Kühn, Ulrike Stahl
definition: The ratio of the quantity (SEP:quantity) of iron (CHEBI:iron atom) in the seed (PO:seed) to the corresponding seed (PO:seed) mass (PATO:mass) assessed after drying
term status: stable
formal name: seed iron content per seed dry mass
in scheme: Thesaurustrait
related match: CHEBI_18248
alternative label: seed Fe content per dry mass

Seed magnesium content per seed dry mass
type: Class
subclass of: Flower and dispersule trait
type: NamedIndividual
type: Concept
related match: PATO_0000125
pref unit: mass unit / mass unit or amount unit / mass unit
related match: PO_0009010
related match: SEP_00055
reference: Eric Garnier, Jens Kattge, Stefan Klotz, Ingolf Kühn, Ulrike Stahl
formal name: seed magnesium content per seed dry mass
term status: stable
in scheme: Thesaurustrait
alternative label: seed Mg content per dry mass
definition: The ratio of the quantity (SEP:quantity) of magnesium (CHEBI:magnesium atom) in the seed (PO:seed) to the corresponding seed (PO:seed) mass (PATO:mass) assessed after drying
related match: CHEBI_25107

Seed manganese content per seed dry mass
type: Class
subclass of: Flower and dispersule trait
type: NamedIndividual
type: Concept
pref unit: mass unit / mass unit or amount unit / mass unit
related match: PATO_0000125
related match: SEP_00055
reference: Eric Garnier, Jens Kattge, Stefan Klotz, Ingolf Kühn, Ulrike Stahl
formal name: seed manganese content per seed dry mass
definition: The ratio of the quantity (SEP:quantity) of manganese (CHEBI:manganese atom) in the seed (PO:seed) to the corresponding seed (PO:seed) mass (PATO:mass) assessed after drying
related match: CHEBI_18291
term status: stable
in scheme: Thesaurustrait
related match: PO_0009010
alternative label: seed Mn content per dry mass

Seed molybdenum content per seed dry mass
type: Class
subclass of: Flower and dispersule trait
type: NamedIndividual
type: Concept
related match: SEP_00055
related match: PATO_0000125
reference: Eric Garnier, Jens Kattge, Stefan Klotz, Ingolf Kühn, Ulrike Stahl
pref unit: mass unit / mass unit or amount unit / mass unit
related match: CHEBI_28685
definition: The ratio of the quantity (SEP:quantity) of molybdenum (CHEBI:molybdenum atom) in the seed (PO:seed) to the corresponding seed (PO:seed) mass (PATO:mass) assessed after drying
term status: stable
in scheme: Thesaurustrait
formal name: seed molybdenum content per seed dry mass
related match: PO_0009010
alternative label: seed Mo content per dry mass

Seed sodium content per seed dry mass
type: Class
subclass of: Flower and dispersule trait
type: NamedIndividual
type: Concept
definition: The ratio of the quantity (SEP:quantity) of sodium (CHEBI:sodium atom) in the seed (PO:seed) to the corresponding seed (PO:seed) mass (PATO:mass) assessed after drying
formal name: seed sodium content per seed dry mass
related match: CHEBI_26708
related match: PATO_0000125
reference: Eric Garnier, Jens Kattge, Stefan Klotz, Ingolf Kühn, Ulrike Stahl
related match: SEP_00055
pref unit: mass unit / mass unit or amount unit / mass unit
alternative label: seed Na content per dry mass
in scheme: Thesaurustrait
term status: stable
related match: PO_0009010

Seed nickel content per seed dry mass
type: Class
subclass of: Flower and dispersule trait
type: NamedIndividual
type: Concept
definition: The ratio of the quantity (SEP:quantity) of nickel (CHEBI:nickel atom) in the seed (PO:seed) to the corresponding seed (PO:seed) mass (PATO:mass) assessed after drying
reference: Eric Garnier, Jens Kattge, Stefan Klotz, Ingolf Kühn, Ulrike Stahl
related match: PATO_0000125
related match: SEP_00055
pref unit: mass unit / mass unit or amount unit / mass unit
related match: CHEBI_28112
formal name: seed nickel content per seed dry mass
in scheme: Thesaurustrait
alternative label: seed Ni content per dry mass
related match: PO_0009010
term status: stable

Seed nitrogen content per seed dry mass
type: Class
subclass of: Flower and dispersule trait
type: NamedIndividual
type: Concept
related match: SEP_00055
reference: Eric Garnier, Jens Kattge, Stefan Klotz, Ingolf Kühn, Ulrike Stahl
related match: PATO_0000125
in scheme: Thesaurustrait
definition: The ratio of the quantity (SEP:quantity) of nitrogen (CHEBI:nitrogen atom) in the seed (PO:seed) to the corresponding seed (PO:seed) mass (PATO:mass) assessed after drying
formal name: seed nitrogen content per seed dry mass
pref unit: mass unit / mass unit or amount unit / mass unit
alternative label: seed N content per dry mass
related match: CHEBI_25555
term status: stable
related match: PO_0009010

Seed phosphorus content per seed dry mass
type: Class
subclass of: Flower and dispersule trait
type: NamedIndividual
type: Concept
definition: The ratio of the quantity (SEP:quantity) of phosphorus (CHEBI:phosphorus atom) in the seed (PO:seed) to the corresponding seed (PO:seed) mass (PATO:mass) assessed after drying
related match: CHEBI_28659
related match: SEP_00055
pref unit: mass unit / mass unit or amount unit / mass unit
formal name: seed phosphorus content per seed dry mass
in scheme: Thesaurustrait
reference: Eric Garnier, Jens Kattge, Stefan Klotz, Ingolf Kühn, Ulrike Stahl
alternative label: seed P content per dry mass
related match: PATO_0000125
term status: stable
related match: PO_0009010

Seed potassium content per seed dry mass
type: Class
subclass of: Flower and dispersule trait
type: NamedIndividual
type: Concept
term status: stable
related match: CHEBI_26216
definition: The ratio of the quantity (SEP:quantity) of potassium (CHEBI:potassium atom) in the seed (PO:seed) to the corresponding seed (PO:seed) mass (PATO:mass) assessed after drying
reference: Eric Garnier, Jens Kattge, Stefan Klotz, Ingolf Kühn, Ulrike Stahl
pref unit: mass unit / mass unit or amount unit / mass unit
in scheme: Thesaurustrait
formal name: seed potassium content per seed dry mass
alternative label: seed K content per dry mass
related match: PATO_0000125
related match: SEP_00055
related match: PO_0009010

Petiole length
type: Class
subclass of: Leaf trait
type: NamedIndividual
type: Concept
reference: Eric Garnier, Jens Kattge, Stefan Klotz, Ingolf Kühn, Ulrike Stahl
related match: PATO_0000122
related match: PO_0020038
definition: the length (PATO:length) of a petiole (PO:petiole)
pref unit: length unit
term status: stable
formal name: petiole length
in scheme: Thesaurustrait

Seed silicon content per seed dry mass
type: Class
subclass of: Flower and dispersule trait
type: NamedIndividual
type: Concept
definition: The ratio of the quantity (SEP:quantity) of silicon (CHEBI:silicon atom) in the seed (PO:seed) to the corresponding seed (PO:seed) mass (PATO:mass) assessed after drying
in scheme: Thesaurustrait
reference: Eric Garnier, Jens Kattge, Stefan Klotz, Ingolf Kühn, Ulrike Stahl
related match: CHEBI_27573
term status: stable
formal name: seed silicon content per seed dry mass
related match: PO_0009010
alternative label: seed Si content per dry mass
related match: SEP_00055
pref unit: mass unit / mass unit or amount unit / mass unit
related match: PATO_0000125

Seed sulfur content per seed dry mass
type: Class
subclass of: Flower and dispersule trait
type: NamedIndividual
type: Concept
in scheme: Thesaurustrait
term status: stable
related match: PO_0009010
related match: PATO_0000125
reference: Eric Garnier, Jens Kattge, Stefan Klotz, Ingolf Kühn, Ulrike Stahl
formal name: seed sulfur content per seed dry mass
alternative label: seed S content per dry mass
related match: SEP_00055
definition: The ratio of the quantity (SEP:quantity) of sulfur (CHEBI:sulfur atom) in the seed (PO:seed) to the corresponding seed (PO:seed) mass (PATO:mass) assessed after drying
pref unit: mass unit / mass unit or amount unit / mass unit
related match: CHEBI_26833

Seed zinc content per seed dry mass
type: Class
subclass of: Flower and dispersule trait
type: NamedIndividual
type: Concept
term status: stable
definition: The ratio of the quantity (SEP:quantity) of zinc (CHEBI:zinc atom) in the seed (PO:seed) to the corresponding seed (PO:seed) mass (PATO:mass) assessed after drying
formal name: seed zinc content per seed dry mass
in scheme: Thesaurustrait
related match: CHEBI_27363
related match: PO_0009010
related match: PATO_0000125
related match: SEP_00055
reference: Eric Garnier, Jens Kattge, Stefan Klotz, Ingolf Kühn, Ulrike Stahl
alternative label: seed Zn content per dry mass
pref unit: mass unit / mass unit or amount unit / mass unit

Litter aluminium content per litter dry mass
type: Class
subclass of: Litter and coarse woody debris trait
type: NamedIndividual
type: Concept
related match: CHEBI_28984
related match: PATO_0000125
term status: stable
related match: SEP_00055
in scheme: Thesaurustrait
reference: Eric Garnier, Jens Kattge, Stefan Klotz, Ingolf Kühn, Ulrike Stahl
definition: The ratio of the quantity (SEP:quantity) of aluminium (CHEBI:aluminium atom) in the litter (Berg:litter) to the corresponding litter mass (PATO:mass) assessed after drying
formal name: litter aluminium content per litter dry mass
alternative label: litter Al content per dry mass
pref unit: mass unit / mass unit or amount unit / mass unit

Litter boron content per litter dry mass
type: Class
subclass of: Litter and coarse woody debris trait
type: NamedIndividual
type: Concept
related match: PATO_0000125
term status: stable
definition: The ratio of the quantity (SEP:quantity) of boron (CHEBI:boron atom) in the litter (Berg:litter) to the corresponding litter mass (PATO:mass) assessed after drying
in scheme: Thesaurustrait
formal name: litter boron content per litter dry mass
reference: Eric Garnier, Jens Kattge, Stefan Klotz, Ingolf Kühn, Ulrike Stahl
related match: SEP_00055
alternative label: litter B content per dry mass
related match: CHEBI_27560
pref unit: mass unit / mass unit or amount unit / mass unit

Litter calcium content per litter dry mass
type: Class
subclass of: Litter and coarse woody debris trait
type: NamedIndividual
type: Concept
in scheme: Thesaurustrait
term status: stable
reference: Eric Garnier, Jens Kattge, Stefan Klotz, Ingolf Kühn, Ulrike Stahl
alternative label: litter Ca content per dry mass
related match: SEP_00055
definition: The ratio of the quantity (SEP:quantity) of calcium (CHEBI:calcium atom) in the litter (Berg:litter) to the corresponding litter mass (PATO:mass) assessed after drying
related match: PATO_0000125
formal name: litter calcium content per litter dry mass
related match: CHEBI_22984
pref unit: mass unit / mass unit or amount unit / mass unit

Litter carbon content per litter dry mass
type: Class
subclass of: Litter and coarse woody debris trait
type: NamedIndividual
type: Concept
related match: CHEBI_27594
related match: SEP_00055
reference: Eric Garnier, Jens Kattge, Stefan Klotz, Ingolf Kühn, Ulrike Stahl
definition: The ratio of the quantity (SEP:quantity) of carbon (CHEBI:carbon atom) in the litter (Berg:litter) to the corresponding litter mass (PATO:mass) assessed after drying
in scheme: Thesaurustrait
term status: stable
related match: PATO_0000125
alternative label: litter C content per dry mass
pref unit: mass unit / mass unit or amount unit / mass unit
formal name: litter carbon content per litter dry mass

Litter chlorine content per litter dry mass
type: Class
subclass of: Litter and coarse woody debris trait
type: NamedIndividual
type: Concept
related match: SEP_00055
reference: Eric Garnier, Jens Kattge, Stefan Klotz, Ingolf Kühn, Ulrike Stahl
related match: CHEBI_23116
in scheme: Thesaurustrait
term status: stable
formal name: litter chlorine content per litter dry mass
related match: PATO_0000125
definition: The ratio of the quantity (SEP:quantity) of chlorine (CHEBI:chlorine atom) in the litter (Berg:litter) to the corresponding litter mass (PATO:mass) assessed after drying
alternative label: litter Cl content per dry mass
pref unit: mass unit / mass unit or amount unit / mass unit

Litter cobalt content per litter dry mass
type: Class
subclass of: Litter and coarse woody debris trait
type: NamedIndividual
type: Concept
related match: CHEBI_27638
reference: Eric Garnier, Jens Kattge, Stefan Klotz, Ingolf Kühn, Ulrike Stahl
related match: SEP_00055
formal name: litter cobalt content per litter dry mass
term status: stable
related match: PATO_0000125
in scheme: Thesaurustrait
pref unit: mass unit / mass unit or amount unit / mass unit
definition: The ratio of the quantity (SEP:quantity) of cobalt (CHEBI:cobalt atom) in the litter (Berg:litter) to the corresponding litter mass (PATO:mass) assessed after drying
alternative label: litter Co content per dry mass

Litter copper content per litter dry mass
type: Class
subclass of: Litter and coarse woody debris trait
type: NamedIndividual
type: Concept
definition: The ratio of the quantity (SEP:quantity) of copper (CHEBI:copper atom) in the litter (Berg:litter) to the corresponding litter mass (PATO:mass) assessed after drying
related match: SEP_00055
term status: stable
related match: PATO_0000125
alternative label: litter Cu content per dry mass
formal name: litter copper content per litter dry mass
pref unit: mass unit / mass unit or amount unit / mass unit
in scheme: Thesaurustrait
reference: Eric Garnier, Jens Kattge, Stefan Klotz, Ingolf Kühn, Ulrike Stahl
related match: CHEBI_28694

Petiole thickness
type: Class
subclass of: Leaf trait
type: NamedIndividual
type: Concept
alternative label: petiole diameter
related match: PATO_0000915
term status: stable
related match: PO_0020038
pref unit: length unit
definition: the thickness (PATO:thickness) of a petiole (PO:petiole)
in scheme: Thesaurustrait
reference: Eric Garnier, Jens Kattge, Stefan Klotz, Ingolf Kühn, Ulrike Stahl
formal name: petiole thickness

Litter iron content per litter dry mass
type: Class
subclass of: Litter and coarse woody debris trait
type: NamedIndividual
type: Concept
related match: CHEBI_18248
related match: SEP_00055
alternative label: litter Fe content per dry mass
in scheme: Thesaurustrait
reference: Eric Garnier, Jens Kattge, Stefan Klotz, Ingolf Kühn, Ulrike Stahl
formal name: litter iron content per litter dry mass
related match: PATO_0000125
term status: stable
definition: The ratio of the quantity (SEP:quantity) of iron (CHEBI:iron atom) in the litter (Berg:litter) to the corresponding litter mass (PATO:mass) assessed after drying
pref unit: mass unit / mass unit or amount unit / mass unit

Litter magnesium content per litter dry mass
type: Class
subclass of: Litter and coarse woody debris trait
type: NamedIndividual
type: Concept
related match: CHEBI_25107
related match: SEP_00055
reference: Eric Garnier, Jens Kattge, Stefan Klotz, Ingolf Kühn, Ulrike Stahl
definition: The ratio of the quantity (SEP:quantity) of magnesium (CHEBI:magnesium atom) in the litter (Berg:litter) to the corresponding litter mass (PATO:mass) assessed after drying
in scheme: Thesaurustrait
pref unit: mass unit / mass unit or amount unit / mass unit
related match: PATO_0000125
term status: stable
formal name: litter magnesium content per litter dry mass
alternative label: litter Mg content per dry mass

Litter manganese content per litter dry mass
type: Class
subclass of: Litter and coarse woody debris trait
type: NamedIndividual
type: Concept
formal name: litter manganese content per litter dry mass
related match: PATO_0000125
in scheme: Thesaurustrait
alternative label: litter Mn content per dry mass
definition: The ratio of the quantity (SEP:quantity) of manganese (CHEBI:manganese atom) in the litter (Berg:litter) to the corresponding litter mass (PATO:mass) assessed after drying
related match: SEP_00055
reference: Eric Garnier, Jens Kattge, Stefan Klotz, Ingolf Kühn, Ulrike Stahl
related match: CHEBI_18291
term status: stable
pref unit: mass unit / mass unit or amount unit / mass unit

Litter molybdenum content per litter dry mass
type: Class
subclass of: Litter and coarse woody debris trait
type: NamedIndividual
type: Concept
formal name: litter molybdenum content per litter dry mass
related match: PATO_0000125
term status: stable
in scheme: Thesaurustrait
reference: Eric Garnier, Jens Kattge, Stefan Klotz, Ingolf Kühn, Ulrike Stahl
alternative label: litter Mo content per dry mass
related match: SEP_00055
related match: CHEBI_28685
definition: The ratio of the quantity (SEP:quantity) of molybdenum (CHEBI:molybdenum atom) in the litter (Berg:litter) to the corresponding litter mass (PATO:mass) assessed after drying
pref unit: mass unit / mass unit or amount unit / mass unit

Litter sodium content per litter dry mass
type: Class
subclass of: Litter and coarse woody debris trait
type: NamedIndividual
type: Concept
term status: stable
in scheme: Thesaurustrait
reference: Eric Garnier, Jens Kattge, Stefan Klotz, Ingolf Kühn, Ulrike Stahl
related match: SEP_00055
related match: PATO_0000125
alternative label: litter Na content per dry mass
formal name: litter sodium content per litter dry mass
pref unit: mass unit / mass unit or amount unit / mass unit
related match: CHEBI_26708
definition: The ratio of the quantity (SEP:quantity) of sodium (CHEBI:sodium atom) in the litter (Berg:litter) to the corresponding litter mass (PATO:mass) assessed after drying

Litter nickel content per litter dry mass
type: Class
subclass of: Litter and coarse woody debris trait
type: NamedIndividual
type: Concept
in scheme: Thesaurustrait
related match: SEP_00055
reference: Eric Garnier, Jens Kattge, Stefan Klotz, Ingolf Kühn, Ulrike Stahl
term status: stable
related match: PATO_0000125
related match: CHEBI_28112
formal name: litter nickel content per litter dry mass
pref unit: mass unit / mass unit or amount unit / mass unit
definition: The ratio of the quantity (SEP:quantity) of nickel (CHEBI:nickel atom) in the litter (Berg:litter) to the corresponding litter mass (PATO:mass) assessed after drying
alternative label: litter Ni content per dry mass

Litter nitrogen content per litter dry mass
type: Class
subclass of: Litter and coarse woody debris trait
type: NamedIndividual
type: Concept
term status: stable
in scheme: Thesaurustrait
related match: PATO_0000125
pref unit: mass unit / mass unit or amount unit / mass unit
alternative label: litter N content per dry mass
reference: Eric Garnier, Jens Kattge, Stefan Klotz, Ingolf Kühn, Ulrike Stahl
related match: SEP_00055
related match: CHEBI_25555
formal name: litter nitrogen content per litter dry mass
definition: The ratio of the quantity (SEP:quantity) of nitrogen (CHEBI:nitrogen atom) in the litter (Berg:litter) to the corresponding litter mass (PATO:mass) assessed after drying

Litter phosphorus content per litter dry mass
type: Class
subclass of: Litter and coarse woody debris trait
type: NamedIndividual
type: Concept
pref unit: mass unit / mass unit or amount unit / mass unit
definition: The ratio of the quantity (SEP:quantity) of phosphorus (CHEBI:phosphorus atom) in the litter (Berg:litter) to the corresponding litter mass (PATO:mass) assessed after drying
related match: SEP_00055
in scheme: Thesaurustrait
reference: Eric Garnier, Jens Kattge, Stefan Klotz, Ingolf Kühn, Ulrike Stahl
formal name: litter phosphorus content per litter dry mass
related match: PATO_0000125
alternative label: litter P content per dry mass
term status: stable
related match: CHEBI_28659

Litter potassium content per litter dry mass
type: Class
subclass of: Litter and coarse woody debris trait
type: NamedIndividual
type: Concept
related match: SEP_00055
alternative label: litter K content per dry mass
formal name: litter potassium content per litter dry mass
pref unit: mass unit / mass unit or amount unit / mass unit
reference: Eric Garnier, Jens Kattge, Stefan Klotz, Ingolf Kühn, Ulrike Stahl
in scheme: Thesaurustrait
definition: The ratio of the quantity (SEP:quantity) of potassium (CHEBI:potassium atom) in the litter (Berg:litter) to the corresponding litter mass (PATO:mass) assessed after drying
related match: PATO_0000125
term status: stable
related match: CHEBI_26216

Litter silicon content per litter dry mass
type: Class
subclass of: Litter and coarse woody debris trait
type: NamedIndividual
type: Concept
related match: CHEBI_27573
reference: Eric Garnier, Jens Kattge, Stefan Klotz, Ingolf Kühn, Ulrike Stahl
pref unit: mass unit / mass unit or amount unit / mass unit
related match: SEP_00055
term status: stable
related match: PATO_0000125
alternative label: litter Si content per dry mass
formal name: litter silicon content per litter dry mass
definition: The ratio of the quantity (SEP:quantity) of silicon (CHEBI:silicon atom) in the litter (Berg:litter) to the corresponding litter mass (PATO:mass) assessed after drying
in scheme: Thesaurustrait

Leaf trait
type: Class
subclass of: Plant trait
type: NamedIndividual
type: Concept
in scheme: Thesaurustrait
reference: Eric Garnier, Jens Kattge, Stefan Klotz, Ingolf Kühn, Ulrike Stahl
term status: testing
definition: a plant trait (TOP:plant trait) referring to the leaf (PO:leaf)

Petiole area
type: Class
subclass of: Leaf trait
type: NamedIndividual
type: Concept
related match: PATO_0001323
reference: Eric Garnier, Jens Kattge, Stefan Klotz, Ingolf Kühn, Ulrike Stahl
in scheme: Thesaurustrait
related match: PO_0020038
formal name: petiole area
term status: stable
definition: the area (PATO:area) of a petiole (PO:petiole) in the one sided projection
pref unit: area unit

Litter sulfur content per litter dry mass
type: Class
subclass of: Litter and coarse woody debris trait
type: NamedIndividual
type: Concept
related match: CHEBI_26833
definition: The ratio of the quantity (SEP:quantity) of sulfur (CHEBI:sulfur atom) in the litter (Berg:litter) to the corresponding litter mass (PATO:mass) assessed after drying
related match: SEP_00055
alternative label: litter S content per dry mass
term status: stable
related match: PATO_0000125
pref unit: mass unit / mass unit or amount unit / mass unit
formal name: litter sulfur content per litter dry mass
in scheme: Thesaurustrait
reference: Eric Garnier, Jens Kattge, Stefan Klotz, Ingolf Kühn, Ulrike Stahl

Litter zinc content per litter dry mass
type: Class
subclass of: Litter and coarse woody debris trait
type: NamedIndividual
type: Concept
formal name: litter zinc content per litter dry mass
alternative label: litter Zn content per dry mass
term status: stable
pref unit: mass unit / mass unit or amount unit / mass unit
related match: PATO_0000125
definition: The ratio of the quantity (SEP:quantity) of zinc (CHEBI:zinc atom) in the litter (Berg:litter) to the corresponding litter mass (PATO:mass) assessed after drying
related match: SEP_00055
in scheme: Thesaurustrait
reference: Eric Garnier, Jens Kattge, Stefan Klotz, Ingolf Kühn, Ulrike Stahl
related match: CHEBI_27363

Stem wood aluminium content per stem wood dry mass
type: Class
subclass of: Wood aluminium content per wood dry mass trait
type: NamedIndividual
type: Concept
related match: PO_0009047
related match: PO_0005848
definition: The ratio of the quantity (SEP:quantity) of aluminium (CHEBI:aluminium atom) in the stem wood (PO:stem, PO:secondary xylem) to the corresponding stem wood (PO:stem, PO:secondary xylem) mass (PATO:mass) assessed after drying
related match: PATO_0000125
related match: SEP_00055
related match: CHEBI_28984
term status: stable
reference: Eric Garnier, Jens Kattge, Stefan Klotz, Ingolf Kühn, Ulrike Stahl
in scheme: Thesaurustrait
alternative label: stem wood Al content per dry mass
pref unit: mass unit / mass unit or amount unit / mass unit
formal name: stem wood aluminium content per stem wood dry mass

Stem wood boron content per stem wood dry mass
type: Class
subclass of: Wood boron content per wood dry mass trait
type: NamedIndividual
type: Concept
related match: PO_0009047
related match: PATO_0000125
related match: PO_0005848
definition: The ratio of the quantity (SEP:quantity) of boron (CHEBI:boron atom) in the stem wood (PO:stem, PO:secondary xylem) to the corresponding stem wood (PO:stem, PO:secondary xylem) mass (PATO:mass) assessed after drying
related match: CHEBI_27560
formal name: stem wood boron content per stem wood dry mass
related match: SEP_00055
term status: stable
reference: Eric Garnier, Jens Kattge, Stefan Klotz, Ingolf Kühn, Ulrike Stahl
pref unit: mass unit / mass unit or amount unit / mass unit
in scheme: Thesaurustrait
alternative label: stem wood B content per dry mass

Stem wood calcium content per stem wood dry mass
type: Class
subclass of: Wood calcium content per wood dry mass trait
type: NamedIndividual
type: Concept
alternative label: stem wood Ca content per dry mass
related match: CHEBI_22984
related match: PATO_0000125
pref unit: mass unit / mass unit or amount unit / mass unit
related match: PO_0009047
definition: The ratio of the quantity (SEP:quantity) of calcium (CHEBI:calcium atom) in the stem wood (PO:stem, PO:secondary xylem) to the corresponding stem wood (PO:stem, PO:secondary xylem) mass (PATO:mass) assessed after drying
related match: PO_0005848
related match: SEP_00055
formal name: stem wood calcium content per stem wood dry mass
term status: stable
in scheme: Thesaurustrait
reference: Eric Garnier, Jens Kattge, Stefan Klotz, Ingolf Kühn, Ulrike Stahl

Stem wood carbon content per stem wood dry mass
type: Class
subclass of: Wood carbon content per wood dry mass trait
type: NamedIndividual
type: Concept
pref unit: mass unit / mass unit or amount unit / mass unit
related match: PATO_0000125
related match: PO_0009047
related match: PO_0005848
related match: CHEBI_27594
related match: SEP_00055
formal name: stem wood carbon content per stem wood dry mass
alternative label: stem wood C content per dry mass
term status: stable
definition: The ratio of the quantity (SEP:quantity) of carbon (CHEBI:carbon atom) in the stem wood (PO:stem, PO:secondary xylem) to the corresponding stem wood (PO:stem, PO:secondary xylem) mass (PATO:mass) assessed after drying
reference: Eric Garnier, Jens Kattge, Stefan Klotz, Ingolf Kühn, Ulrike Stahl
in scheme: Thesaurustrait

Stem wood chlorine content per stem wood dry mass
type: Class
subclass of: Wood chlorine content per wood dry mass trait
type: NamedIndividual
type: Concept
related match: PO_0005848
related match: PATO_0000125
pref unit: mass unit / mass unit or amount unit / mass unit
definition: The ratio of the quantity (SEP:quantity) of chlorine (CHEBI:chlorine atom) in the stem wood (PO:stem, PO:secondary xylem) to the corresponding stem wood (PO:stem, PO:secondary xylem) mass (PATO:mass) assessed after drying
related match: PO_0009047
related match: SEP_00055
in scheme: Thesaurustrait
term status: stable
related match: CHEBI_23116
formal name: stem wood chlorine content per stem wood dry mass
reference: Eric Garnier, Jens Kattge, Stefan Klotz, Ingolf Kühn, Ulrike Stahl
alternative label: stem wood Cl content per dry mass

Stem wood cobalt content per stem wood dry mass
type: Class
subclass of: Wood cobalt content per wood dry mass trait
type: NamedIndividual
type: Concept
pref unit: mass unit / mass unit or amount unit / mass unit
related match: PATO_0000125
related match: PO_0005848
formal name: stem wood cobalt content per stem wood dry mass
related match: SEP_00055
term status: stable
related match: PO_0009047
definition: The ratio of the quantity (SEP:quantity) of cobalt (CHEBI:cobalt atom) in the stem wood (PO:stem, PO:secondary xylem) to the corresponding stem wood (PO:stem, PO:secondary xylem) mass (PATO:mass) assessed after drying
alternative label: stem wood Co content per dry mass
related match: CHEBI_27638
in scheme: Thesaurustrait
reference: Eric Garnier, Jens Kattge, Stefan Klotz, Ingolf Kühn, Ulrike Stahl

Stem wood copper content per stem wood dry mass
type: Class
subclass of: Wood copper content per wood dry mass trait
type: NamedIndividual
type: Concept
related match: SEP_00055
related match: PO_0005848
alternative label: stem wood Cu content per dry mass
pref unit: mass unit / mass unit or amount unit / mass unit
formal name: stem wood copper content per stem wood dry mass
related match: PATO_0000125
definition: The ratio of the quantity (SEP:quantity) of copper (CHEBI:copper atom) in the stem wood (PO:stem, PO:secondary xylem) to the corresponding stem wood (PO:stem, PO:secondary xylem) mass (PATO:mass) assessed after drying
term status: stable
related match: CHEBI_28694
related match: PO_0009047
in scheme: Thesaurustrait
reference: Eric Garnier, Jens Kattge, Stefan Klotz, Ingolf Kühn, Ulrike Stahl

Stem wood iron content per stem wood dry mass
type: Class
subclass of: Wood iron content per wood dry mass trait
type: NamedIndividual
type: Concept
related match: PO_0005848
pref unit: mass unit / mass unit or amount unit / mass unit
alternative label: stem wood Fe content per dry mass
related match: PATO_0000125
related match: SEP_00055
definition: The ratio of the quantity (SEP:quantity) of iron (CHEBI:iron atom) in the stem wood (PO:stem, PO:secondary xylem) to the corresponding stem wood (PO:stem, PO:secondary xylem) mass (PATO:mass) assessed after drying
related match: PO_0009047
formal name: stem wood iron content per stem wood dry mass
term status: stable
in scheme: Thesaurustrait
related match: CHEBI_18248
reference: Eric Garnier, Jens Kattge, Stefan Klotz, Ingolf Kühn, Ulrike Stahl

Petiole volume
type: Class
subclass of: Leaf trait
type: NamedIndividual
type: Concept
reference: Eric Garnier, Jens Kattge, Stefan Klotz, Ingolf Kühn, Ulrike Stahl
term status: stable
related match: PO_0020038
formal name: petiole volume
pref unit: volume unit
related match: PATO_0000918
in scheme: Thesaurustrait
definition: the volume (PATO:volume) of a petiole (PO:petiole)

Stem wood magnesium content per stem wood dry mass
type: Class
subclass of: Wood magnesium content per wood dry mass trait
type: NamedIndividual
type: Concept
reference: Eric Garnier, Jens Kattge, Stefan Klotz, Ingolf Kühn, Ulrike Stahl
pref unit: mass unit / mass unit or amount unit / mass unit
related match: SEP_00055
related match: PATO_0000125
related match: PO_0005848
in scheme: Thesaurustrait
formal name: stem wood magnesium content per stem wood dry mass
related match: PO_0009047
term status: stable
related match: CHEBI_25107
definition: The ratio of the quantity (SEP:quantity) of magnesium (CHEBI:magnesium atom) in the stem wood (PO:stem, PO:secondary xylem) to the corresponding stem wood (PO:stem, PO:secondary xylem) mass (PATO:mass) assessed after drying
alternative label: stem wood Mg content per dry mass

Stem wood manganese content per stem wood dry mass
type: Class
subclass of: Wood manganese content per wood dry mass trait
type: NamedIndividual
type: Concept
related match: SEP_00055
related match: PO_0005848
in scheme: Thesaurustrait
pref unit: mass unit / mass unit or amount unit / mass unit
reference: Eric Garnier, Jens Kattge, Stefan Klotz, Ingolf Kühn, Ulrike Stahl
related match: PO_0009047
related match: CHEBI_18291
alternative label: stem wood Mn content per dry mass
formal name: stem wood manganese content per stem wood dry mass
term status: stable
definition: The ratio of the quantity (SEP:quantity) of manganese (CHEBI:manganese atom) in the stem wood (PO:stem, PO:secondary xylem) to the corresponding stem wood (PO:stem, PO:secondary xylem) mass (PATO:mass) assessed after drying
related match: PATO_0000125

Stem wood molybdenum content per stem wood dry mass
type: Class
subclass of: Wood molybdenum content per wood dry mass trait
type: NamedIndividual
type: Concept
related match: PO_0005848
term status: stable
in scheme: Thesaurustrait
pref unit: mass unit / mass unit or amount unit / mass unit
reference: Eric Garnier, Jens Kattge, Stefan Klotz, Ingolf Kühn, Ulrike Stahl
definition: The ratio of the quantity (SEP:quantity) of molybdenum (CHEBI:molybdenum atom) in the stem wood (PO:stem, PO:secondary xylem) to the corresponding stem wood (PO:stem, PO:secondary xylem) mass (PATO:mass) assessed after drying
related match: PO_0009047
related match: CHEBI_28685
alternative label: stem wood Mo content per dry mass
related match: PATO_0000125
formal name: stem wood molybdenum content per stem wood dry mass
related match: SEP_00055

Stem wood sodium content per stem wood dry mass
type: Class
subclass of: Wood sodium content per wood dry mass trait
type: NamedIndividual
type: Concept
formal name: stem wood sodium content per stem wood dry mass
alternative label: stem wood Na content per dry mass
pref unit: mass unit / mass unit or amount unit / mass unit
reference: Eric Garnier, Jens Kattge, Stefan Klotz, Ingolf Kühn, Ulrike Stahl
in scheme: Thesaurustrait
term status: stable
related match: PO_0009047
related match: PO_0005848
related match: CHEBI_26708
related match: SEP_00055
related match: PATO_0000125
definition: The ratio of the quantity (SEP:quantity) of sodium (CHEBI:sodium atom) in the stem wood (PO:stem, PO:secondary xylem) to the corresponding stem wood (PO:stem, PO:secondary xylem) mass (PATO:mass) assessed after drying

Stem wood nickel content per stem wood dry mass
type: Class
subclass of: Wood nickel content per wood dry mass trait
type: NamedIndividual
type: Concept
reference: Eric Garnier, Jens Kattge, Stefan Klotz, Ingolf Kühn, Ulrike Stahl
pref unit: mass unit / mass unit or amount unit / mass unit
term status: stable
in scheme: Thesaurustrait
related match: CHEBI_28112
formal name: stem wood nickel content per stem wood dry mass
related match: PO_0005848
related match: PO_0009047
related match: SEP_00055
related match: PATO_0000125
alternative label: stem wood Ni content per dry mass
definition: The ratio of the quantity (SEP:quantity) of nickel (CHEBI:nickel atom) in the stem wood (PO:stem, PO:secondary xylem) to the corresponding stem wood (PO:stem, PO:secondary xylem) mass (PATO:mass) assessed after drying

Stem wood nitrogen content per stem wood dry mass
type: Class
subclass of: Wood nitrogen content per wood dry mass trait
type: NamedIndividual
type: Concept
term status: stable
formal name: stem wood nitrogen content per stem wood dry mass
reference: Eric Garnier, Jens Kattge, Stefan Klotz, Ingolf Kühn, Ulrike Stahl
in scheme: Thesaurustrait
related match: PO_0009047
related match: PO_0005848
pref unit: mass unit / mass unit or amount unit / mass unit
related match: CHEBI_25555
related match: SEP_00055
alternative label: stem wood N content per dry mass
related match: PATO_0000125
definition: The ratio of the quantity (SEP:quantity) of nitrogen (CHEBI:nitrogen atom) in the stem wood (PO:stem, PO:secondary xylem) to the corresponding stem wood (PO:stem, PO:secondary xylem) mass (PATO:mass) assessed after drying

Stem wood phosphorus content per stem wood dry mass
type: Class
subclass of: Wood phosphorus content per wood dry mass trait
type: NamedIndividual
type: Concept
formal name: stem wood phosphorus content per stem wood dry mass
term status: stable
in scheme: Thesaurustrait
reference: Eric Garnier, Jens Kattge, Stefan Klotz, Ingolf Kühn, Ulrike Stahl
definition: The ratio of the quantity (SEP:quantity) of phosphorus (CHEBI:phosphorus atom) in the stem wood (PO:stem, PO:secondary xylem) to the corresponding stem wood (PO:stem, PO:secondary xylem) mass (PATO:mass) assessed after drying
pref unit: mass unit / mass unit or amount unit / mass unit
related match: PO_0005848
related match: PO_0009047
alternative label: stem wood P content per dry mass
related match: PATO_0000125
related match: SEP_00055
related match: CHEBI_28659

Stem wood potassium content per stem wood dry mass
type: Class
subclass of: Wood potassium content per wood dry mass trait
type: NamedIndividual
type: Concept
term status: stable
alternative label: stem wood K content per dry mass
formal name: stem wood potassium content per stem wood dry mass
in scheme: Thesaurustrait
reference: Eric Garnier, Jens Kattge, Stefan Klotz, Ingolf Kühn, Ulrike Stahl
related match: PO_0005848
related match: PATO_0000125
definition: The ratio of the quantity (SEP:quantity) of potassium (CHEBI:potassium atom) in the stem wood (PO:stem, PO:secondary xylem) to the corresponding stem wood (PO:stem, PO:secondary xylem) mass (PATO:mass) assessed after drying
pref unit: mass unit / mass unit or amount unit / mass unit
related match: PO_0009047
related match: CHEBI_26216
related match: SEP_00055

Stem wood silicon content per stem wood dry mass
type: Class
subclass of: Wood silicon content per wood dry mass trait
type: NamedIndividual
type: Concept
term status: stable
in scheme: Thesaurustrait
related match: PO_0009047
definition: The ratio of the quantity (SEP:quantity) of silicon (CHEBI:silicon atom) in the stem wood (PO:stem, PO:secondary xylem) to the corresponding stem wood (PO:stem, PO:secondary xylem) mass (PATO:mass) assessed after drying
reference: Eric Garnier, Jens Kattge, Stefan Klotz, Ingolf Kühn, Ulrike Stahl
related match: PO_0005848
related match: PATO_0000125
alternative label: stem wood Si content per dry mass
related match: CHEBI_27573
pref unit: mass unit / mass unit or amount unit / mass unit
formal name: stem wood silicon content per stem wood dry mass
related match: SEP_00055

Stem wood sulfur content per stem wood dry mass
type: Class
subclass of: Wood sulfur content per wood dry mass trait
type: NamedIndividual
type: Concept
term status: stable
in scheme: Thesaurustrait
definition: The ratio of the quantity (SEP:quantity) of sulfur (CHEBI:sulfur atom) in the stem wood (PO:stem, PO:secondary xylem) to the corresponding stem wood (PO:stem, PO:secondary xylem) mass (PATO:mass) assessed after drying
related match: PO_0009047
reference: Eric Garnier, Jens Kattge, Stefan Klotz, Ingolf Kühn, Ulrike Stahl
related match: PO_0005848
formal name: stem wood sulfur content per stem wood dry mass
pref unit: mass unit / mass unit or amount unit / mass unit
related match: CHEBI_26833
related match: SEP_00055
related match: PATO_0000125
alternative label: stem wood S content per dry mass

Petiole fresh mass
type: Class
subclass of: Leaf trait
type: NamedIndividual
type: Concept
formal name: petiole fresh mass
pref unit: mass unit
related match: PO_0020038
term status: stable
definition: the mass (PATO:mass) of a petiole (PO:petiole) assessed without drying
related match: PATO_0000125
in scheme: Thesaurustrait
reference: Eric Garnier, Jens Kattge, Stefan Klotz, Ingolf Kühn, Ulrike Stahl

Stem wood zinc content per stem wood dry mass
type: Class
subclass of: Wood zinc content per wood dry mass trait
type: NamedIndividual
type: Concept
in scheme: Thesaurustrait
term status: stable
related match: PO_0009047
alternative label: stem wood Zn content per dry mass
reference: Eric Garnier, Jens Kattge, Stefan Klotz, Ingolf Kühn, Ulrike Stahl
related match: SEP_00055
related match: PATO_0000125
related match: CHEBI_27363
pref unit: mass unit / mass unit or amount unit / mass unit
definition: The ratio of the quantity (SEP:quantity) of zinc (CHEBI:zinc atom) in the stem wood (PO:stem, PO:secondary xylem) to the corresponding stem wood (PO:stem, PO:secondary xylem) mass (PATO:mass) assessed after drying
formal name: stem wood zinc content per stem wood dry mass
related match: PO_0005848

Petiole dry mass
type: Class
subclass of: Leaf trait
type: NamedIndividual
type: Concept
formal name: petiole dry mass
definition: the mass (PATO:mass) of a petiole (PO:petiole) assessed after drying
related match: PO_0020038
related match: PATO_0000125
term status: stable
in scheme: Thesaurustrait
pref unit: mass unit
reference: Eric Garnier, Jens Kattge, Stefan Klotz, Ingolf Kühn, Ulrike Stahl

Specific petiole area
type: Class
subclass of: Leaf trait
type: NamedIndividual
type: Concept
pref unit: area unit / mass unit
formal name: petiole area per petiole dry mass
definition: the ratio of the area of a petiole (TOP:petiole area) to its dry mass (TOP:petiole dry mass)
reference: Eric Garnier, Jens Kattge, Stefan Klotz, Ingolf Kühn, Ulrike Stahl
term status: stable
in scheme: Thesaurustrait

Stem coarse woody debris aluminium content per stem coarse woody debris dry mass
type: Class
subclass of: Coarse woody debris aluminium content per coarse woody debris dry mass trait
type: NamedIndividual
type: Concept
term status: stable
related match: CHEBI_28984
definition: The ratio of the quantity (SEP:quantity) of aluminium (CHEBI:aluminium atom) in the stem (PO:stem) coarse woody debris (Def:coarse woody debris) to the corresponding stem (PO:stem) coarse woody debris mass (PATO:mass) assessed after drying
related match: SEP_00055
alternative label: stem CWD Al content per dry mass
related match: PATO_0000125
related match: PO_0009047
pref unit: mass unit / mass unit or amount unit / mass unit
formal name: stem coarse woody debris aluminium content per stem coarse woody debris dry mass
alternative label: stem coarse woody debris Al content per dry mass
reference: Eric Garnier, Jens Kattge, Stefan Klotz, Ingolf Kühn, Ulrike Stahl
in scheme: Thesaurustrait

Stem coarse woody debris boron content per stem coarse woody debris dry mass
type: Class
subclass of: Coarse woody debris boron content per coarse woody debris dry mass trait
type: NamedIndividual
type: Concept
term status: stable
alternative label: stem coarse woody debris B content per dry mass
definition: The ratio of the quantity (SEP:quantity) of boron (CHEBI:boron atom) in the stem (PO:stem) coarse woody debris (Def:coarse woody debris) to the corresponding stem (PO:stem) coarse woody debris mass (PATO:mass) assessed after drying
related match: CHEBI_27560
formal name: stem coarse woody debris boron content per stem coarse woody debris dry mass
related match: PATO_0000125
related match: SEP_00055
alternative label: stem CWD B content per dry mass
pref unit: mass unit / mass unit or amount unit / mass unit
related match: PO_0009047
in scheme: Thesaurustrait
reference: Eric Garnier, Jens Kattge, Stefan Klotz, Ingolf Kühn, Ulrike Stahl

Stem coarse woody debris calcium content per stem coarse woody debris dry mass
type: Class
subclass of: Coarse woody debris calcium content per coarse woody debris dry mass trait
type: NamedIndividual
type: Concept
term status: stable
related match: SEP_00055
alternative label: stem coarse woody debris Ca content per dry mass
related match: PATO_0000125
related match: CHEBI_22984
related match: PO_0009047
pref unit: mass unit / mass unit or amount unit / mass unit
formal name: stem coarse woody debris calcium content per stem coarse woody debris dry mass
definition: The ratio of the quantity (SEP:quantity) of calcium (CHEBI:calcium atom) in the stem (PO:stem) coarse woody debris (Def:coarse woody debris) to the corresponding stem (PO:stem) coarse woody debris mass (PATO:mass) assessed after drying
alternative label: stem CWD Ca content per dry mass
in scheme: Thesaurustrait
reference: Eric Garnier, Jens Kattge, Stefan Klotz, Ingolf Kühn, Ulrike Stahl

Stem coarse woody debris carbon content per stem coarse woody debris dry mass
type: Class
subclass of: Coarse woody debris carbon content per coarse woody debris dry mass trait
type: NamedIndividual
type: Concept
term status: stable
in scheme: Thesaurustrait
definition: The ratio of the quantity (SEP:quantity) of carbon (CHEBI:carbon atom) in the stem (PO:stem) coarse woody debris (Def:coarse woody debris) to the corresponding stem (PO:stem) coarse woody debris mass (PATO:mass) assessed after drying
formal name: stem coarse woody debris carbon content per stem coarse woody debris dry mass
alternative label: stem CWD C content per dry mass
related match: SEP_00055
related match: PATO_0000125
related match: CHEBI_27594
pref unit: mass unit / mass unit or amount unit / mass unit
related match: PO_0009047
alternative label: stem coarse woody debris C content per dry mass
reference: Eric Garnier, Jens Kattge, Stefan Klotz, Ingolf Kühn, Ulrike Stahl

Stem coarse woody debris chlorine content per stem coarse woody debris dry mass
type: Class
subclass of: Coarse woody debris chlorine content per coarse woody debris dry mass trait
type: NamedIndividual
type: Concept
formal name: stem coarse woody debris chlorine content per stem coarse woody debris dry mass
in scheme: Thesaurustrait
term status: stable
related match: CHEBI_23116
alternative label: stem coarse woody debris Cl content per dry mass
related match: SEP_00055
related match: PATO_0000125
reference: Eric Garnier, Jens Kattge, Stefan Klotz, Ingolf Kühn, Ulrike Stahl
definition: The ratio of the quantity (SEP:quantity) of chlorine (CHEBI:chlorine atom) in the stem (PO:stem) coarse woody debris (Def:coarse woody debris) to the corresponding stem (PO:stem) coarse woody debris mass (PATO:mass) assessed after drying
alternative label: stem CWD Cl content per dry mass
pref unit: mass unit / mass unit or amount unit / mass unit
related match: PO_0009047

Stem coarse woody debris cobalt content per stem coarse woody debris dry mass
type: Class
subclass of: Coarse woody debris cobalt content per coarse woody debris dry mass trait
type: NamedIndividual
type: Concept
alternative label: stem coarse woody debris Co content per dry mass
related match: PO_0009047
definition: The ratio of the quantity (SEP:quantity) of cobalt (CHEBI:cobalt atom) in the stem (PO:stem) coarse woody debris (Def:coarse woody debris) to the corresponding stem (PO:stem) coarse woody debris mass (PATO:mass) assessed after drying
related match: PATO_0000125
formal name: stem coarse woody debris cobalt content per stem coarse woody debris dry mass
related match: SEP_00055
reference: Eric Garnier, Jens Kattge, Stefan Klotz, Ingolf Kühn, Ulrike Stahl
alternative label: stem CWD Co content per dry mass
pref unit: mass unit / mass unit or amount unit / mass unit
related match: CHEBI_27638
term status: stable
in scheme: Thesaurustrait

Stem coarse woody debris copper content per stem coarse woody debris dry mass
type: Class
subclass of: Coarse woody debris copper content per coarse woody debris dry mass trait
type: NamedIndividual
type: Concept
related match: CHEBI_28694
formal name: stem coarse woody debris copper content per stem coarse woody debris dry mass
related match: PO_0009047
related match: PATO_0000125
alternative label: stem CWD Cu content per dry mass
related match: SEP_00055
reference: Eric Garnier, Jens Kattge, Stefan Klotz, Ingolf Kühn, Ulrike Stahl
pref unit: mass unit / mass unit or amount unit / mass unit
in scheme: Thesaurustrait
term status: stable
definition: The ratio of the quantity (SEP:quantity) of copper (CHEBI:copper atom) in the stem (PO:stem) coarse woody debris (Def:coarse woody debris) to the corresponding stem (PO:stem) coarse woody debris mass (PATO:mass) assessed after drying
alternative label: stem coarse woody debris Cu content per dry mass

Stem coarse woody debris iron content per stem coarse woody debris dry mass
type: Class
subclass of: Coarse woody debris iron content per coarse woody debris dry mass trait
type: NamedIndividual
type: Concept
related match: PO_0009047
alternative label: stem coarse woody debris Fe content per dry mass
related match: SEP_00055
related match: PATO_0000125
related match: CHEBI_18248
formal name: stem coarse woody debris iron content per stem coarse woody debris dry mass
pref unit: mass unit / mass unit or amount unit / mass unit
in scheme: Thesaurustrait
definition: The ratio of the quantity (SEP:quantity) of iron (CHEBI:iron atom) in the stem (PO:stem) coarse woody debris (Def:coarse woody debris) to the corresponding stem (PO:stem) coarse woody debris mass (PATO:mass) assessed after drying
alternative label: stem CWD Fe content per dry mass
reference: Eric Garnier, Jens Kattge, Stefan Klotz, Ingolf Kühn, Ulrike Stahl
term status: stable

Stem coarse woody debris magnesium content per stem coarse woody debris dry mass
type: Class
subclass of: Coarse woody debris magnesium content per coarse woody debris dry mass trait
type: NamedIndividual
type: Concept
related match: CHEBI_25107
alternative label: stem CWD Mg content per dry mass
related match: PO_0009047
related match: PATO_0000125
pref unit: mass unit / mass unit or amount unit / mass unit
related match: SEP_00055
definition: The ratio of the quantity (SEP:quantity) of magnesium (CHEBI:magnesium atom) in the stem (PO:stem) coarse woody debris (Def:coarse woody debris) to the corresponding stem (PO:stem) coarse woody debris mass (PATO:mass) assessed after drying
alternative label: stem coarse woody debris Mg content per dry mass
formal name: stem coarse woody debris magnesium content per stem coarse woody debris dry mass
in scheme: Thesaurustrait
reference: Eric Garnier, Jens Kattge, Stefan Klotz, Ingolf Kühn, Ulrike Stahl
term status: stable

Stem coarse woody debris manganese content per stem coarse woody debris dry mass
type: Class
subclass of: Coarse woody debris manganese content per coarse woody debris dry mass trait
type: NamedIndividual
type: Concept
related match: PO_0009047
related match: CHEBI_18291
pref unit: mass unit / mass unit or amount unit / mass unit
related match: PATO_0000125
alternative label: stem coarse woody debris Mn content per dry mass
related match: SEP_00055
formal name: stem coarse woody debris manganese content per stem coarse woody debris dry mass
definition: The ratio of the quantity (SEP:quantity) of manganese (CHEBI:manganese atom) in the stem (PO:stem) coarse woody debris (Def:coarse woody debris) to the corresponding stem (PO:stem) coarse woody debris mass (PATO:mass) assessed after drying
alternative label: stem CWD Mn content per dry mass
in scheme: Thesaurustrait
reference: Eric Garnier, Jens Kattge, Stefan Klotz, Ingolf Kühn, Ulrike Stahl
term status: stable

Petiole mass per area
type: Class
subclass of: Leaf trait
type: NamedIndividual
type: Concept
pref unit: mass unit / area unit
reference: Eric Garnier, Jens Kattge, Stefan Klotz, Ingolf Kühn, Ulrike Stahl
formal name: petiole dry mass per petiole area
term status: stable
definition: the ratio of the dry mass of a petiole (TOP:petiole dry mass) to its area (TOP:petiole area)
in scheme: Thesaurustrait

Stem coarse woody debris molybdenum content per stem coarse woody debris dry mass
type: Class
subclass of: Coarse woody debris molybdenum content per coarse woody debris dry mass trait
type: NamedIndividual
type: Concept
related match: CHEBI_28685
related match: PO_0009047
pref unit: mass unit / mass unit or amount unit / mass unit
term status: stable
alternative label: stem CWD Mo content per dry mass
reference: Eric Garnier, Jens Kattge, Stefan Klotz, Ingolf Kühn, Ulrike Stahl
in scheme: Thesaurustrait
related match: PATO_0000125
formal name: stem coarse woody debris molybdenum content per stem coarse woody debris dry mass
definition: The ratio of the quantity (SEP:quantity) of molybdenum (CHEBI:molybdenum atom) in the stem (PO:stem) coarse woody debris (Def:coarse woody debris) to the corresponding stem (PO:stem) coarse woody debris mass (PATO:mass) assessed after drying
alternative label: stem coarse woody debris Mo content per dry mass
related match: SEP_00055

Stem coarse woody debris sodium content per stem coarse woody debris dry mass
type: Class
subclass of: Coarse woody debris sodium content per coarse woody debris dry mass trait
type: NamedIndividual
type: Concept
related match: PO_0009047
pref unit: mass unit / mass unit or amount unit / mass unit
reference: Eric Garnier, Jens Kattge, Stefan Klotz, Ingolf Kühn, Ulrike Stahl
term status: stable
alternative label: stem coarse woody debris Na content per dry mass
in scheme: Thesaurustrait
definition: The ratio of the quantity (SEP:quantity) of sodium (CHEBI:sodium atom) in the stem (PO:stem) coarse woody debris (Def:coarse woody debris) to the corresponding stem (PO:stem) coarse woody debris mass (PATO:mass) assessed after drying
related match: CHEBI_26708
formal name: stem coarse woody debris sodium content per stem coarse woody debris dry mass
alternative label: stem CWD Na content per dry mass
related match: PATO_0000125
related match: SEP_00055

Stem coarse woody debris nickel content per stem coarse woody debris dry mass
type: Class
subclass of: Coarse woody debris nickel content per coarse woody debris dry mass trait
type: NamedIndividual
type: Concept
definition: The ratio of the quantity (SEP:quantity) of nickel (CHEBI:nickel atom) in the stem (PO:stem) coarse woody debris (Def:coarse woody debris) to the corresponding stem (PO:stem) coarse woody debris mass (PATO:mass) assessed after drying
related match: PO_0009047
pref unit: mass unit / mass unit or amount unit / mass unit
formal name: stem coarse woody debris nickel content per stem coarse woody debris dry mass
alternative label: stem CWD Ni content per dry mass
term status: stable
in scheme: Thesaurustrait
reference: Eric Garnier, Jens Kattge, Stefan Klotz, Ingolf Kühn, Ulrike Stahl
alternative label: stem coarse woody debris Ni content per dry mass
related match: CHEBI_28112
related match: PATO_0000125
related match: SEP_00055

Stem coarse woody debris nitrogen content per stem coarse woody debris dry mass
type: Class
subclass of: Coarse woody debris nitrogen content per coarse woody debris dry mass trait
type: NamedIndividual
type: Concept
definition: The ratio of the quantity (SEP:quantity) of nitrogen (CHEBI:nitrogen atom) in the stem (PO:stem) coarse woody debris (Def:coarse woody debris) to the corresponding stem (PO:stem) coarse woody debris mass (PATO:mass) assessed after drying
pref unit: mass unit / mass unit or amount unit / mass unit
related match: CHEBI_25555
related match: PO_0009047
reference: Eric Garnier, Jens Kattge, Stefan Klotz, Ingolf Kühn, Ulrike Stahl
alternative label: stem CWD N content per dry mass
term status: stable
in scheme: Thesaurustrait
formal name: stem coarse woody debris nitrogen content per stem coarse woody debris dry mass
alternative label: stem coarse woody debris N content per dry mass
related match: SEP_00055
related match: PATO_0000125

Stem coarse woody debris phosphorus content per stem coarse woody debris dry mass
type: Class
subclass of: Coarse woody debris phosphorus content per coarse woody debris dry mass trait
type: NamedIndividual
type: Concept
pref unit: mass unit / mass unit or amount unit / mass unit
related match: PO_0009047
reference: Eric Garnier, Jens Kattge, Stefan Klotz, Ingolf Kühn, Ulrike Stahl
alternative label: stem CWD P content per dry mass
formal name: stem coarse woody debris phosphorus content per stem coarse woody debris dry mass
term status: stable
in scheme: Thesaurustrait
definition: The ratio of the quantity (SEP:quantity) of phosphorus (CHEBI:phosphorus atom) in the stem (PO:stem) coarse woody debris (Def:coarse woody debris) to the corresponding stem (PO:stem) coarse woody debris mass (PATO:mass) assessed after drying
related match: SEP_00055
related match: CHEBI_28659
alternative label: stem coarse woody debris P content per dry mass
related match: PATO_0000125

Stem coarse woody debris potassium content per stem coarse woody debris dry mass
type: Class
subclass of: Coarse woody debris potassium content per coarse woody debris dry mass trait
type: NamedIndividual
type: Concept
related match: PATO_0000125
pref unit: mass unit / mass unit or amount unit / mass unit
reference: Eric Garnier, Jens Kattge, Stefan Klotz, Ingolf Kühn, Ulrike Stahl
formal name: stem coarse woody debris potassium content per stem coarse woody debris dry mass
alternative label: stem coarse woody debris K content per dry mass
related match: PO_0009047
in scheme: Thesaurustrait
term status: stable
alternative label: stem CWD K content per dry mass
definition: The ratio of the quantity (SEP:quantity) of potassium (CHEBI:potassium atom) in the stem (PO:stem) coarse woody debris (Def:coarse woody debris) to the corresponding stem (PO:stem) coarse woody debris mass (PATO:mass) assessed after drying
related match: SEP_00055
related match: CHEBI_26216

Stem coarse woody debris silicon content per stem coarse woody debris dry mass
type: Class
subclass of: Coarse woody debris silicon content per coarse woody debris dry mass trait
type: NamedIndividual
type: Concept
related match: CHEBI_27573
pref unit: mass unit / mass unit or amount unit / mass unit
related match: SEP_00055
reference: Eric Garnier, Jens Kattge, Stefan Klotz, Ingolf Kühn, Ulrike Stahl
definition: The ratio of the quantity (SEP:quantity) of silicon (CHEBI:silicon atom) in the stem (PO:stem) coarse woody debris (Def:coarse woody debris) to the corresponding stem (PO:stem) coarse woody debris mass (PATO:mass) assessed after drying
alternative label: stem coarse woody debris Si content per dry mass
related match: PO_0009047
formal name: stem coarse woody debris silicon content per stem coarse woody debris dry mass
term status: stable
in scheme: Thesaurustrait
alternative label: stem CWD Si content per dry mass
related match: PATO_0000125

Stem coarse woody debris sulfur content per stem coarse woody debris dry mass
type: Class
subclass of: Coarse woody debris sulfur content per coarse woody debris dry mass trait
type: NamedIndividual
type: Concept
related match: SEP_00055
pref unit: mass unit / mass unit or amount unit / mass unit
reference: Eric Garnier, Jens Kattge, Stefan Klotz, Ingolf Kühn, Ulrike Stahl
alternative label: stem CWD S content per dry mass
related match: PO_0009047
definition: The ratio of the quantity (SEP:quantity) of sulfur (CHEBI:sulfur atom) in the stem (PO:stem) coarse woody debris (Def:coarse woody debris) to the corresponding stem (PO:stem) coarse woody debris mass (PATO:mass) assessed after drying
term status: stable
in scheme: Thesaurustrait
formal name: stem coarse woody debris sulfur content per stem coarse woody debris dry mass
alternative label: stem coarse woody debris S content per dry mass
related match: CHEBI_26833
related match: PATO_0000125

Stem coarse woody debris zinc content per stem coarse woody debris dry mass
type: Class
subclass of: Coarse woody debris zinc content per coarse woody debris dry mass trait
type: NamedIndividual
type: Concept
related match: CHEBI_27363
reference: Eric Garnier, Jens Kattge, Stefan Klotz, Ingolf Kühn, Ulrike Stahl
related match: SEP_00055
pref unit: mass unit / mass unit or amount unit / mass unit
formal name: stem coarse woody debris zinc content per stem coarse woody debris dry mass
term status: stable
related match: PO_0009047
alternative label: stem coarse woody debris Zn content per dry mass
in scheme: Thesaurustrait
definition: The ratio of the quantity (SEP:quantity) of zinc (CHEBI:zinc atom) in the stem (PO:stem) coarse woody debris (Def:coarse woody debris) to the corresponding stem (PO:stem) coarse woody debris mass (PATO:mass) assessed after drying
related match: PATO_0000125
alternative label: stem CWD Zn content per dry mass

Branch coarse woody debris aluminium content per branch coarse woody debris dry mass
type: Class
subclass of: Coarse woody debris aluminium content per coarse woody debris dry mass trait
type: NamedIndividual
type: Concept
formal name: branch coarse woody debris aluminium content per branch coarse woody debris dry mass
related match: PO_0025073
related match: SEP_00055
definition: The ratio of the quantity (SEP:quantity) of aluminium (CHEBI:aluminium atom) in the branch (PO:branch) coarse woody debris (Def:coarse woody debris) to the corresponding branch (PO:branch) coarse woody debris mass (PATO:mass) assessed after drying
reference: Eric Garnier, Jens Kattge, Stefan Klotz, Ingolf Kühn, Ulrike Stahl
alternative label: branch coarse woody debris Al content per dry mass
in scheme: Thesaurustrait
term status: stable
alternative label: branch CWD Al content per dry mass
related match: PATO_0000125
pref unit: mass unit / mass unit or amount unit / mass unit
related match: CHEBI_28984

Petiole dry matter content
type: Class
subclass of: Leaf trait
type: NamedIndividual
type: Concept
formal name: petiole dry mass per petiole fresh mass
term status: stable
pref unit: mass unit / mass unit
definition: the ratio of the dry mass of a petiole (TOP:petiole dry mass) to its fresh mass (TOP:petiole fresh mass)
in scheme: Thesaurustrait
reference: Eric Garnier, Jens Kattge, Stefan Klotz, Ingolf Kühn, Ulrike Stahl

Branch coarse woody debris boron content per branch coarse woody debris dry mass
type: Class
subclass of: Coarse woody debris boron content per coarse woody debris dry mass trait
type: NamedIndividual
type: Concept
related match: CHEBI_27560
alternative label: branch CWD B content per dry mass
related match: PO_0025073
definition: The ratio of the quantity (SEP:quantity) of boron (CHEBI:boron atom) in the branch (PO:branch) coarse woody debris (Def:coarse woody debris) to the corresponding branch (PO:branch) coarse woody debris mass (PATO:mass) assessed after drying
pref unit: mass unit / mass unit or amount unit / mass unit
formal name: branch coarse woody debris boron content per branch coarse woody debris dry mass
related match: PATO_0000125
related match: SEP_00055
alternative label: branch coarse woody debris B content per dry mass
term status: stable
reference: Eric Garnier, Jens Kattge, Stefan Klotz, Ingolf Kühn, Ulrike Stahl
in scheme: Thesaurustrait

Branch coarse woody debris calcium content per branch coarse woody debris dry mass
type: Class
subclass of: Coarse woody debris calcium content per coarse woody debris dry mass trait
type: NamedIndividual
type: Concept
related match: PO_0025073
definition: The ratio of the quantity (SEP:quantity) of calcium (CHEBI:calcium atom) in the branch (PO:branch) coarse woody debris (Def:coarse woody debris) to the corresponding branch (PO:branch) coarse woody debris mass (PATO:mass) assessed after drying
pref unit: mass unit / mass unit or amount unit / mass unit
related match: PATO_0000125
related match: SEP_00055
alternative label: branch coarse woody debris Ca content per dry mass
formal name: branch coarse woody debris calcium content per branch coarse woody debris dry mass
term status: stable
related match: CHEBI_22984
in scheme: Thesaurustrait
alternative label: branch CWD Ca content per dry mass
reference: Eric Garnier, Jens Kattge, Stefan Klotz, Ingolf Kühn, Ulrike Stahl

Branch coarse woody debris carbon content per branch coarse woody debris dry mass
type: Class
subclass of: Coarse woody debris carbon content per coarse woody debris dry mass trait
type: NamedIndividual
type: Concept
related match: CHEBI_27594
related match: PO_0025073
pref unit: mass unit / mass unit or amount unit / mass unit
alternative label: branch CWD C content per dry mass
related match: SEP_00055
related match: PATO_0000125
definition: The ratio of the quantity (SEP:quantity) of carbon (CHEBI:carbon atom) in the branch (PO:branch) coarse woody debris (Def:coarse woody debris) to the corresponding branch (PO:branch) coarse woody debris mass (PATO:mass) assessed after drying
formal name: branch coarse woody debris carbon content per branch coarse woody debris dry mass
term status: stable
in scheme: Thesaurustrait
reference: Eric Garnier, Jens Kattge, Stefan Klotz, Ingolf Kühn, Ulrike Stahl
alternative label: branch coarse woody debris C content per dry mass

Branch coarse woody debris chlorine content per branch coarse woody debris dry mass
type: Class
subclass of: Coarse woody debris chlorine content per coarse woody debris dry mass trait
type: NamedIndividual
type: Concept
related match: PO_0025073
definition: The ratio of the quantity (SEP:quantity) of chlorine (CHEBI:chlorine atom) in the branch (PO:branch) coarse woody debris (Def:coarse woody debris) to the corresponding branch (PO:branch) coarse woody debris mass (PATO:mass) assessed after drying
related match: SEP_00055
pref unit: mass unit / mass unit or amount unit / mass unit
alternative label: branch CWD Cl content per dry mass
related match: PATO_0000125
reference: Eric Garnier, Jens Kattge, Stefan Klotz, Ingolf Kühn, Ulrike Stahl
in scheme: Thesaurustrait
alternative label: branch coarse woody debris Cl content per dry mass
related match: CHEBI_23116
formal name: branch coarse woody debris chlorine content per branch coarse woody debris dry mass
term status: stable

Branch coarse woody debris cobalt content per branch coarse woody debris dry mass
type: Class
subclass of: Coarse woody debris cobalt content per coarse woody debris dry mass trait
type: NamedIndividual
type: Concept
definition: The ratio of the quantity (SEP:quantity) of cobalt (CHEBI:cobalt atom) in the branch (PO:branch) coarse woody debris (Def:coarse woody debris) to the corresponding branch (PO:branch) coarse woody debris mass (PATO:mass) assessed after drying
related match: PO_0025073
related match: SEP_00055
related match: PATO_0000125
alternative label: branch CWD Co content per dry mass
formal name: branch coarse woody debris cobalt content per branch coarse woody debris dry mass
pref unit: mass unit / mass unit or amount unit / mass unit
reference: Eric Garnier, Jens Kattge, Stefan Klotz, Ingolf Kühn, Ulrike Stahl
in scheme: Thesaurustrait
term status: stable
related match: CHEBI_27638
alternative label: branch coarse woody debris Co content per dry mass

Branch coarse woody debris copper content per branch coarse woody debris dry mass
type: Class
subclass of: Coarse woody debris copper content per coarse woody debris dry mass trait
type: NamedIndividual
type: Concept
in scheme: Thesaurustrait
related match: PO_0025073
related match: CHEBI_28694
related match: SEP_00055
alternative label: branch CWD Cu content per dry mass
related match: PATO_0000125
definition: The ratio of the quantity (SEP:quantity) of copper (CHEBI:copper atom) in the branch (PO:branch) coarse woody debris (Def:coarse woody debris) to the corresponding branch (PO:branch) coarse woody debris mass (PATO:mass) assessed after drying
pref unit: mass unit / mass unit or amount unit / mass unit
formal name: branch coarse woody debris copper content per branch coarse woody debris dry mass
alternative label: branch coarse woody debris Cu content per dry mass
reference: Eric Garnier, Jens Kattge, Stefan Klotz, Ingolf Kühn, Ulrike Stahl
term status: stable

Branch coarse woody debris iron content per branch coarse woody debris dry mass
type: Class
subclass of: Coarse woody debris iron content per coarse woody debris dry mass trait
type: NamedIndividual
type: Concept
in scheme: Thesaurustrait
formal name: branch coarse woody debris iron content per branch coarse woody debris dry mass
related match: PO_0025073
related match: SEP_00055
alternative label: branch coarse woody debris Fe content per dry mass
related match: PATO_0000125
pref unit: mass unit / mass unit or amount unit / mass unit
definition: The ratio of the quantity (SEP:quantity) of iron (CHEBI:iron atom) in the branch (PO:branch) coarse woody debris (Def:coarse woody debris) to the corresponding branch (PO:branch) coarse woody debris mass (PATO:mass) assessed after drying
reference: Eric Garnier, Jens Kattge, Stefan Klotz, Ingolf Kühn, Ulrike Stahl
related match: CHEBI_18248
alternative label: branch CWD Fe content per dry mass
term status: stable

Branch coarse woody debris magnesium content per branch coarse woody debris dry mass
type: Class
subclass of: Coarse woody debris magnesium content per coarse woody debris dry mass trait
type: NamedIndividual
type: Concept
in scheme: Thesaurustrait
term status: stable
alternative label: branch CWD Mg content per dry mass
related match: PO_0025073
definition: The ratio of the quantity (SEP:quantity) of magnesium (CHEBI:magnesium atom) in the branch (PO:branch) coarse woody debris (Def:coarse woody debris) to the corresponding branch (PO:branch) coarse woody debris mass (PATO:mass) assessed after drying
related match: PATO_0000125
reference: Eric Garnier, Jens Kattge, Stefan Klotz, Ingolf Kühn, Ulrike Stahl
pref unit: mass unit / mass unit or amount unit / mass unit
related match: SEP_00055
alternative label: branch coarse woody debris Mg content per dry mass
formal name: branch coarse woody debris magnesium content per branch coarse woody debris dry mass
related match: CHEBI_25107

Branch coarse woody debris manganese content per branch coarse woody debris dry mass
type: Class
subclass of: Coarse woody debris manganese content per coarse woody debris dry mass trait
type: NamedIndividual
type: Concept
in scheme: Thesaurustrait
term status: stable
related match: CHEBI_18291
formal name: branch coarse woody debris manganese content per branch coarse woody debris dry mass
related match: PO_0025073
alternative label: branch coarse woody debris Mn content per dry mass
definition: The ratio of the quantity (SEP:quantity) of manganese (CHEBI:manganese atom) in the branch (PO:branch) coarse woody debris (Def:coarse woody debris) to the corresponding branch (PO:branch) coarse woody debris mass (PATO:mass) assessed after drying
reference: Eric Garnier, Jens Kattge, Stefan Klotz, Ingolf Kühn, Ulrike Stahl
related match: SEP_00055
related match: PATO_0000125
pref unit: mass unit / mass unit or amount unit / mass unit
alternative label: branch CWD Mn content per dry mass

Branch coarse woody debris molybdenum content per branch coarse woody debris dry mass
type: Class
subclass of: Coarse woody debris molybdenum content per coarse woody debris dry mass trait
type: NamedIndividual
type: Concept
related match: CHEBI_28685
in scheme: Thesaurustrait
definition: The ratio of the quantity (SEP:quantity) of molybdenum (CHEBI:molybdenum atom) in the branch (PO:branch) coarse woody debris (Def:coarse woody debris) to the corresponding branch (PO:branch) coarse woody debris mass (PATO:mass) assessed after drying
related match: PO_0025073
alternative label: branch coarse woody debris Mo content per dry mass
related match: SEP_00055
reference: Eric Garnier, Jens Kattge, Stefan Klotz, Ingolf Kühn, Ulrike Stahl
pref unit: mass unit / mass unit or amount unit / mass unit
related match: PATO_0000125
formal name: branch coarse woody debris molybdenum content per branch coarse woody debris dry mass
alternative label: branch CWD Mo content per dry mass
term status: stable

Petiole density
type: Class
subclass of: Leaf trait
type: NamedIndividual
type: Concept
definition: the ratio of the dry mass of a petiole (TOP:petiole dry mass) to its volume (TOP:petiole volume)
term status: stable
formal name: petiole dry mass per petiole volume
pref unit: mass unit / volume unit
in scheme: Thesaurustrait
reference: Eric Garnier, Jens Kattge, Stefan Klotz, Ingolf Kühn, Ulrike Stahl

Branch coarse woody debris sodium content per branch coarse woody debris dry mass
type: Class
subclass of: Coarse woody debris sodium content per coarse woody debris dry mass trait
type: NamedIndividual
type: Concept
alternative label: branch CWD Na content per dry mass
definition: The ratio of the quantity (SEP:quantity) of sodium (CHEBI:sodium atom) in the branch (PO:branch) coarse woody debris (Def:coarse woody debris) to the corresponding branch (PO:branch) coarse woody debris mass (PATO:mass) assessed after drying
term status: stable
in scheme: Thesaurustrait
related match: SEP_00055
reference: Eric Garnier, Jens Kattge, Stefan Klotz, Ingolf Kühn, Ulrike Stahl
related match: CHEBI_26708
formal name: branch coarse woody debris sodium content per branch coarse woody debris dry mass
pref unit: mass unit / mass unit or amount unit / mass unit
alternative label: branch coarse woody debris Na content per dry mass
related match: PO_0025073
related match: PATO_0000125

Branch coarse woody debris nickel content per branch coarse woody debris dry mass
type: Class
subclass of: Coarse woody debris nickel content per coarse woody debris dry mass trait
type: NamedIndividual
type: Concept
related match: CHEBI_28112
formal name: branch coarse woody debris nickel content per branch coarse woody debris dry mass
definition: The ratio of the quantity (SEP:quantity) of nickel (CHEBI:nickel atom) in the branch (PO:branch) coarse woody debris (Def:coarse woody debris) to the corresponding branch (PO:branch) coarse woody debris mass (PATO:mass) assessed after drying
term status: stable
in scheme: Thesaurustrait
alternative label: branch CWD Ni content per dry mass
related match: SEP_00055
reference: Eric Garnier, Jens Kattge, Stefan Klotz, Ingolf Kühn, Ulrike Stahl
pref unit: mass unit / mass unit or amount unit / mass unit
related match: PO_0025073
related match: PATO_0000125
alternative label: branch coarse woody debris Ni content per dry mass

Branch coarse woody debris nitrogen content per branch coarse woody debris dry mass
type: Class
subclass of: Coarse woody debris nitrogen content per coarse woody debris dry mass trait
type: NamedIndividual
type: Concept
alternative label: branch CWD N content per dry mass
related match: CHEBI_25555
in scheme: Thesaurustrait
reference: Eric Garnier, Jens Kattge, Stefan Klotz, Ingolf Kühn, Ulrike Stahl
term status: stable
definition: The ratio of the quantity (SEP:quantity) of nitrogen (CHEBI:nitrogen atom) in the branch (PO:branch) coarse woody debris (Def:coarse woody debris) to the corresponding branch (PO:branch) coarse woody debris mass (PATO:mass) assessed after drying
alternative label: branch coarse woody debris N content per dry mass
formal name: branch coarse woody debris nitrogen content per branch coarse woody debris dry mass
pref unit: mass unit / mass unit or amount unit / mass unit
related match: PO_0025073
related match: SEP_00055
related match: PATO_0000125

Branch coarse woody debris phosphorus content per branch coarse woody debris dry mass
type: Class
subclass of: Coarse woody debris phosphorus content per coarse woody debris dry mass trait
type: NamedIndividual
type: Concept
alternative label: branch CWD P content per dry mass
in scheme: Thesaurustrait
reference: Eric Garnier, Jens Kattge, Stefan Klotz, Ingolf Kühn, Ulrike Stahl
formal name: branch coarse woody debris phosphorus content per branch coarse woody debris dry mass
term status: stable
related match: PO_0025073
definition: The ratio of the quantity (SEP:quantity) of phosphorus (CHEBI:phosphorus atom) in the branch (PO:branch) coarse woody debris (Def:coarse woody debris) to the corresponding branch (PO:branch) coarse woody debris mass (PATO:mass) assessed after drying
alternative label: branch coarse woody debris P content per dry mass
related match: PATO_0000125
pref unit: mass unit / mass unit or amount unit / mass unit
related match: CHEBI_28659
related match: SEP_00055

Branch coarse woody debris potassium content per branch coarse woody debris dry mass
type: Class
subclass of: Coarse woody debris potassium content per coarse woody debris dry mass trait
type: NamedIndividual
type: Concept
alternative label: branch CWD K content per dry mass
formal name: branch coarse woody debris potassium content per branch coarse woody debris dry mass
in scheme: Thesaurustrait
reference: Eric Garnier, Jens Kattge, Stefan Klotz, Ingolf Kühn, Ulrike Stahl
term status: stable
related match: PO_0025073
alternative label: branch coarse woody debris K content per dry mass
definition: The ratio of the quantity (SEP:quantity) of potassium (CHEBI:potassium atom) in the branch (PO:branch) coarse woody debris (Def:coarse woody debris) to the corresponding branch (PO:branch) coarse woody debris mass (PATO:mass) assessed after drying
pref unit: mass unit / mass unit or amount unit / mass unit
related match: PATO_0000125
related match: SEP_00055
related match: CHEBI_26216

Branch coarse woody debris silicon content per branch coarse woody debris dry mass
type: Class
subclass of: Coarse woody debris silicon content per coarse woody debris dry mass trait
type: NamedIndividual
type: Concept
alternative label: branch CWD Si content per dry mass
reference: Eric Garnier, Jens Kattge, Stefan Klotz, Ingolf Kühn, Ulrike Stahl
related match: CHEBI_27573
in scheme: Thesaurustrait
term status: stable
formal name: branch coarse woody debris silicon content per branch coarse woody debris dry mass
related match: PO_0025073
definition: The ratio of the quantity (SEP:quantity) of silicon (CHEBI:silicon atom) in the branch (PO:branch) coarse woody debris (Def:coarse woody debris) to the corresponding branch (PO:branch) coarse woody debris mass (PATO:mass) assessed after drying
alternative label: branch coarse woody debris Si content per dry mass
related match: PATO_0000125
related match: SEP_00055
pref unit: mass unit / mass unit or amount unit / mass unit

Branch coarse woody debris sulfur content per branch coarse woody debris dry mass
type: Class
subclass of: Coarse woody debris sulfur content per coarse woody debris dry mass trait
type: NamedIndividual
type: Concept
definition: The ratio of the quantity (SEP:quantity) of sulfur (CHEBI:sulfur atom) in the branch (PO:branch) coarse woody debris (Def:coarse woody debris) to the corresponding branch (PO:branch) coarse woody debris mass (PATO:mass) assessed after drying
formal name: branch coarse woody debris sulfur content per branch coarse woody debris dry mass
alternative label: branch coarse woody debris S content per dry mass
reference: Eric Garnier, Jens Kattge, Stefan Klotz, Ingolf Kühn, Ulrike Stahl
term status: stable
related match: PO_0025073
in scheme: Thesaurustrait
alternative label: branch CWD S content per dry mass
pref unit: mass unit / mass unit or amount unit / mass unit
related match: SEP_00055
related match: PATO_0000125
related match: CHEBI_26833

Branch coarse woody debris zinc content per branch coarse woody debris dry mass
type: Class
subclass of: Coarse woody debris zinc content per coarse woody debris dry mass trait
type: NamedIndividual
type: Concept
related match: PATO_0000125
reference: Eric Garnier, Jens Kattge, Stefan Klotz, Ingolf Kühn, Ulrike Stahl
alternative label: branch coarse woody debris Zn content per dry mass
related match: CHEBI_27363
term status: stable
formal name: branch coarse woody debris zinc content per branch coarse woody debris dry mass
in scheme: Thesaurustrait
alternative label: branch CWD Zn content per dry mass
related match: SEP_00055
related match: PO_0025073
pref unit: mass unit / mass unit or amount unit / mass unit
definition: The ratio of the quantity (SEP:quantity) of zinc (CHEBI:zinc atom) in the branch (PO:branch) coarse woody debris (Def:coarse woody debris) to the corresponding branch (PO:branch) coarse woody debris mass (PATO:mass) assessed after drying

Shoot aluminium content per shoot dry mass
type: Class
subclass of: Shoot trait
type: NamedIndividual
type: Concept
pref unit: mass unit / mass unit or amount unit / mass unit
related match: PATO_0000125
related match: SEP_00055
reference: Eric Garnier, Jens Kattge, Stefan Klotz, Ingolf Kühn, Ulrike Stahl
related match: PO_0009006
definition: The ratio of the quantity (SEP:quantity) of aluminium (CHEBI:aluminium atom) in the shoot (PO:shoot system) to the corresponding shoot (PO:shoot system) mass (PATO:mass) assessed after drying
alternative label: shoot Al content per dry mass
term status: stable
in scheme: Thesaurustrait
related match: CHEBI_28984
formal name: shoot aluminium content per shoot dry mass

Shoot boron content per shoot dry mass
type: Class
subclass of: Shoot trait
type: NamedIndividual
type: Concept
related match: PATO_0000125
formal name: shoot boron content per shoot dry mass
pref unit: mass unit / mass unit or amount unit / mass unit
related match: CHEBI_27560
related match: SEP_00055
reference: Eric Garnier, Jens Kattge, Stefan Klotz, Ingolf Kühn, Ulrike Stahl
definition: The ratio of the quantity (SEP:quantity) of boron (CHEBI:boron atom) in the shoot (PO:shoot system) to the corresponding shoot (PO:shoot system) mass (PATO:mass) assessed after drying
related match: PO_0009006
term status: stable
in scheme: Thesaurustrait
alternative label: shoot B content per dry mass

Plant height trait
type: Class
subclass of: Shoot trait
type: NamedIndividual
type: Concept
pref unit: length unit
definition: the height (PATO:height) of a whole plant (PO:whole plant)
alternative label: shoot height
term status: stable
reference: http://archive.gramene.org/db/ontology/search
related match: PATO_0000119
formal name: whole plant height
related match: PO_0000003
in scheme: Thesaurustrait

Shoot calcium content per shoot dry mass
type: Class
subclass of: Shoot trait
type: NamedIndividual
type: Concept
related match: PATO_0000125
pref unit: mass unit / mass unit or amount unit / mass unit
reference: Eric Garnier, Jens Kattge, Stefan Klotz, Ingolf Kühn, Ulrike Stahl
related match: CHEBI_22984
alternative label: shoot Ca content per dry mass
related match: SEP_00055
in scheme: Thesaurustrait
term status: stable
formal name: shoot calcium content per shoot dry mass
related match: PO_0009006
definition: The ratio of the quantity (SEP:quantity) of calcium (CHEBI:calcium atom) in the shoot (PO:shoot system) to the corresponding shoot (PO:shoot system) mass (PATO:mass) assessed after drying

Shoot carbon content per shoot dry mass
type: Class
subclass of: Shoot trait
type: NamedIndividual
type: Concept
pref unit: mass unit / mass unit or amount unit / mass unit
related match: SEP_00055
reference: Eric Garnier, Jens Kattge, Stefan Klotz, Ingolf Kühn, Ulrike Stahl
related match: CHEBI_27594
definition: The ratio of the quantity (SEP:quantity) of carbon (CHEBI:carbon atom) in the shoot (PO:shoot system) to the corresponding shoot (PO:shoot system) mass (PATO:mass) assessed after drying
related match: PATO_0000125
in scheme: Thesaurustrait
formal name: shoot carbon content per shoot dry mass
alternative label: shoot C content per dry mass
related match: PO_0009006
term status: stable

Shoot chlorine content per shoot dry mass
type: Class
subclass of: Shoot trait
type: NamedIndividual
type: Concept
related match: SEP_00055
pref unit: mass unit / mass unit or amount unit / mass unit
reference: Eric Garnier, Jens Kattge, Stefan Klotz, Ingolf Kühn, Ulrike Stahl
formal name: shoot chlorine content per shoot dry mass
related match: PATO_0000125
related match: CHEBI_23116
in scheme: Thesaurustrait
definition: The ratio of the quantity (SEP:quantity) of chlorine (CHEBI:chlorine atom) in the shoot (PO:shoot system) to the corresponding shoot (PO:shoot system) mass (PATO:mass) assessed after drying
alternative label: shoot Cl content per dry mass
related match: PO_0009006
term status: stable

Shoot cobalt content per shoot dry mass
type: Class
subclass of: Shoot trait
type: NamedIndividual
type: Concept
reference: Eric Garnier, Jens Kattge, Stefan Klotz, Ingolf Kühn, Ulrike Stahl
pref unit: mass unit / mass unit or amount unit / mass unit
related match: SEP_00055
formal name: shoot cobalt content per shoot dry mass
related match: PATO_0000125
in scheme: Thesaurustrait
related match: CHEBI_27638
definition: The ratio of the quantity (SEP:quantity) of cobalt (CHEBI:cobalt atom) in the shoot (PO:shoot system) to the corresponding shoot (PO:shoot system) mass (PATO:mass) assessed after drying
term status: stable
alternative label: shoot Co content per dry mass
related match: PO_0009006

Shoot copper content per shoot dry mass
type: Class
subclass of: Shoot trait
type: NamedIndividual
type: Concept
formal name: shoot copper content per shoot dry mass
related match: SEP_00055
reference: Eric Garnier, Jens Kattge, Stefan Klotz, Ingolf Kühn, Ulrike Stahl
alternative label: shoot Cu content per dry mass
related match: PATO_0000125
pref unit: mass unit / mass unit or amount unit / mass unit
related match: CHEBI_28694
definition: The ratio of the quantity (SEP:quantity) of copper (CHEBI:copper atom) in the shoot (PO:shoot system) to the corresponding shoot (PO:shoot system) mass (PATO:mass) assessed after drying
in scheme: Thesaurustrait
term status: stable
related match: PO_0009006

Shoot iron content per shoot dry mass
type: Class
subclass of: Shoot trait
type: NamedIndividual
type: Concept
related match: CHEBI_18248
related match: SEP_00055
reference: Eric Garnier, Jens Kattge, Stefan Klotz, Ingolf Kühn, Ulrike Stahl
related match: PATO_0000125
pref unit: mass unit / mass unit or amount unit / mass unit
alternative label: shoot Fe content per dry mass
formal name: shoot iron content per shoot dry mass
definition: The ratio of the quantity (SEP:quantity) of iron (CHEBI:iron atom) in the shoot (PO:shoot system) to the corresponding shoot (PO:shoot system) mass (PATO:mass) assessed after drying
term status: stable
in scheme: Thesaurustrait
related match: PO_0009006

Shoot magnesium content per shoot dry mass
type: Class
subclass of: Shoot trait
type: NamedIndividual
type: Concept
pref unit: mass unit / mass unit or amount unit / mass unit
related match: SEP_00055
related match: PATO_0000125
alternative label: shoot Mg content per dry mass
formal name: shoot magnesium content per shoot dry mass
related match: CHEBI_25107
term status: stable
in scheme: Thesaurustrait
reference: Eric Garnier, Jens Kattge, Stefan Klotz, Ingolf Kühn, Ulrike Stahl
related match: PO_0009006
definition: The ratio of the quantity (SEP:quantity) of magnesium (CHEBI:magnesium atom) in the shoot (PO:shoot system) to the corresponding shoot (PO:shoot system) mass (PATO:mass) assessed after drying

Shoot manganese content per shoot dry mass
type: Class
subclass of: Shoot trait
type: NamedIndividual
type: Concept
in scheme: Thesaurustrait
pref unit: mass unit / mass unit or amount unit / mass unit
related match: SEP_00055
related match: PATO_0000125
alternative label: shoot Mn content per dry mass
formal name: shoot manganese content per shoot dry mass
definition: The ratio of the quantity (SEP:quantity) of manganese (CHEBI:manganese atom) in the shoot (PO:shoot system) to the corresponding shoot (PO:shoot system) mass (PATO:mass) assessed after drying
reference: Eric Garnier, Jens Kattge, Stefan Klotz, Ingolf Kühn, Ulrike Stahl
term status: stable
related match: CHEBI_18291
related match: PO_0009006

Shoot molybdenum content per shoot dry mass
type: Class
subclass of: Shoot trait
type: NamedIndividual
type: Concept
formal name: shoot molybdenum content per shoot dry mass
in scheme: Thesaurustrait
alternative label: shoot Mo content per dry mass
related match: SEP_00055
pref unit: mass unit / mass unit or amount unit / mass unit
related match: CHEBI_28685
related match: PATO_0000125
reference: Eric Garnier, Jens Kattge, Stefan Klotz, Ingolf Kühn, Ulrike Stahl
definition: The ratio of the quantity (SEP:quantity) of molybdenum (CHEBI:molybdenum atom) in the shoot (PO:shoot system) to the corresponding shoot (PO:shoot system) mass (PATO:mass) assessed after drying
related match: PO_0009006
term status: stable

Shoot sodium content per shoot dry mass
type: Class
subclass of: Shoot trait
type: NamedIndividual
type: Concept
term status: stable
in scheme: Thesaurustrait
pref unit: mass unit / mass unit or amount unit / mass unit
formal name: shoot sodium content per shoot dry mass
related match: CHEBI_26708
related match: PATO_0000125
related match: SEP_00055
reference: Eric Garnier, Jens Kattge, Stefan Klotz, Ingolf Kühn, Ulrike Stahl
related match: PO_0009006
definition: The ratio of the quantity (SEP:quantity) of sodium (CHEBI:sodium atom) in the shoot (PO:shoot system) to the corresponding shoot (PO:shoot system) mass (PATO:mass) assessed after drying
alternative label: shoot Na content per dry mass

Plant height vegetative
type: Class
subclass of: Plant height trait
type: NamedIndividual
type: Concept
term status: stable
in scheme: Thesaurustrait
pref unit: length unit
alternative label: vegetative plant height
related match: To plant height
definition: the plant height (TO:plant height) considering the highest vegetative component
formal name: whole plant height vegetative
reference: Eric Garnier, Jens Kattge, Stefan Klotz, Ingolf Kühn, Ulrike Stahl

Shoot nickel content per shoot dry mass
type: Class
subclass of: Shoot trait
type: NamedIndividual
type: Concept
in scheme: Thesaurustrait
definition: The ratio of the quantity (SEP:quantity) of nickel (CHEBI:nickel atom) in the shoot (PO:shoot system) to the corresponding shoot (PO:shoot system) mass (PATO:mass) assessed after drying
related match: PO_0009006
formal name: shoot nickel content per shoot dry mass
reference: Eric Garnier, Jens Kattge, Stefan Klotz, Ingolf Kühn, Ulrike Stahl
term status: stable
pref unit: mass unit / mass unit or amount unit / mass unit
related match: CHEBI_28112
related match: SEP_00055
related match: PATO_0000125
alternative label: shoot Ni content per dry mass

Shoot nitrogen content per shoot dry mass
type: Class
subclass of: Shoot trait
type: NamedIndividual
type: Concept
definition: The ratio of the quantity (SEP:quantity) of nitrogen (CHEBI:nitrogen atom) in the shoot (PO:shoot system) to the corresponding shoot (PO:shoot system) mass (PATO:mass) assessed after drying
in scheme: Thesaurustrait
related match: CHEBI_25555
alternative label: shoot N content per dry mass
term status: stable
related match: PO_0009006
related match: PATO_0000125
pref unit: mass unit / mass unit or amount unit / mass unit
reference: Eric Garnier, Jens Kattge, Stefan Klotz, Ingolf Kühn, Ulrike Stahl
formal name: shoot nitrogen content per shoot dry mass
related match: SEP_00055

Shoot phosphorus content per shoot dry mass
type: Class
subclass of: Shoot trait
type: NamedIndividual
type: Concept
term status: stable
in scheme: Thesaurustrait
related match: CHEBI_28659
alternative label: shoot P content per dry mass
definition: The ratio of the quantity (SEP:quantity) of phosphorus (CHEBI:phosphorus atom) in the shoot (PO:shoot system) to the corresponding shoot (PO:shoot system) mass (PATO:mass) assessed after drying
related match: PO_0009006
related match: PATO_0000125
reference: Eric Garnier, Jens Kattge, Stefan Klotz, Ingolf Kühn, Ulrike Stahl
pref unit: mass unit / mass unit or amount unit / mass unit
related match: SEP_00055
formal name: shoot phosphorus content per shoot dry mass

Shoot potassium content per shoot dry mass
type: Class
subclass of: Shoot trait
type: NamedIndividual
type: Concept
term status: stable
in scheme: Thesaurustrait
related match: PO_0009006
alternative label: shoot K content per dry mass
definition: The ratio of the quantity (SEP:quantity) of potassium (CHEBI:potassium atom) in the shoot (PO:shoot system) to the corresponding shoot (PO:shoot system) mass (PATO:mass) assessed after drying
reference: Eric Garnier, Jens Kattge, Stefan Klotz, Ingolf Kühn, Ulrike Stahl
related match: SEP_00055
related match: PATO_0000125
pref unit: mass unit / mass unit or amount unit / mass unit
related match: CHEBI_26216
formal name: shoot potassium content per shoot dry mass

Shoot silicon content per shoot dry mass
type: Class
subclass of: Shoot trait
type: NamedIndividual
type: Concept
formal name: shoot silicon content per shoot dry mass
in scheme: Thesaurustrait
definition: The ratio of the quantity (SEP:quantity) of silicon (CHEBI:silicon atom) in the shoot (PO:shoot system) to the corresponding shoot (PO:shoot system) mass (PATO:mass) assessed after drying
term status: stable
related match: PO_0009006
related match: SEP_00055
reference: Eric Garnier, Jens Kattge, Stefan Klotz, Ingolf Kühn, Ulrike Stahl
pref unit: mass unit / mass unit or amount unit / mass unit
related match: CHEBI_27573
related match: PATO_0000125
alternative label: shoot Si content per dry mass

Shoot sulfur content per shoot dry mass
type: Class
subclass of: Shoot trait
type: NamedIndividual
type: Concept
related match: PO_0009006
in scheme: Thesaurustrait
definition: The ratio of the quantity (SEP:quantity) of sulfur (CHEBI:sulfur atom) in the shoot (PO:shoot system) to the corresponding shoot (PO:shoot system) mass (PATO:mass) assessed after drying
term status: stable
alternative label: shoot S content per dry mass
related match: SEP_00055
reference: Eric Garnier, Jens Kattge, Stefan Klotz, Ingolf Kühn, Ulrike Stahl
related match: PATO_0000125
pref unit: mass unit / mass unit or amount unit / mass unit
formal name: shoot sulfur content per shoot dry mass
related match: CHEBI_26833

Shoot zinc content per shoot dry mass
type: Class
subclass of: Shoot trait
type: NamedIndividual
type: Concept
related match: PO_0009006
in scheme: Thesaurustrait
term status: stable
formal name: shoot zinc content per shoot dry mass
definition: The ratio of the quantity (SEP:quantity) of zinc (CHEBI:zinc atom) in the shoot (PO:shoot system) to the corresponding shoot (PO:shoot system) mass (PATO:mass) assessed after drying
related match: CHEBI_27363
reference: Eric Garnier, Jens Kattge, Stefan Klotz, Ingolf Kühn, Ulrike Stahl
alternative label: shoot Zn content per dry mass
related match: SEP_00055
related match: PATO_0000125
pref unit: mass unit / mass unit or amount unit / mass unit

Nitrogen uptake rate per fine root dry mass
type: Class
subclass of: Root trait
type: NamedIndividual
type: Concept
definition: the quantity of nitrogen (CHEBI:nitrogen atom) taken up by fine roots (McCormack:fine root) per corresponding mass (PO:mass) of the fine roots assessed after drying and per unit time
pref unit: amount unit / mass unit / time unit or mass unit / mass unit / time unit
in scheme: Thesaurustrait
reference: Eric Garnier, Jens Kattge, Stefan Klotz, Ingolf Kühn, Ulrike Stahl
related match: PATO_0000125
alternative label: N uptake rate per fine root dry mass
term status: stable
formal name: fine root nitrogen uptake per fine root dry mass per time
related match: CHEBI_25555

Environmental indicator
type: Class
subclass of: Environmental association
type: NamedIndividual
type: Concept
term status: testing
in scheme: Thesaurustrait

Environmental tolerance
type: Class
subclass of: Environmental association
type: NamedIndividual
type: Concept
term status: testing
in scheme: Thesaurustrait

Flower and dispersule trait
type: Class
subclass of: Plant trait
type: NamedIndividual
type: Concept
in scheme: Thesaurustrait
reference: Eric Garnier, Jens Kattge, Stefan Klotz, Ingolf Kühn, Ulrike Stahl
term status: testing
definition: a plant trait (TOP:plant trait) referring to the reproductive shoot system (PO:reproductive shoot system)

Plant height generative
type: Class
subclass of: Plant height trait
type: NamedIndividual
type: Concept
pref unit: length unit
in scheme: Thesaurustrait
formal name: whole plant height generative
term status: stable
reference: Eric Garnier, Jens Kattge, Stefan Klotz, Ingolf Kühn, Ulrike Stahl
alternative label: reproductive plant height
definition: the plant height (TO:plant height) considering the highest reproductive component
related match: To plant height

Phenology
type: Class
subclass of: Whole plant trait
type: NamedIndividual
type: Concept
cat: Evergreen
cat: Deciduous
cat: Summer green
reference: after Klotz, S., Kühn, I. & Durka, W. (2002): BIOLFLOR - Eine Datenbank zu biologisch-oekologischen Merkmalen der Gefaesspflanzen in Deutschland. - Schriftenreihe fuer Vegetationskunde 38. Bonn: Bundesamt fuer Naturschutz.
term status: stable
cat: Spring green
formal name: whole plant vegetative phenology
in scheme: Thesaurustrait
related match: PO_0000003
related match: PO_0025034
definition: a feature of the whole plant (PO:whole plant) characterizing the persistence of its leaves (PO:leaf) from emergence until shedding with respect to seasons
alternative label: leaf persistence
pref unit: unitless (nominal)
cat: Overwintering green

Deciduous
type: Class
type: NamedIndividual
type: Concept
reference: after Klotz, S., Kühn, I. & Durka, W. (2002): BIOLFLOR - Eine Datenbank zu biologisch-oekologischen Merkmalen der Gefaesspflanzen in Deutschland. - Schriftenreihe fuer Vegetationskunde 38. Bonn: Bundesamt fuer Naturschutz.
formal name: plant deciduous
definition: plants (PO:whole plant) that shed leaves (PATO:deciduous (plant), PO:leaf) at a certain season
term status: stable
related match: Pato deciduous plant
in scheme: Thesaurustrait
related match: PO_0000003
pref unit: unitless (category)

Evergreen
type: Class
type: NamedIndividual
type: Concept
in scheme: Thesaurustrait
term status: stable
reference: after Klotz, S., Kühn, I. & Durka, W. (2002): BIOLFLOR - Eine Datenbank zu biologisch-oekologischen Merkmalen der Gefaesspflanzen in Deutschland. - Schriftenreihe fuer Vegetationskunde 38. Bonn: Bundesamt fuer Naturschutz.
formal name: plant evergreen
alternative label: persistent green
related match: PO_0000003
pref unit: unitless (category)
definition: plants (PO:whole plant) that retain leaves (PATO:evergreen (plant), PO:leaf) over all seasons
related match: Pato evergreen plant

Spring green
type: Class
type: NamedIndividual
type: Concept
in scheme: Thesaurustrait
definition: plants (PO:whole plant) that shed leaves (PATO:deciduous (plant), TOP:deciduous leaf, PO:leaf) after being green from early spring to early summer
term status: stable
formal name: plant spring green
related match: PO_0000003
reference: after Klotz, S., Kühn, I. & Durka, W. (2002): BIOLFLOR - Eine Datenbank zu biologisch-oekologischen Merkmalen der Gefaesspflanzen in Deutschland. - Schriftenreihe fuer Vegetationskunde 38. Bonn: Bundesamt fuer Naturschutz.
pref unit: unitless (category)
related match: Pato deciduous plant

Summer green
type: Class
type: NamedIndividual
type: Concept
related match: Pato deciduous plant
reference: after Klotz, S., Kühn, I. & Durka, W. (2002): BIOLFLOR - Eine Datenbank zu biologisch-oekologischen Merkmalen der Gefaesspflanzen in Deutschland. - Schriftenreihe fuer Vegetationskunde 38. Bonn: Bundesamt fuer Naturschutz.
term status: stable
related match: PO_0000003
in scheme: Thesaurustrait
pref unit: unitless (category)
formal name: plant summer green
definition: plants (PO:whole plant) that shed leaves (PATO:deciduous (plant), TOP:deciduous leaf, PO:leaf) after being green only in the warm season (vegetation period)

Overwintering green
type: Class
type: NamedIndividual
type: Concept
formal name: plant overwintering green
related match: Pato deciduous plant
in scheme: Thesaurustrait
term status: stable
reference: after Klotz, S., Kühn, I. & Durka, W. (2002): BIOLFLOR - Eine Datenbank zu biologisch-oekologischen Merkmalen der Gefaesspflanzen in Deutschland. - Schriftenreihe fuer Vegetationskunde 38. Bonn: Bundesamt fuer Naturschutz.
pref unit: unitless (category)
related match: PO_0000003
definition: plants (PO:whole plant) that shed leaves (PATO:deciduous (plant), TOP:deciduous leaf, PO:leaf) in spring and summer after developing leaves in autumn and overwintering green

Woodiness
type: Class
subclass of: Whole plant trait
type: NamedIndividual
type: Concept
related match: PO_0009047
pref unit: unitless (nominal)
term status: stable
related match: PO_0000003
reference: after Kleyer, M., Bekker, R.M., Knevel, I.C., Bakker, J.P., Thompson, K., Sonnenschein, M., Poschlod, P., Van Groenendael, J.M., Klime_, L., Klime_ov�, J., Klotz, S., Rusch, G.M., Hermy, M., Adriaens, D., Boedeltje, G., Bossuyt, B., Dannemann, A., Endels, P., Goetzenberger, L., Hodgson, J.G., Jackel, A.-K., Kühn, I., Kunzmann, D., Ozinga, W.A., Roemermann, C., Stadler, M., Schlegelmilch, J., Steendam, H.J., Tackenberg, O., Wilmann, B., Cornelissen, J.H.C., Eriksson, O., Garnier, E. and Peco, B. (2008), The LEDA Traitbase: a database of life-history traits of the Northwest European flora. Journal of Ecology, 96: 1266_1274. doi: 10.1111/j.1365-2745.2008.01430.x
in scheme: Thesaurustrait
formal name: whole plant woodiness
cat: Semi woody
cat: Woody
cat: Non woody
related match: PO_0005848
definition: a feature of the whole plant (PO:whole plant) defining the occurrence and distribution of wood (PO:secondary xylem) along the stem (PO:stem)

Woody
type: Class
type: NamedIndividual
type: Concept
pref unit: unitless (category)
related match: PO_0009047
formal name: whole plant woody
reference: after Kleyer, M., Bekker, R.M., Knevel, I.C., Bakker, J.P., Thompson, K., Sonnenschein, M., Poschlod, P., Van Groenendael, J.M., Klime_, L., Klime_ov�, J., Klotz, S., Rusch, G.M., Hermy, M., Adriaens, D., Boedeltje, G., Bossuyt, B., Dannemann, A., Endels, P., Goetzenberger, L., Hodgson, J.G., Jackel, A.-K., Kühn, I., Kunzmann, D., Ozinga, W.A., Roemermann, C., Stadler, M., Schlegelmilch, J., Steendam, H.J., Tackenberg, O., Wilmann, B., Cornelissen, J.H.C., Eriksson, O., Garnier, E. and Peco, B. (2008), The LEDA Traitbase: a database of life-history traits of the Northwest European flora. Journal of Ecology, 96: 1266_1274. doi: 10.1111/j.1365-2745.2008.01430.x
term status: stable
related match: PO_0005848
in scheme: Thesaurustrait
related match: PO_0000003
definition: plants (PO:whole plant) that have wood (PO: secondary xylem) along the whole stem (PO:stem)

Non woody
type: Class
type: NamedIndividual
type: Concept
formal name: whole plant non woody
pref unit: unitless (category)
related match: PO_0009047
reference: after Kleyer, M., Bekker, R.M., Knevel, I.C., Bakker, J.P., Thompson, K., Sonnenschein, M., Poschlod, P., Van Groenendael, J.M., Klime_, L., Klime_ov�, J., Klotz, S., Rusch, G.M., Hermy, M., Adriaens, D., Boedeltje, G., Bossuyt, B., Dannemann, A., Endels, P., Goetzenberger, L., Hodgson, J.G., Jackel, A.-K., Kühn, I., Kunzmann, D., Ozinga, W.A., Roemermann, C., Stadler, M., Schlegelmilch, J., Steendam, H.J., Tackenberg, O., Wilmann, B., Cornelissen, J.H.C., Eriksson, O., Garnier, E. and Peco, B. (2008), The LEDA Traitbase: a database of life-history traits of the Northwest European flora. Journal of Ecology, 96: 1266_1274. doi: 10.1111/j.1365-2745.2008.01430.x
term status: stable
related match: PO_0005848
in scheme: Thesaurustrait
related match: PO_0000003
definition: plants (PO:whole plant) that have no wood (PO: secondary xylem) along the stem (PO:stem)

Semi woody
type: Class
type: NamedIndividual
type: Concept
pref unit: unitless (category)
related match: PO_0009047
definition: plants (PO:whole plant) that are in between woody (TOP:woody plant) and non woody (TOP:non woody plant), e.g. have wood (PO: secondary xylem) only at the base of the stem (PO:stem)
term status: stable
related match: PO_0005848
reference: after Kleyer, M., Bekker, R.M., Knevel, I.C., Bakker, J.P., Thompson, K., Sonnenschein, M., Poschlod, P., Van Groenendael, J.M., Klime_, L., Klime_ov�, J., Klotz, S., Rusch, G.M., Hermy, M., Adriaens, D., Boedeltje, G., Bossuyt, B., Dannemann, A., Endels, P., Goetzenberger, L., Hodgson, J.G., Jackel, A.-K., Kühn, I., Kunzmann, D., Ozinga, W.A., Roemermann, C., Stadler, M., Schlegelmilch, J., Steendam, H.J., Tackenberg, O., Wilmann, B., Cornelissen, J.H.C., Eriksson, O., Garnier, E. and Peco, B. (2008), The LEDA Traitbase: a database of life-history traits of the Northwest European flora. Journal of Ecology, 96: 1266_1274. doi: 10.1111/j.1365-2745.2008.01430.x
in scheme: Thesaurustrait
related match: PO_0000003
formal name: whole plant semi woody

Plant dry mass
type: Class
subclass of: Whole plant trait
type: NamedIndividual
type: Concept
reference: Eric Garnier, Jens Kattge, Stefan Klotz, Ingolf Kühn, Ulrike Stahl
pref unit: mass unit
in scheme: Thesaurustrait
related match: PATO_0000125
term status: stable
alternative label: whole plant dry mass
related match: PO_0000003
formal name: whole plant dry mass
definition: the mass (PATO:mass) of a whole plant (PO:whole plant) assessed after drying

Root aluminum content per root dry mass trait
type: Class
subclass of: Root trait
type: NamedIndividual
type: Concept
related match: PATO_0000125
term status: stable
related match: PO_0009005
definition: The ratio of the quantity (SEP:quantity) of aluminum (CHEBI:aluminum atom) in the root (PO:root) to the corresponding root mass (PATO:mass) assessed after drying
alternative label: root Al content per dry mass
in scheme: Thesaurustrait
related match: SEP_00055
reference: Eric Garnier, Jens Kattge, Stefan Klotz, Ingolf Kühn, Ulrike Stahl
related match: CHEBI_28984
formal name: root aluminum content per root dry mass
pref unit: mass unit / mass unit or amount unit / mass unit

Root boron content per root dry mass trait
type: Class
subclass of: Root trait
type: NamedIndividual
type: Concept
related match: PATO_0000125
definition: The ratio of the quantity (SEP:quantity) of boron (CHEBI:boron atom) in the root (PO:root) to the corresponding root mass (PATO:mass) assessed after drying
reference: Eric Garnier, Jens Kattge, Stefan Klotz, Ingolf Kühn, Ulrike Stahl
related match: SEP_00055
related match: CHEBI_27560
related match: PO_0009005
term status: stable
formal name: root boron content per root dry mass
in scheme: Thesaurustrait
alternative label: root B content per dry mass
pref unit: mass unit / mass unit or amount unit / mass unit

Root calcium content per root dry mass trait
type: Class
subclass of: Root trait
type: NamedIndividual
type: Concept
related match: CHEBI_22984
alternative label: root Ca content per dry mass
definition: The ratio of the quantity (SEP:quantity) of calcium (CHEBI:calcium atom) in the root (PO:root) to the corresponding root mass (PATO:mass) assessed after drying
reference: Eric Garnier, Jens Kattge, Stefan Klotz, Ingolf Kühn, Ulrike Stahl
related match: SEP_00055
related match: PATO_0000125
related match: PO_0009005
formal name: root calcium content per root dry mass
term status: stable
in scheme: Thesaurustrait
pref unit: mass unit / mass unit or amount unit / mass unit

Root carbon content per root dry mass trait
type: Class
subclass of: Root trait
type: NamedIndividual
type: Concept
related match: SEP_00055
reference: Eric Garnier, Jens Kattge, Stefan Klotz, Ingolf Kühn, Ulrike Stahl
related match: PATO_0000125
related match: PO_0009005
formal name: root carbon content per root dry mass
related match: CHEBI_27594
term status: stable
in scheme: Thesaurustrait
definition: The ratio of the quantity (SEP:quantity) of carbon (CHEBI:carbon atom) in the root (PO:root) to the corresponding root mass (PATO:mass) assessed after drying
alternative label: root C content per dry mass
pref unit: mass unit / mass unit or amount unit / mass unit

Root chlorine content per root dry mass trait
type: Class
subclass of: Root trait
type: NamedIndividual
type: Concept
related match: PATO_0000125
pref unit: mass unit / mass unit or amount unit / mass unit
formal name: root chlorine content per root dry mass
definition: The ratio of the quantity (SEP:quantity) of chlorine (CHEBI:chlorine atom) in the root (PO:root) to the corresponding root mass (PATO:mass) assessed after drying
reference: Eric Garnier, Jens Kattge, Stefan Klotz, Ingolf Kühn, Ulrike Stahl
related match: SEP_00055
related match: PO_0009005
term status: stable
in scheme: Thesaurustrait
alternative label: root Cl content per dry mass
related match: CHEBI_23116

Root cobalt content per root dry mass trait
type: Class
subclass of: Root trait
type: NamedIndividual
type: Concept
pref unit: mass unit / mass unit or amount unit / mass unit
related match: SEP_00055
reference: Eric Garnier, Jens Kattge, Stefan Klotz, Ingolf Kühn, Ulrike Stahl
formal name: root cobalt content per root dry mass
related match: PATO_0000125
in scheme: Thesaurustrait
related match: PO_0009005
term status: stable
alternative label: root Co content per dry mass
related match: CHEBI_27638
definition: The ratio of the quantity (SEP:quantity) of cobalt (CHEBI:cobalt atom) in the root (PO:root) to the corresponding root mass (PATO:mass) assessed after drying

Root copper content per root dry mass trait
type: Class
subclass of: Root trait
type: NamedIndividual
type: Concept
related match: SEP_00055
formal name: root copper content per root dry mass
pref unit: mass unit / mass unit or amount unit / mass unit
reference: Eric Garnier, Jens Kattge, Stefan Klotz, Ingolf Kühn, Ulrike Stahl
related match: PATO_0000125
definition: The ratio of the quantity (SEP:quantity) of copper (CHEBI:copper atom) in the root (PO:root) to the corresponding root mass (PATO:mass) assessed after drying
alternative label: root Cu content per dry mass
related match: CHEBI_28694
in scheme: Thesaurustrait
related match: PO_0009005
term status: stable

Root iron content per root dry mass trait
type: Class
subclass of: Root trait
type: NamedIndividual
type: Concept
reference: Eric Garnier, Jens Kattge, Stefan Klotz, Ingolf Kühn, Ulrike Stahl
related match: SEP_00055
related match: PATO_0000125
formal name: root iron content per root dry mass
term status: stable
alternative label: root Fe content per dry mass
related match: PO_0009005
definition: The ratio of the quantity (SEP:quantity) of iron (CHEBI:iron atom) in the root (PO:root) to the corresponding root mass (PATO:mass) assessed after drying
in scheme: Thesaurustrait
pref unit: mass unit / mass unit or amount unit / mass unit
related match: CHEBI_18248

Root magnesium content per root dry mass trait
type: Class
subclass of: Root trait
type: NamedIndividual
type: Concept
formal name: root magnesium content per root dry mass
related match: SEP_00055
related match: PATO_0000125
alternative label: root Mg content per dry mass
related match: PO_0009005
related match: CHEBI_25107
term status: stable
in scheme: Thesaurustrait
pref unit: mass unit / mass unit or amount unit / mass unit
reference: Eric Garnier, Jens Kattge, Stefan Klotz, Ingolf Kühn, Ulrike Stahl
definition: The ratio of the quantity (SEP:quantity) of magnesium (CHEBI:magnesium atom) in the root (PO:root) to the corresponding root mass (PATO:mass) assessed after drying

Root manganese content per root dry mass trait
type: Class
subclass of: Root trait
type: NamedIndividual
type: Concept
formal name: root manganese content per root dry mass
related match: PATO_0000125
related match: CHEBI_18291
related match: SEP_00055
alternative label: root Mn content per dry mass
related match: PO_0009005
term status: stable
in scheme: Thesaurustrait
pref unit: mass unit / mass unit or amount unit / mass unit
reference: Eric Garnier, Jens Kattge, Stefan Klotz, Ingolf Kühn, Ulrike Stahl
definition: The ratio of the quantity (SEP:quantity) of manganese (CHEBI:manganese atom) in the root (PO:root) to the corresponding root mass (PATO:mass) assessed after drying

Plant leaf area trait
type: Class
subclass of: Whole plant trait
type: NamedIndividual
type: Concept
related match: PO_0025034
reference: Eric Garnier, Jens Kattge, Stefan Klotz, Ingolf Kühn, Ulrike Stahl
definition: the sum of the area (PATO:area) of all leaves (PO:leaf) or components thereof (TOP:leaf area trait) on the shoot (PO:shoot system)
related match: PATO_0001323
alternative label: leaf size
term status: stable
related match: PO_0009006
pref unit: area unit
formal name: whole plant leaf area trait
in scheme: Thesaurustrait

Root molybdenum content per root dry mass trait
type: Class
subclass of: Root trait
type: NamedIndividual
type: Concept
definition: The ratio of the quantity (SEP:quantity) of molybdenum (CHEBI:molybdenum atom) in the root (PO:root) to the corresponding root mass (PATO:mass) assessed after drying
related match: SEP_00055
reference: Eric Garnier, Jens Kattge, Stefan Klotz, Ingolf Kühn, Ulrike Stahl
related match: PATO_0000125
in scheme: Thesaurustrait
related match: CHEBI_28685
pref unit: mass unit / mass unit or amount unit / mass unit
alternative label: root Mo content per dry mass
formal name: root molybdenum content per root dry mass
related match: PO_0009005
term status: stable

Root sodium content per root dry mass trait
type: Class
subclass of: Root trait
type: NamedIndividual
type: Concept
related match: SEP_00055
pref unit: mass unit / mass unit or amount unit / mass unit
in scheme: Thesaurustrait
reference: Eric Garnier, Jens Kattge, Stefan Klotz, Ingolf Kühn, Ulrike Stahl
formal name: root sodium content per root dry mass
definition: The ratio of the quantity (SEP:quantity) of sodium (CHEBI:sodium atom) in the root (PO:root) to the corresponding root mass (PATO:mass) assessed after drying
related match: PO_0009005
related match: PATO_0000125
related match: CHEBI_26708
term status: stable
alternative label: root Na content per dry mass

Root nickel content per root dry mass trait
type: Class
subclass of: Root trait
type: NamedIndividual
type: Concept
term status: stable
reference: Eric Garnier, Jens Kattge, Stefan Klotz, Ingolf Kühn, Ulrike Stahl
pref unit: mass unit / mass unit or amount unit / mass unit
in scheme: Thesaurustrait
alternative label: root Ni content per dry mass
related match: CHEBI_28112
related match: PO_0009005
related match: PATO_0000125
formal name: root nickel content per root dry mass
related match: SEP_00055
definition: The ratio of the quantity (SEP:quantity) of nickel (CHEBI:nickel atom) in the root (PO:root) to the corresponding root mass (PATO:mass) assessed after drying

Root nitrogen content per root dry mass trait
type: Class
subclass of: Root trait
type: NamedIndividual
type: Concept
term status: stable
formal name: root nitrogen content per root dry mass
reference: Eric Garnier, Jens Kattge, Stefan Klotz, Ingolf Kühn, Ulrike Stahl
in scheme: Thesaurustrait
pref unit: mass unit / mass unit or amount unit / mass unit
related match: CHEBI_25555
related match: PATO_0000125
related match: SEP_00055
related match: PO_0009005
definition: The ratio of the quantity (SEP:quantity) of nitrogen (CHEBI:nitrogen atom) in the root (PO:root) to the corresponding root mass (PATO:mass) assessed after drying
alternative label: root N content per dry mass

Root phosphorus content per root dry mass trait
type: Class
subclass of: Root trait
type: NamedIndividual
type: Concept
in scheme: Thesaurustrait
related match: CHEBI_28659
term status: stable
reference: Eric Garnier, Jens Kattge, Stefan Klotz, Ingolf Kühn, Ulrike Stahl
pref unit: mass unit / mass unit or amount unit / mass unit
definition: The ratio of the quantity (SEP:quantity) of phosphorus (CHEBI:phosphorus atom) in the root (PO:root) to the corresponding root mass (PATO:mass) assessed after drying
formal name: root phosphorus content per root dry mass
related match: PATO_0000125
alternative label: root P content per dry mass
related match: PO_0009005
related match: SEP_00055

Root potassium content per root dry mass trait
type: Class
subclass of: Root trait
type: NamedIndividual
type: Concept
in scheme: Thesaurustrait
related match: CHEBI_26216
alternative label: root K content per dry mass
term status: stable
formal name: root potassium content per root dry mass
related match: PATO_0000125
pref unit: mass unit / mass unit or amount unit / mass unit
definition: The ratio of the quantity (SEP:quantity) of potassium (CHEBI:potassium atom) in the root (PO:root) to the corresponding root mass (PATO:mass) assessed after drying
reference: Eric Garnier, Jens Kattge, Stefan Klotz, Ingolf Kühn, Ulrike Stahl
related match: SEP_00055
related match: PO_0009005

Root silicon content per root dry mass trait
type: Class
subclass of: Root trait
type: NamedIndividual
type: Concept
term status: stable
in scheme: Thesaurustrait
related match: PO_0009005
related match: PATO_0000125
definition: The ratio of the quantity (SEP:quantity) of silicon (CHEBI:silicon atom) in the root (PO:root) to the corresponding root mass (PATO:mass) assessed after drying
reference: Eric Garnier, Jens Kattge, Stefan Klotz, Ingolf Kühn, Ulrike Stahl
related match: CHEBI_27573
pref unit: mass unit / mass unit or amount unit / mass unit
related match: SEP_00055
formal name: root silicon content per root dry mass
alternative label: root Si content per dry mass

Root sulfur content per root dry mass trait
type: Class
subclass of: Root trait
type: NamedIndividual
type: Concept
in scheme: Thesaurustrait
term status: stable
related match: PO_0009005
formal name: root sulfur content per root dry mass
alternative label: root S content per dry mass
reference: Eric Garnier, Jens Kattge, Stefan Klotz, Ingolf Kühn, Ulrike Stahl
related match: PATO_0000125
related match: SEP_00055
pref unit: mass unit / mass unit or amount unit / mass unit
related match: CHEBI_26833
definition: The ratio of the quantity (SEP:quantity) of sulfur (CHEBI:sulfur atom) in the root (PO:root) to the corresponding root mass (PATO:mass) assessed after drying

Root zinc content per root dry mass trait
type: Class
subclass of: Root trait
type: NamedIndividual
type: Concept
term status: stable
related match: PO_0009005
in scheme: Thesaurustrait
definition: The ratio of the quantity (SEP:quantity) of zinc (CHEBI:zinc atom) in the root (PO:root) to the corresponding root mass (PATO:mass) assessed after drying
related match: SEP_00055
reference: Eric Garnier, Jens Kattge, Stefan Klotz, Ingolf Kühn, Ulrike Stahl
alternative label: root Zn content per dry mass
pref unit: mass unit / mass unit or amount unit / mass unit
related match: PATO_0000125
related match: CHEBI_27363
formal name: root zinc content per root dry mass

Wood aluminium content per wood dry mass trait
type: Class
subclass of: Stem and branch trait
type: NamedIndividual
type: Concept
term status: stable
alternative label: wood Al content per dry mass
definition: The ratio of the quantity (SEP:quantity) of aluminium (CHEBI:aluminium atom) in the wood (PO:secondary xylem) to the corresponding wood (PO:secondary xylem) mass (PATO:mass) assessed after drying
related match: CHEBI_28984
in scheme: Thesaurustrait
reference: Eric Garnier, Jens Kattge, Stefan Klotz, Ingolf Kühn, Ulrike Stahl
related match: SEP_00055
formal name: wood aluminium content per wood dry mass
pref unit: mass unit / mass unit or amount unit / mass unit
related match: PO_0005848
related match: PATO_0000125

Plant leaf area
type: Class
subclass of: Plant leaf area trait
type: NamedIndividual
type: Concept
related match: PO_0009006
related match: PATO_0001323
definition: the sum of the area (PATO:area) of all leaves (PO: leaf, TOP:leaf area) on a shoot (PO:shoot system)
term status: stable
related match: PO_0025034
formal name: whole plant leaf area
pref unit: area unit
alternative label: leaf size
in scheme: Thesaurustrait
reference: Eric Garnier, Jens Kattge, Stefan Klotz, Ingolf Kühn, Ulrike Stahl

Wood boron content per wood dry mass trait
type: Class
subclass of: Stem and branch trait
type: NamedIndividual
type: Concept
term status: stable
in scheme: Thesaurustrait
formal name: wood boron content per wood dry mass
definition: The ratio of the quantity (SEP:quantity) of boron (CHEBI:boron atom) in the wood (PO:secondary xylem) to the corresponding wood (PO:secondary xylem) mass (PATO:mass) assessed after drying
related match: PO_0005848
alternative label: wood B content per dry mass
related match: CHEBI_27560
related match: SEP_00055
reference: Eric Garnier, Jens Kattge, Stefan Klotz, Ingolf Kühn, Ulrike Stahl
related match: PATO_0000125
pref unit: mass unit / mass unit or amount unit / mass unit

Wood calcium content per wood dry mass trait
type: Class
subclass of: Stem and branch trait
type: NamedIndividual
type: Concept
formal name: wood calcium content per wood dry mass
definition: The ratio of the quantity (SEP:quantity) of calcium (CHEBI:calcium atom) in the wood (PO:secondary xylem) to the corresponding wood (PO:secondary xylem) mass (PATO:mass) assessed after drying
term status: stable
related match: PO_0005848
alternative label: wood Ca content per dry mass
reference: Eric Garnier, Jens Kattge, Stefan Klotz, Ingolf Kühn, Ulrike Stahl
related match: SEP_00055
related match: PATO_0000125
related match: CHEBI_22984
in scheme: Thesaurustrait
pref unit: mass unit / mass unit or amount unit / mass unit

Wood carbon content per wood dry mass trait
type: Class
subclass of: Stem and branch trait
type: NamedIndividual
type: Concept
term status: stable
related match: PATO_0000125
related match: PO_0005848
related match: CHEBI_27594
alternative label: wood C content per dry mass
related match: SEP_00055
definition: The ratio of the quantity (SEP:quantity) of carbon (CHEBI:carbon atom) in the wood (PO:secondary xylem) to the corresponding wood (PO:secondary xylem) mass (PATO:mass) assessed after drying
formal name: wood carbon content per wood dry mass
pref unit: mass unit / mass unit or amount unit / mass unit
in scheme: Thesaurustrait
reference: Eric Garnier, Jens Kattge, Stefan Klotz, Ingolf Kühn, Ulrike Stahl

Wood chlorine content per wood dry mass trait
type: Class
subclass of: Stem and branch trait
type: NamedIndividual
type: Concept
definition: The ratio of the quantity (SEP:quantity) of chlorine (CHEBI:chlorine atom) in the wood (PO:secondary xylem) to the corresponding wood (PO:secondary xylem) mass (PATO:mass) assessed after drying
related match: CHEBI_23116
alternative label: wood Cl content per dry mass
related match: PO_0005848
related match: PATO_0000125
related match: SEP_00055
formal name: wood chlorine content per wood dry mass
term status: stable
pref unit: mass unit / mass unit or amount unit / mass unit
reference: Eric Garnier, Jens Kattge, Stefan Klotz, Ingolf Kühn, Ulrike Stahl
in scheme: Thesaurustrait

Wood cobalt content per wood dry mass trait
type: Class
subclass of: Stem and branch trait
type: NamedIndividual
type: Concept
related match: CHEBI_27638
alternative label: wood Co content per dry mass
related match: PATO_0000125
related match: PO_0005848
related match: SEP_00055
term status: stable
reference: Eric Garnier, Jens Kattge, Stefan Klotz, Ingolf Kühn, Ulrike Stahl
in scheme: Thesaurustrait
pref unit: mass unit / mass unit or amount unit / mass unit
definition: The ratio of the quantity (SEP:quantity) of cobalt (CHEBI:cobalt atom) in the wood (PO:secondary xylem) to the corresponding wood (PO:secondary xylem) mass (PATO:mass) assessed after drying
formal name: wood cobalt content per wood dry mass

Wood copper content per wood dry mass trait
type: Class
subclass of: Stem and branch trait
type: NamedIndividual
type: Concept
related match: PO_0005848
related match: PATO_0000125
related match: SEP_00055
definition: The ratio of the quantity (SEP:quantity) of copper (CHEBI:copper atom) in the wood (PO:secondary xylem) to the corresponding wood (PO:secondary xylem) mass (PATO:mass) assessed after drying
formal name: wood copper content per wood dry mass
term status: stable
reference: Eric Garnier, Jens Kattge, Stefan Klotz, Ingolf Kühn, Ulrike Stahl
pref unit: mass unit / mass unit or amount unit / mass unit
related match: CHEBI_28694
in scheme: Thesaurustrait
alternative label: wood Cu content per dry mass

Wood iron content per wood dry mass trait
type: Class
subclass of: Stem and branch trait
type: NamedIndividual
type: Concept
related match: PATO_0000125
pref unit: mass unit / mass unit or amount unit / mass unit
formal name: wood iron content per wood dry mass
related match: PO_0005848
definition: The ratio of the quantity (SEP:quantity) of iron (CHEBI:iron atom) in the wood (PO:secondary xylem) to the corresponding wood (PO:secondary xylem) mass (PATO:mass) assessed after drying
alternative label: wood Fe content per dry mass
related match: SEP_00055
term status: stable
reference: Eric Garnier, Jens Kattge, Stefan Klotz, Ingolf Kühn, Ulrike Stahl
in scheme: Thesaurustrait
related match: CHEBI_18248

Wood magnesium content per wood dry mass trait
type: Class
subclass of: Stem and branch trait
type: NamedIndividual
type: Concept
pref unit: mass unit / mass unit or amount unit / mass unit
related match: PATO_0000125
definition: The ratio of the quantity (SEP:quantity) of magnesium (CHEBI:magnesium atom) in the wood (PO:secondary xylem) to the corresponding wood (PO:secondary xylem) mass (PATO:mass) assessed after drying
related match: PO_0005848
related match: SEP_00055
term status: stable
alternative label: wood Mg content per dry mass
formal name: wood magnesium content per wood dry mass
related match: CHEBI_25107
reference: Eric Garnier, Jens Kattge, Stefan Klotz, Ingolf Kühn, Ulrike Stahl
in scheme: Thesaurustrait

Wood manganese content per wood dry mass trait
type: Class
subclass of: Stem and branch trait
type: NamedIndividual
type: Concept
related match: PO_0005848
related match: PATO_0000125
pref unit: mass unit / mass unit or amount unit / mass unit
definition: The ratio of the quantity (SEP:quantity) of manganese (CHEBI:manganese atom) in the wood (PO:secondary xylem) to the corresponding wood (PO:secondary xylem) mass (PATO:mass) assessed after drying
related match: SEP_00055
alternative label: wood Mn content per dry mass
term status: stable
in scheme: Thesaurustrait
related match: CHEBI_18291
formal name: wood manganese content per wood dry mass
reference: Eric Garnier, Jens Kattge, Stefan Klotz, Ingolf Kühn, Ulrike Stahl

Wood molybdenum content per wood dry mass trait
type: Class
subclass of: Stem and branch trait
type: NamedIndividual
type: Concept
reference: Eric Garnier, Jens Kattge, Stefan Klotz, Ingolf Kühn, Ulrike Stahl
alternative label: wood Mo content per dry mass
pref unit: mass unit / mass unit or amount unit / mass unit
related match: SEP_00055
related match: PATO_0000125
formal name: wood molybdenum content per wood dry mass
related match: PO_0005848
term status: stable
related match: CHEBI_28685
in scheme: Thesaurustrait
definition: The ratio of the quantity (SEP:quantity) of molybdenum (CHEBI:molybdenum atom) in the wood (PO:secondary xylem) to the corresponding wood (PO:secondary xylem) mass (PATO:mass) assessed after drying

Plant leaf lamina area
type: Class
subclass of: Plant leaf area trait
type: NamedIndividual
type: Concept
related match: PO_0009006
related match: PO_0025034
definition: the sum of the leaf lamina area (TOP:leaf lamina area) of all leaves (PO:leaf) on a shoot (PO:shoot system)
term status: stable
formal name: whole plant whole leaf lamina area
reference: Eric Garnier, Jens Kattge, Stefan Klotz, Ingolf Kühn, Ulrike Stahl
pref unit: area unit
in scheme: Thesaurustrait
alternative label: leaf size

Wood sodium content per wood dry mass trait
type: Class
subclass of: Stem and branch trait
type: NamedIndividual
type: Concept
reference: Eric Garnier, Jens Kattge, Stefan Klotz, Ingolf Kühn, Ulrike Stahl
pref unit: mass unit / mass unit or amount unit / mass unit
related match: SEP_00055
related match: CHEBI_26708
related match: PO_0005848
related match: PATO_0000125
definition: The ratio of the quantity (SEP:quantity) of sodium (CHEBI:sodium atom) in the wood (PO:secondary xylem) to the corresponding wood (PO:secondary xylem) mass (PATO:mass) assessed after drying
in scheme: Thesaurustrait
alternative label: wood Na content per dry mass
formal name: wood sodium content per wood dry mass
term status: stable

Wood nickel content per wood dry mass trait
type: Class
subclass of: Stem and branch trait
type: NamedIndividual
type: Concept
related match: SEP_00055
pref unit: mass unit / mass unit or amount unit / mass unit
reference: Eric Garnier, Jens Kattge, Stefan Klotz, Ingolf Kühn, Ulrike Stahl
related match: PATO_0000125
related match: PO_0005848
formal name: wood nickel content per wood dry mass
definition: The ratio of the quantity (SEP:quantity) of nickel (CHEBI:nickel atom) in the wood (PO:secondary xylem) to the corresponding wood (PO:secondary xylem) mass (PATO:mass) assessed after drying
in scheme: Thesaurustrait
related match: CHEBI_28112
term status: stable
alternative label: wood Ni content per dry mass

Wood nitrogen content per wood dry mass trait
type: Class
subclass of: Stem and branch trait
type: NamedIndividual
type: Concept
reference: Eric Garnier, Jens Kattge, Stefan Klotz, Ingolf Kühn, Ulrike Stahl
related match: SEP_00055
related match: PATO_0000125
related match: PO_0005848
pref unit: mass unit / mass unit or amount unit / mass unit
in scheme: Thesaurustrait
related match: CHEBI_25555
term status: stable
alternative label: wood N content per dry mass
formal name: wood nitrogen content per wood dry mass
definition: The ratio of the quantity (SEP:quantity) of nitrogen (CHEBI:nitrogen atom) in the wood (PO:secondary xylem) to the corresponding wood (PO:secondary xylem) mass (PATO:mass) assessed after drying

Wood phosphorus content per wood dry mass trait
type: Class
subclass of: Stem and branch trait
type: NamedIndividual
type: Concept
formal name: wood phosphorus content per wood dry mass
related match: SEP_00055
related match: PO_0005848
in scheme: Thesaurustrait
pref unit: mass unit / mass unit or amount unit / mass unit
reference: Eric Garnier, Jens Kattge, Stefan Klotz, Ingolf Kühn, Ulrike Stahl
alternative label: wood P content per dry mass
term status: stable
definition: The ratio of the quantity (SEP:quantity) of phosphorus (CHEBI:phosphorus atom) in the wood (PO:secondary xylem) to the corresponding wood (PO:secondary xylem) mass (PATO:mass) assessed after drying
related match: CHEBI_28659
related match: PATO_0000125

Wood potassium content per wood dry mass trait
type: Class
subclass of: Stem and branch trait
type: NamedIndividual
type: Concept
related match: CHEBI_26216
related match: PO_0005848
term status: stable
in scheme: Thesaurustrait
pref unit: mass unit / mass unit or amount unit / mass unit
reference: Eric Garnier, Jens Kattge, Stefan Klotz, Ingolf Kühn, Ulrike Stahl
formal name: wood potassium content per wood dry mass
definition: The ratio of the quantity (SEP:quantity) of potassium (CHEBI:potassium atom) in the wood (PO:secondary xylem) to the corresponding wood (PO:secondary xylem) mass (PATO:mass) assessed after drying
alternative label: wood K content per dry mass
related match: PATO_0000125
related match: SEP_00055

Wood silicon content per wood dry mass trait
type: Class
subclass of: Stem and branch trait
type: NamedIndividual
type: Concept
pref unit: mass unit / mass unit or amount unit / mass unit
term status: stable
in scheme: Thesaurustrait
reference: Eric Garnier, Jens Kattge, Stefan Klotz, Ingolf Kühn, Ulrike Stahl
alternative label: wood Si content per dry mass
formal name: wood silicon content per wood dry mass
definition: The ratio of the quantity (SEP:quantity) of silicon (CHEBI:silicon atom) in the wood (PO:secondary xylem) to the corresponding wood (PO:secondary xylem) mass (PATO:mass) assessed after drying
related match: PO_0005848
related match: CHEBI_27573
related match: SEP_00055
related match: PATO_0000125

Wood sulfur content per wood dry mass trait
type: Class
subclass of: Stem and branch trait
type: NamedIndividual
type: Concept
formal name: wood sulfur content per wood dry mass
related match: CHEBI_26833
reference: Eric Garnier, Jens Kattge, Stefan Klotz, Ingolf Kühn, Ulrike Stahl
pref unit: mass unit / mass unit or amount unit / mass unit
term status: stable
in scheme: Thesaurustrait
alternative label: wood S content per dry mass
related match: PO_0005848
definition: The ratio of the quantity (SEP:quantity) of sulfur (CHEBI:sulfur atom) in the wood (PO:secondary xylem) to the corresponding wood (PO:secondary xylem) mass (PATO:mass) assessed after drying
related match: SEP_00055
related match: PATO_0000125

Wood zinc content per wood dry mass trait
type: Class
subclass of: Stem and branch trait
type: NamedIndividual
type: Concept
term status: stable
alternative label: wood Zn content per dry mass
reference: Eric Garnier, Jens Kattge, Stefan Klotz, Ingolf Kühn, Ulrike Stahl
in scheme: Thesaurustrait
definition: The ratio of the quantity (SEP:quantity) of zinc (CHEBI:zinc atom) in the wood (PO:secondary xylem) to the corresponding wood (PO:secondary xylem) mass (PATO:mass) assessed after drying
related match: PO_0005848
pref unit: mass unit / mass unit or amount unit / mass unit
formal name: wood zinc content per wood dry mass
related match: SEP_00055
related match: CHEBI_27363
related match: PATO_0000125

Coarse woody debris aluminium content per coarse woody debris dry mass trait
type: Class
subclass of: Litter and coarse woody debris trait
type: NamedIndividual
type: Concept
term status: stable
alternative label: coarse woody debris Al content per dry mass
related match: CHEBI_28984
formal name: coarse woody debris aluminium content per coarse woody debris dry mass
definition: The ratio of the quantity (SEP:quantity) of aluminium (CHEBI:aluminium atom) in the coarse woody debris (Def:coarse woody debris) to the corresponding coarse woody debris mass (PATO:mass) assessed after drying
in scheme: Thesaurustrait
reference: Eric Garnier, Jens Kattge, Stefan Klotz, Ingolf Kühn, Ulrike Stahl
alternative label: CWD Al content per dry mass
pref unit: mass unit / mass unit or amount unit / mass unit
related match: PATO_0000125
related match: SEP_00055

Coarse woody debris boron content per coarse woody debris dry mass trait
type: Class
subclass of: Litter and coarse woody debris trait
type: NamedIndividual
type: Concept
term status: stable
alternative label: coarse woody debris B content per dry mass
in scheme: Thesaurustrait
definition: The ratio of the quantity (SEP:quantity) of boron (CHEBI:boron atom) in the coarse woody debris (Def:coarse woody debris) to the corresponding coarse woody debris mass (PATO:mass) assessed after drying
reference: Eric Garnier, Jens Kattge, Stefan Klotz, Ingolf Kühn, Ulrike Stahl
related match: PATO_0000125
formal name: coarse woody debris boron content per coarse woody debris dry mass
pref unit: mass unit / mass unit or amount unit / mass unit
related match: CHEBI_27560
alternative label: CWD B content per dry mass
related match: SEP_00055

Plant leaf dry mass trait
type: Class
subclass of: Whole plant trait
type: NamedIndividual
type: Concept
related match: PO_0009006
alternative label: leaf dry weight
related match: PO_0025034
pref unit: mass unit
formal name: whole plant leaf dry mass trait
definition: the sum of the dry mass of the leaf (TOP:leaf dry mass) or component thereof (TOP:leaf dry mass trait) of all leaves (PO:leaf) on a shoot (PO:shoot system)
term status: stable
reference: Eric Garnier, Jens Kattge, Stefan Klotz, Ingolf Kühn, Ulrike Stahl
in scheme: Thesaurustrait

Coarse woody debris calcium content per coarse woody debris dry mass trait
type: Class
subclass of: Litter and coarse woody debris trait
type: NamedIndividual
type: Concept
in scheme: Thesaurustrait
term status: stable
alternative label: CWD Ca content per dry mass
formal name: coarse woody debris calcium content per coarse woody debris dry mass
related match: PATO_0000125
pref unit: mass unit / mass unit or amount unit / mass unit
definition: The ratio of the quantity (SEP:quantity) of calcium (CHEBI:calcium atom) in the coarse woody debris (Def:coarse woody debris) to the corresponding coarse woody debris mass (PATO:mass) assessed after drying
reference: Eric Garnier, Jens Kattge, Stefan Klotz, Ingolf Kühn, Ulrike Stahl
related match: SEP_00055
alternative label: coarse woody debris Ca content per dry mass
related match: CHEBI_22984

Coarse woody debris carbon content per coarse woody debris dry mass trait
type: Class
subclass of: Litter and coarse woody debris trait
type: NamedIndividual
type: Concept
term status: stable
in scheme: Thesaurustrait
definition: The ratio of the quantity (SEP:quantity) of carbon (CHEBI:carbon atom) in the coarse woody debris (Def:coarse woody debris) to the corresponding coarse woody debris mass (PATO:mass) assessed after drying
formal name: coarse woody debris carbon content per coarse woody debris dry mass
alternative label: CWD C content per dry mass
related match: CHEBI_27594
related match: PATO_0000125
reference: Eric Garnier, Jens Kattge, Stefan Klotz, Ingolf Kühn, Ulrike Stahl
pref unit: mass unit / mass unit or amount unit / mass unit
related match: SEP_00055
alternative label: coarse woody debris C content per dry mass

Coarse woody debris chlorine content per coarse woody debris dry mass trait
type: Class
subclass of: Litter and coarse woody debris trait
type: NamedIndividual
type: Concept
term status: stable
in scheme: Thesaurustrait
alternative label: coarse woody debris Cl content per dry mass
related match: CHEBI_23116
formal name: coarse woody debris chlorine content per coarse woody debris dry mass
reference: Eric Garnier, Jens Kattge, Stefan Klotz, Ingolf Kühn, Ulrike Stahl
related match: PATO_0000125
related match: SEP_00055
pref unit: mass unit / mass unit or amount unit / mass unit
definition: The ratio of the quantity (SEP:quantity) of chlorine (CHEBI:chlorine atom) in the coarse woody debris (Def:coarse woody debris) to the corresponding coarse woody debris mass (PATO:mass) assessed after drying
alternative label: CWD Cl content per dry mass

Coarse woody debris cobalt content per coarse woody debris dry mass trait
type: Class
subclass of: Litter and coarse woody debris trait
type: NamedIndividual
type: Concept
term status: stable
alternative label: CWD Co content per dry mass
formal name: coarse woody debris cobalt content per coarse woody debris dry mass
related match: SEP_00055
reference: Eric Garnier, Jens Kattge, Stefan Klotz, Ingolf Kühn, Ulrike Stahl
pref unit: mass unit / mass unit or amount unit / mass unit
definition: The ratio of the quantity (SEP:quantity) of cobalt (CHEBI:cobalt atom) in the coarse woody debris (Def:coarse woody debris) to the corresponding coarse woody debris mass (PATO:mass) assessed after drying
related match: PATO_0000125
alternative label: coarse woody debris Co content per dry mass
related match: CHEBI_27638
in scheme: Thesaurustrait

Coarse woody debris copper content per coarse woody debris dry mass trait
type: Class
subclass of: Litter and coarse woody debris trait
type: NamedIndividual
type: Concept
alternative label: CWD Cu content per dry mass
related match: CHEBI_28694
term status: stable
definition: The ratio of the quantity (SEP:quantity) of copper (CHEBI:copper atom) in the coarse woody debris (Def:coarse woody debris) to the corresponding coarse woody debris mass (PATO:mass) assessed after drying
related match: PATO_0000125
alternative label: coarse woody debris Cu content per dry mass
related match: SEP_00055
pref unit: mass unit / mass unit or amount unit / mass unit
formal name: coarse woody debris copper content per coarse woody debris dry mass
in scheme: Thesaurustrait
reference: Eric Garnier, Jens Kattge, Stefan Klotz, Ingolf Kühn, Ulrike Stahl

Coarse woody debris iron content per coarse woody debris dry mass trait
type: Class
subclass of: Litter and coarse woody debris trait
type: NamedIndividual
type: Concept
definition: The ratio of the quantity (SEP:quantity) of iron (CHEBI:iron atom) in the coarse woody debris (Def:coarse woody debris) to the corresponding coarse woody debris mass (PATO:mass) assessed after drying
alternative label: coarse woody debris Fe content per dry mass
formal name: coarse woody debris iron content per coarse woody debris dry mass
related match: PATO_0000125
related match: SEP_00055
pref unit: mass unit / mass unit or amount unit / mass unit
alternative label: CWD Fe content per dry mass
term status: stable
reference: Eric Garnier, Jens Kattge, Stefan Klotz, Ingolf Kühn, Ulrike Stahl
in scheme: Thesaurustrait
related match: CHEBI_18248

Coarse woody debris magnesium content per coarse woody debris dry mass trait
type: Class
subclass of: Litter and coarse woody debris trait
type: NamedIndividual
type: Concept
related match: CHEBI_25107
related match: PATO_0000125
alternative label: coarse woody debris Mg content per dry mass
related match: SEP_00055
pref unit: mass unit / mass unit or amount unit / mass unit
formal name: coarse woody debris magnesium content per coarse woody debris dry mass
alternative label: CWD Mg content per dry mass
term status: stable
definition: The ratio of the quantity (SEP:quantity) of magnesium (CHEBI:magnesium atom) in the coarse woody debris (Def:coarse woody debris) to the corresponding coarse woody debris mass (PATO:mass) assessed after drying
reference: Eric Garnier, Jens Kattge, Stefan Klotz, Ingolf Kühn, Ulrike Stahl
in scheme: Thesaurustrait

Coarse woody debris manganese content per coarse woody debris dry mass trait
type: Class
subclass of: Litter and coarse woody debris trait
type: NamedIndividual
type: Concept
related match: CHEBI_18291
alternative label: coarse woody debris Mn content per dry mass
related match: PATO_0000125
related match: SEP_00055
alternative label: CWD Mn content per dry mass
pref unit: mass unit / mass unit or amount unit / mass unit
definition: The ratio of the quantity (SEP:quantity) of manganese (CHEBI:manganese atom) in the coarse woody debris (Def:coarse woody debris) to the corresponding coarse woody debris mass (PATO:mass) assessed after drying
term status: stable
formal name: coarse woody debris manganese content per coarse woody debris dry mass
reference: Eric Garnier, Jens Kattge, Stefan Klotz, Ingolf Kühn, Ulrike Stahl
in scheme: Thesaurustrait

Coarse woody debris molybdenum content per coarse woody debris dry mass trait
type: Class
subclass of: Litter and coarse woody debris trait
type: NamedIndividual
type: Concept
alternative label: coarse woody debris Mo content per dry mass
pref unit: mass unit / mass unit or amount unit / mass unit
related match: CHEBI_28685
formal name: coarse woody debris molybdenum content per coarse woody debris dry mass
related match: PATO_0000125
related match: SEP_00055
alternative label: CWD Mo content per dry mass
definition: The ratio of the quantity (SEP:quantity) of molybdenum (CHEBI:molybdenum atom) in the coarse woody debris (Def:coarse woody debris) to the corresponding coarse woody debris mass (PATO:mass) assessed after drying
reference: Eric Garnier, Jens Kattge, Stefan Klotz, Ingolf Kühn, Ulrike Stahl
term status: stable
in scheme: Thesaurustrait

Coarse woody debris sodium content per coarse woody debris dry mass trait
type: Class
subclass of: Litter and coarse woody debris trait
type: NamedIndividual
type: Concept
definition: The ratio of the quantity (SEP:quantity) of sodium (CHEBI:sodium atom) in the coarse woody debris (Def:coarse woody debris) to the corresponding coarse woody debris mass (PATO:mass) assessed after drying
pref unit: mass unit / mass unit or amount unit / mass unit
alternative label: coarse woody debris Na content per dry mass
related match: CHEBI_26708
related match: PATO_0000125
related match: SEP_00055
formal name: coarse woody debris sodium content per coarse woody debris dry mass
alternative label: CWD Na content per dry mass
term status: stable
in scheme: Thesaurustrait
reference: Eric Garnier, Jens Kattge, Stefan Klotz, Ingolf Kühn, Ulrike Stahl

Plant leaf dry mass
type: Class
subclass of: Plant leaf dry mass trait
type: NamedIndividual
type: Concept
formal name: whole plant leaf dry mass
pref unit: mass unit
definition: the sum of the leaf dry mass (TOP:leaf dry mass) of all leaves (PO:leaf) of a whole plant (PO:whole plant)
related match: PO_0025034
alternative label: leaf dry weight
term status: stable
in scheme: Thesaurustrait
related match: PO_0000003
reference: Eric Garnier, Jens Kattge, Stefan Klotz, Ingolf Kühn, Ulrike Stahl

Coarse woody debris nickel content per coarse woody debris dry mass trait
type: Class
subclass of: Litter and coarse woody debris trait
type: NamedIndividual
type: Concept
alternative label: coarse woody debris Ni content per dry mass
related match: PATO_0000125
related match: CHEBI_28112
reference: Eric Garnier, Jens Kattge, Stefan Klotz, Ingolf Kühn, Ulrike Stahl
pref unit: mass unit / mass unit or amount unit / mass unit
in scheme: Thesaurustrait
alternative label: CWD Ni content per dry mass
term status: stable
related match: SEP_00055
definition: The ratio of the quantity (SEP:quantity) of nickel (CHEBI:nickel atom) in the coarse woody debris (Def:coarse woody debris) to the corresponding coarse woody debris mass (PATO:mass) assessed after drying
formal name: coarse woody debris nickel content per coarse woody debris dry mass

Coarse woody debris nitrogen content per coarse woody debris dry mass trait
type: Class
subclass of: Litter and coarse woody debris trait
type: NamedIndividual
type: Concept
related match: PATO_0000125
pref unit: mass unit / mass unit or amount unit / mass unit
alternative label: CWD N content per dry mass
related match: CHEBI_25555
formal name: coarse woody debris nitrogen content per coarse woody debris dry mass
in scheme: Thesaurustrait
reference: Eric Garnier, Jens Kattge, Stefan Klotz, Ingolf Kühn, Ulrike Stahl
alternative label: coarse woody debris N content per dry mass
term status: stable
definition: The ratio of the quantity (SEP:quantity) of nitrogen (CHEBI:nitrogen atom) in the coarse woody debris (Def:coarse woody debris) to the corresponding coarse woody debris mass (PATO:mass) assessed after drying
related match: SEP_00055

Coarse woody debris phosphorus content per coarse woody debris dry mass trait
type: Class
subclass of: Litter and coarse woody debris trait
type: NamedIndividual
type: Concept
pref unit: mass unit / mass unit or amount unit / mass unit
related match: PATO_0000125
alternative label: CWD P content per dry mass
reference: Eric Garnier, Jens Kattge, Stefan Klotz, Ingolf Kühn, Ulrike Stahl
definition: The ratio of the quantity (SEP:quantity) of phosphorus (CHEBI:phosphorus atom) in the coarse woody debris (Def:coarse woody debris) to the corresponding coarse woody debris mass (PATO:mass) assessed after drying
in scheme: Thesaurustrait
term status: stable
formal name: coarse woody debris phosphorus content per coarse woody debris dry mass
alternative label: coarse woody debris P content per dry mass
related match: SEP_00055
related match: CHEBI_28659

Coarse woody debris potassium content per coarse woody debris dry mass trait
type: Class
subclass of: Litter and coarse woody debris trait
type: NamedIndividual
type: Concept
related match: PATO_0000125
pref unit: mass unit / mass unit or amount unit / mass unit
alternative label: CWD K content per dry mass
reference: Eric Garnier, Jens Kattge, Stefan Klotz, Ingolf Kühn, Ulrike Stahl
definition: The ratio of the quantity (SEP:quantity) of potassium (CHEBI:potassium atom) in the coarse woody debris (Def:coarse woody debris) to the corresponding coarse woody debris mass (PATO:mass) assessed after drying
in scheme: Thesaurustrait
term status: stable
formal name: coarse woody debris potassium content per coarse woody debris dry mass
alternative label: coarse woody debris K content per dry mass
related match: CHEBI_26216
related match: SEP_00055

Coarse woody debris silicon content per coarse woody debris dry mass trait
type: Class
subclass of: Litter and coarse woody debris trait
type: NamedIndividual
type: Concept
reference: Eric Garnier, Jens Kattge, Stefan Klotz, Ingolf Kühn, Ulrike Stahl
pref unit: mass unit / mass unit or amount unit / mass unit
related match: SEP_00055
related match: CHEBI_27573
related match: PATO_0000125
alternative label: CWD Si content per dry mass
definition: The ratio of the quantity (SEP:quantity) of silicon (CHEBI:silicon atom) in the coarse woody debris (Def:coarse woody debris) to the corresponding coarse woody debris mass (PATO:mass) assessed after drying
in scheme: Thesaurustrait
formal name: coarse woody debris silicon content per coarse woody debris dry mass
term status: stable
alternative label: coarse woody debris Si content per dry mass

Coarse woody debris sulfur content per coarse woody debris dry mass trait
type: Class
subclass of: Litter and coarse woody debris trait
type: NamedIndividual
type: Concept
related match: SEP_00055
alternative label: coarse woody debris S content per dry mass
related match: CHEBI_26833
pref unit: mass unit / mass unit or amount unit / mass unit
formal name: coarse woody debris sulfur content per coarse woody debris dry mass
reference: Eric Garnier, Jens Kattge, Stefan Klotz, Ingolf Kühn, Ulrike Stahl
in scheme: Thesaurustrait
term status: stable
alternative label: CWD S content per dry mass
definition: The ratio of the quantity (SEP:quantity) of sulfur (CHEBI:sulfur atom) in the coarse woody debris (Def:coarse woody debris) to the corresponding coarse woody debris mass (PATO:mass) assessed after drying
related match: PATO_0000125

Coarse woody debris zinc content per coarse woody debris dry mass trait
type: Class
subclass of: Litter and coarse woody debris trait
type: NamedIndividual
type: Concept
related match: CHEBI_27363
definition: The ratio of the quantity (SEP:quantity) of zinc (CHEBI:zinc atom) in the coarse woody debris (Def:coarse woody debris) to the corresponding coarse woody debris mass (PATO:mass) assessed after drying
alternative label: coarse woody debris Zn content per dry mass
pref unit: mass unit / mass unit or amount unit / mass unit
formal name: coarse woody debris zinc content per coarse woody debris dry mass
in scheme: Thesaurustrait
term status: stable
reference: Eric Garnier, Jens Kattge, Stefan Klotz, Ingolf Kühn, Ulrike Stahl
alternative label: CWD Zn content per dry mass
related match: PATO_0000125
related match: SEP_00055

Altitudinal range
type: Class
subclass of: Spatial distribution
type: NamedIndividual
type: Concept
related match: Efo plant population
formal name: altitudinal range
term status: stable
in scheme: Thesaurustrait

Frost tolerance
type: Class
subclass of: Environmental tolerance
type: NamedIndividual
type: Concept
definition: a feature of plant organs, whole plant (PO:whole plant), plant population (EFO:plant population) or plant species (Mayr:species) describing the ability to withstand frost
alternative label: plant frost hardiness
formal name: plant frost tolerance
pref unit: unitless (ordinal)
related match: Efo plant population
in scheme: Thesaurustrait
term status: stable
related match: PO_0000003
alternative label: plant frost sensitivity
reference: Eric Garnier, Jens Kattge, Stefan Klotz, Ingolf Kühn, Ulrike Stahl

Deep shade
type: Class
type: NamedIndividual
type: Concept
definition: places with a relative irradiance intensity between 1% and 3% at which individuals of a plant population (EFO:plant population) or species (Mayr:species) occur
formal name: plant populations light indicator value 1
related match: Efo plant population
term status: stable
in scheme: Thesaurustrait
reference: Ellenberg, H., Weber, H. E., Duell, R., Wirth, V., Werner, W., Paulissen, D. (1992): Zeigerwerte der Pflanzen in Mitteleuropa, 2nd edition, Scripta Geobotanica, Vol. 18, Goltze KG, Goettingen
abbreviation: L1
alternative label: light value 1
pref unit: unitless (category)

Plant leaf lamina dry mass
type: Class
subclass of: Plant leaf dry mass trait
type: NamedIndividual
type: Concept
alternative label: leaf lamina dry weight
definition: the sum of the leaf lamina dry mass (TOP:leaf lamina dry mass) of all leaves (PO:leaf) of a whole plant (PO:whole plant)
pref unit: mass unit
related match: PO_0025034
reference: Eric Garnier, Jens Kattge, Stefan Klotz, Ingolf Kühn, Ulrike Stahl
term status: stable
related match: PO_0000003
formal name: whole plant leaf lamina dry mass
in scheme: Thesaurustrait

Between deep shade and shade
type: Class
type: NamedIndividual
type: Concept
formal name: plant populations light indicator value 2
pref unit: unitless (category)
alternative label: light value 2
abbreviation: L2
related match: Efo plant population
definition: places with a relative irradiance intensity between deep shade (TOP:deep shade indicator plant) and shade (TOP:shade indicator plant) at which individuals of a plant population (EFO:plant population) or species (Mayr:species) occur
in scheme: Thesaurustrait
term status: stable
reference: Ellenberg, H., Weber, H. E., Duell, R., Wirth, V., Werner, W., Paulissen, D. (1992): Zeigerwerte der Pflanzen in Mitteleuropa, 2nd edition, Scripta Geobotanica, Vol. 18, Goltze KG, Goettingen

Shade
type: Class
type: NamedIndividual
type: Concept
pref unit: unitless (category)
formal name: plant populations light indicator value 3
abbreviation: L3
related match: Efo plant population
term status: stable
alternative label: light value 3
in scheme: Thesaurustrait
definition: places with a relative irradiance intensity less than 5%, but also in lighter places at which individuals of a plant population (EFO:plant population) or species (Mayr:species) occur
reference: Ellenberg, H., Weber, H. E., Duell, R., Wirth, V., Werner, W., Paulissen, D. (1992): Zeigerwerte der Pflanzen in Mitteleuropa, 2nd edition, Scripta Geobotanica, Vol. 18, Goltze KG, Goettingen

Between shade and semi-shade
type: Class
type: NamedIndividual
type: Concept
term status: stable
definition: places with a relative irradiance intensity between shade (TOP:shade indicator plant) and semi-shade (TOP:semi-shade indicator plant) at which individuals of a plant population (EFO:plant population) or species (Mayr:species) occur
formal name: plant populations light indicator value 4
related match: Efo plant population
abbreviation: L4
pref unit: unitless (category)
alternative label: light value 4
reference: Ellenberg, H., Weber, H. E., Duell, R., Wirth, V., Werner, W., Paulissen, D. (1992): Zeigerwerte der Pflanzen in Mitteleuropa, 2nd edition, Scripta Geobotanica, Vol. 18, Goltze KG, Goettingen
in scheme: Thesaurustrait

Semi-shade
type: Class
type: NamedIndividual
type: Concept
term status: stable
related match: Efo plant population
formal name: plant populations light indicator value 5
definition: places with a relative irradiance intensity of generally more than 10% and rarely full light at which individuals of a plant population (EFO:plant population) or species (Mayr:species) occur
abbreviation: L5
pref unit: unitless (category)
reference: Ellenberg, H., Weber, H. E., Duell, R., Wirth, V., Werner, W., Paulissen, D. (1992): Zeigerwerte der Pflanzen in Mitteleuropa, 2nd edition, Scripta Geobotanica, Vol. 18, Goltze KG, Goettingen
alternative label: light value 5
in scheme: Thesaurustrait

Between semi-shade and semi-light
type: Class
type: NamedIndividual
type: Concept
definition: places with a relative irradiance intensity between semi-shade (TOP:semi-shade indicator plant) and semi-light (TOP:semi-light indicator plant), seldom less than 20% relative irradiance intensity, at which individuals of a plant population (EFO:plant population) or species (Mayr:species) occur
related match: Efo plant population
term status: stable
formal name: plant populations light indicator value 6
abbreviation: L6
pref unit: unitless (category)
reference: Ellenberg, H., Weber, H. E., Duell, R., Wirth, V., Werner, W., Paulissen, D. (1992): Zeigerwerte der Pflanzen in Mitteleuropa, 2nd edition, Scripta Geobotanica, Vol. 18, Goltze KG, Goettingen
alternative label: light value 6
in scheme: Thesaurustrait

Semi-light
type: Class
type: NamedIndividual
type: Concept
term status: stable
in scheme: Thesaurustrait
related match: Efo plant population
alternative label: light value 7
definition: places with a relative irradiance intensity up to 30% in the shadow and full light at which individuals of a plant population (EFO:plant population) or species (Mayr:species) occur
pref unit: unitless (category)
formal name: plant populations light indicator value 7
reference: Ellenberg, H., Weber, H. E., Duell, R., Wirth, V., Werner, W., Paulissen, D. (1992): Zeigerwerte der Pflanzen in Mitteleuropa, 2nd edition, Scripta Geobotanica, Vol. 18, Goltze KG, Goettingen
abbreviation: L7

Light
type: Class
type: NamedIndividual
type: Concept
related match: Efo plant population
term status: stable
in scheme: Thesaurustrait
reference: Ellenberg, H., Weber, H. E., Duell, R., Wirth, V., Werner, W., Paulissen, D. (1992): Zeigerwerte der Pflanzen in Mitteleuropa, 2nd edition, Scripta Geobotanica, Vol. 18, Goltze KG, Goettingen
alternative label: light value 8
definition: places with a relative irradiance intensity generally higher than 40% at which individuals of a plant population (EFO:plant population) or species (Mayr:species) occur
abbreviation: L8
formal name: plant populations light indicator value 8
pref unit: unitless (category)

Full light
type: Class
type: NamedIndividual
type: Concept
reference: Ellenberg, H., Weber, H. E., Duell, R., Wirth, V., Werner, W., Paulissen, D. (1992): Zeigerwerte der Pflanzen in Mitteleuropa, 2nd edition, Scripta Geobotanica, Vol. 18, Goltze KG, Goettingen
alternative label: light value 9
definition: places with a relative irradiance intensity not less than 50%, with full light and mostly full sun at which individuals of a plant population (EFO:plant population) or species (Mayr:species) occur
related match: Efo plant population
abbreviation: L9
term status: stable
in scheme: Thesaurustrait
pref unit: unitless (category)
formal name: plant populations light indicator value 9

Ellenberg temperature value
type: Class
subclass of: Environmental indicator
type: NamedIndividual
type: Concept
reference: Ellenberg, H., Weber, H. E., Duell, R., Wirth, V., Werner, W., Paulissen, D. (1992): Zeigerwerte der Pflanzen in Mitteleuropa, 2nd edition, Scripta Geobotanica, Vol. 18, Goltze KG, Goettingen
abbreviation: T
related match: Efo plant population
pref unit: unitless (ordinal)
formal name: plant populations temperatue indicator value according to Ellenberg
in scheme: Thesaurustrait
term status: stable
definition: a feature of the plant population (EFO:plant population) or plant species (Mayr:species) describing the occurrence of its individuals in temperature gradients from arctic to mediterranean and from alpine to lowland
alternative label: plant temperature preference

Ellenberg moisture value
type: Class
subclass of: Environmental indicator
type: NamedIndividual
type: Concept
definition: a feature of the plant population (EFO:plant population) or plant species (Mayr:species) describing the occurrence of its individuals along soil moisture gradient from dry shallow-soil rocky slopes to swampy grounds and from shallow to deep water
reference: Ellenberg, H., Weber, H. E., Duell, R., Wirth, V., Werner, W., Paulissen, D. (1992): Zeigerwerte der Pflanzen in Mitteleuropa, 2nd edition, Scripta Geobotanica, Vol. 18, Goltze KG, Goettingen
related match: Efo plant population
pref unit: unitless (ordinal)
formal name: plant populations moisture indicator value according to Ellenberg
in scheme: Thesaurustrait
abbreviation: F
alternative label: plant moisture preference
term status: stable

Plant specific leaf area trait
type: Class
subclass of: Whole plant trait
type: NamedIndividual
type: Concept
definition: the ratio of the whole plant leaf area trait (TOP:plant leaf area trait) to the whole plant leaf dry mass trait (TOP:plant leaf dry mass trait)
formal name: whole plant leaf area per whole plant leaf dry mass trait
pref unit: area unit / mass unit
term status: stable
in scheme: Thesaurustrait
reference: Eric Garnier, Jens Kattge, Stefan Klotz, Ingolf Kühn, Ulrike Stahl

Ellenberg nutrient value
type: Class
subclass of: Environmental indicator
type: NamedIndividual
type: Concept
formal name: plant populations nutrient indicator value according to Ellenberg
definition: a feature of the plant population (EFO:plant population) or plant species (Mayr:species) describing the occurrence of its individuals along gradients of few to much available nutrients during the growing period
term status: stable
pref unit: unitless (ordinal)
related match: Efo plant population
abbreviation: N
alternative label: plant nutrient preference
in scheme: Thesaurustrait
reference: Ellenberg, H., Weber, H. E., Duell, R., Wirth, V., Werner, W., Paulissen, D. (1992): Zeigerwerte der Pflanzen in Mitteleuropa, 2nd edition, Scripta Geobotanica, Vol. 18, Goltze KG, Goettingen

Ellenberg reaction value
type: Class
subclass of: Environmental indicator
type: NamedIndividual
type: Concept
formal name: plant populations reaction indicator value according to Ellenberg
pref unit: unitless (ordinal)
abbreviation: R
term status: stable
definition: a feature of the plant population (EFO:plant population) or plant species (Mayr:species) describing the occurrence of its individuals along gradient of soil acidity and lime content
related match: Efo plant population
reference: Ellenberg, H., Weber, H. E., Duell, R., Wirth, V., Werner, W., Paulissen, D. (1992): Zeigerwerte der Pflanzen in Mitteleuropa, 2nd edition, Scripta Geobotanica, Vol. 18, Goltze KG, Goettingen
alternative label: plant reaction preference
in scheme: Thesaurustrait

Ellenberg heavy metals value
type: Class
subclass of: Environmental indicator
type: NamedIndividual
type: Concept
formal name: plant populations resistance to heavy metals indicator value according to Ellenberg
related match: Efo plant population
pref unit: unitless (ordinal)
alternative label: plant heavy metal resistance
term status: stable
abbreviation: B,b
definition: a feature of the plant population (EFO:plant population) or plant species (Mayr:species) describing the occurrence of its individulas in sites with more or less high concentrations of lead zinc or other heavy metals
reference: Ellenberg, H., Weber, H. E., Duell, R., Wirth, V., Werner, W., Paulissen, D. (1992): Zeigerwerte der Pflanzen in Mitteleuropa, 2nd edition, Scripta Geobotanica, Vol. 18, Goltze KG, Goettingen
in scheme: Thesaurustrait

Hemeroby
type: Class
subclass of: Environmental tolerance
type: NamedIndividual
type: Concept
formal name: hemeroby
pref unit: unitless (ordinal)
reference: after Sukopp, H. (1972): Wandel von Flora und Vegetation in Mitteleuropa unter dem Einfluss des Menschen. Berichte ueber Landwirtschaft 50:S 112-139, changed by Klotz, S., Kühn, I. & Durka, W. (2002): BIOLFLOR - Eine Datenbank zu biologisch-oekologischen Merkmalen der Gefaesspflanzen in Deutschland. - Schriftenreihe fuer Vegetationskunde 38. Bonn: Bundesamt fuer Naturschutz.
cat: Metahemerobic
term status: stable
in scheme: Thesaurustrait
definition: a feature of the plant population (EFO:plant population) or plant species (Mayr:species) describing the occurrence of its individuals with respect to the degree of human impact on their habitats, i.e. the departure of naturalness of the habitats (tolerance to human impact).
cat: Oligohemerobic
cat: Ahemerobic
related match: Efo plant population
cat: Polyhemerobic
cat: Alpha euhemerobic
cat: Beta euhemerobic
cat: Mesohemerobic

Ahemerobic
type: Class
type: NamedIndividual
type: Concept
reference: after Sukopp, H. (1972): Wandel von Flora und Vegetation in Mitteleuropa unter dem Einfluss des Menschen. Berichte ueber Landwirtschaft 50:S 112-139, changed by Klotz, S., Kühn, I. & Durka, W. (2002): BIOLFLOR - Eine Datenbank zu biologisch-oekologischen Merkmalen der Gefaesspflanzen in Deutschland. - Schriftenreihe fuer Vegetationskunde 38. Bonn: Bundesamt fuer Naturschutz.
related match: Efo plant population
formal name: ahemerobic
term status: stable
pref unit: unitless (category)
in scheme: Thesaurustrait
definition: individuals of the plant population (EFO:plant population) or species (Mayr:species) occur at habitats with no human impact

Oligohemerobic
type: Class
type: NamedIndividual
type: Concept
related match: Efo plant population
definition: individuals of the plant population (EFO:plant population) or species (Mayr:species) occur at habitats with slight human impact (e.g. slight wood felling, grazing, emission from air and waters)
reference: after Sukopp, H. (1972): Wandel von Flora und Vegetation in Mitteleuropa unter dem Einfluss des Menschen. Berichte ueber Landwirtschaft 50:S 112-139, changed by Klotz, S., Kühn, I. & Durka, W. (2002): BIOLFLOR - Eine Datenbank zu biologisch-oekologischen Merkmalen der Gefaesspflanzen in Deutschland. - Schriftenreihe fuer Vegetationskunde 38. Bonn: Bundesamt fuer Naturschutz.
formal name: oligohemerobic
term status: stable
in scheme: Thesaurustrait
pref unit: unitless (category)

Mesohemerobic
type: Class
type: NamedIndividual
type: Concept
term status: stable
in scheme: Thesaurustrait
formal name: mesohemerobic
related match: Efo plant population
reference: after Sukopp, H. (1972): Wandel von Flora und Vegetation in Mitteleuropa unter dem Einfluss des Menschen. Berichte ueber Landwirtschaft 50:S 112-139, changed by Klotz, S., Kühn, I. & Durka, W. (2002): BIOLFLOR - Eine Datenbank zu biologisch-oekologischen Merkmalen der Gefaesspflanzen in Deutschland. - Schriftenreihe fuer Vegetationskunde 38. Bonn: Bundesamt fuer Naturschutz.
definition: individuals of the plant population (EFO:plant population) or species (Mayr:species) occur at habitats with moderate human impact (e.g. clearings or rarely ploughing, material for animal bedding or mulch, rarely fertilized)
pref unit: unitless (category)

Beta euhemerobic
type: Class
type: NamedIndividual
type: Concept
in scheme: Thesaurustrait
term status: stable
definition: individuals of the plant population (EFO:plant population) or species (Mayr:species) occur at habitats with strong human impact (e.g. fertilizing, lime application, use of biocides, slight drainage)
related match: Efo plant population
formal name: beta euhemerobic
reference: after Sukopp, H. (1972): Wandel von Flora und Vegetation in Mitteleuropa unter dem Einfluss des Menschen. Berichte ueber Landwirtschaft 50:S 112-139, changed by Klotz, S., Kühn, I. & Durka, W. (2002): BIOLFLOR - Eine Datenbank zu biologisch-oekologischen Merkmalen der Gefaesspflanzen in Deutschland. - Schriftenreihe fuer Vegetationskunde 38. Bonn: Bundesamt fuer Naturschutz.
pref unit: unitless (category)

Alpha euhemerobic
type: Class
type: NamedIndividual
type: Concept
in scheme: Thesaurustrait
formal name: alpha euhemerobic
definition: individuals of the plant population (EFO:plant population) or species (Mayr:species) occur at habitats with very strong human impact (e.g. levelling, regular ploughing, application of mineral fertilizer, irrigation with sewages)
reference: after Sukopp, H. (1972): Wandel von Flora und Vegetation in Mitteleuropa unter dem Einfluss des Menschen. Berichte ueber Landwirtschaft 50:S 112-139, changed by Klotz, S., Kühn, I. & Durka, W. (2002): BIOLFLOR - Eine Datenbank zu biologisch-oekologischen Merkmalen der Gefaesspflanzen in Deutschland. - Schriftenreihe fuer Vegetationskunde 38. Bonn: Bundesamt fuer Naturschutz.
related match: Efo plant population
pref unit: unitless (category)
term status: stable

Polyhemerobic
type: Class
type: NamedIndividual
type: Concept
in scheme: Thesaurustrait
reference: after Sukopp, H. (1972): Wandel von Flora und Vegetation in Mitteleuropa unter dem Einfluss des Menschen. Berichte ueber Landwirtschaft 50:S 112-139, changed by Klotz, S., Kühn, I. & Durka, W. (2002): BIOLFLOR - Eine Datenbank zu biologisch-oekologischen Merkmalen der Gefaesspflanzen in Deutschland. - Schriftenreihe fuer Vegetationskunde 38. Bonn: Bundesamt fuer Naturschutz.
related match: Efo plant population
pref unit: unitless (category)
definition: individuals of the plant population (EFO:plant population) or species (Mayr:species) occur at habitats with extreme human impact (e.g. deep ploughing, persistent and intense drainage or intense irrigation, intense fertilization or application of biocides, single destruction of community and covering of the habitat with allochthonous material)
term status: stable
formal name: polyhemerobic

Plant specific leaf area
type: Class
subclass of: Plant specific leaf area trait
type: NamedIndividual
type: Concept
definition: the ratio of the whole plant leaf area (TOP:plant leaf area) to the whole plant leaf dry mass (TOP:plant leaf dry mass )
formal name: whole plant leaf area per whole plant leaf dry mass
term status: stable
reference: Eric Garnier, Jens Kattge, Stefan Klotz, Ingolf Kühn, Ulrike Stahl
in scheme: Thesaurustrait
pref unit: area unit / mass unit

Metahemerobic
type: Class
type: NamedIndividual
type: Concept
formal name: metahemerobic
related match: Efo plant population
term status: stable
reference: after Sukopp, H. (1972): Wandel von Flora und Vegetation in Mitteleuropa unter dem Einfluss des Menschen. Berichte ueber Landwirtschaft 50:S 112-139, changed by Klotz, S., Kühn, I. & Durka, W. (2002): BIOLFLOR - Eine Datenbank zu biologisch-oekologischen Merkmalen der Gefaesspflanzen in Deutschland. - Schriftenreihe fuer Vegetationskunde 38. Bonn: Bundesamt fuer Naturschutz.
definition: individuals of the plant population (EFO:plant population) or species (Mayr:species) occur at habitats that are completely destroyed by humans (e.g. poisoned ecosystems, completely sealed areas)
pref unit: unitless (category)
in scheme: Thesaurustrait

Floristic zone
type: Class
subclass of: Spatial distribution
type: NamedIndividual
type: Concept
related match: Efo plant population
term status: stable
in scheme: Thesaurustrait
formal name: floristic zone

Antarctic species
type: Class
type: NamedIndividual
type: Concept
reference: Jaeger, E. J.& Werner K. (2002): Rothmaler, Exkursionsflora von Deutschland. Gefaesspflanzen: Kritischer Band, Berlin, Spectrum, 948 pages (adapted)
definition: plant species (Mayr:species) with individuals ocurring in the antartic floristic zone, which is situated on the southern hemisphere corresponding to the boreal (TOP:boreal species) to arctic (TOP:arctic species) zones of the northern hemisphere
formal name: plant species antarctic
term status: stable
in scheme: Thesaurustrait
pref unit: unitless (category)

Austral species
type: Class
type: NamedIndividual
type: Concept
reference: Jaeger, E. J.& Werner K. (2002): Rothmaler, Exkursionsflora von Deutschland. Gefaesspflanzen: Kritischer Band, Berlin, Spectrum, 948 pages (adapted)
definition: plant species (Mayr:species) with individuals ocurring in the austral floristic zone, which is situated on the southern hemisphere corresponding to the temperate (TOP:temperate species) to meridional (TOP:meridional species) zones of the northern hemisphere
term status: stable
in scheme: Thesaurustrait
formal name: plant species austral
pref unit: unitless (category)

Tropical species
type: Class
type: NamedIndividual
type: Concept
definition: plant species (Mayr:species) with individuals ocurring in the tropical floristic zone, which is located along the geographical tropics and characterised by warm and humid climate and evergreen (TOP:evergreen leaf) broadleaved (TOP:broadleaved leaf) forests
reference: Jaeger, E. J.& Werner K. (2002): Rothmaler, Exkursionsflora von Deutschland. Gefaesspflanzen: Kritischer Band, Berlin, Spectrum, 948 pages (adapted)
formal name: plant species tropical
term status: stable
in scheme: Thesaurustrait
pref unit: unitless (category)

Subtropical species
type: Class
type: NamedIndividual
type: Concept
reference: Jaeger, E. J.& Werner K. (2002): Rothmaler, Exkursionsflora von Deutschland. Gefaesspflanzen: Kritischer Band, Berlin, Spectrum, 948 pages (adapted)
formal name: plant species subtropical
definition: plant species (Mayr:species) with individuals ocurring in the subtropical floristic zone, which is located along the geographical subtropics and characterised by a winter dry climate and by savannahs and dry forests
in scheme: Thesaurustrait
pref unit: unitless (category)
term status: stable

Meridional species
type: Class
type: NamedIndividual
type: Concept
definition: plant species (Mayr:species) with individuals ocurring in the meridional floristic zone, which is restricted to the Northern Hemisphere south of the submeridional zone and north of the subtropical zone and characterized by evergreen (TOP:evergreen leaf) broadleaved (TOP:broadleaved leaf) and needleleaved (TOP:needle leaf) forests, steppes and deserts
reference: Jaeger, E. J.& Werner K. (2002): Rothmaler, Exkursionsflora von Deutschland. Gefaesspflanzen: Kritischer Band, Berlin, Spectrum, 948 pages (adapted)
formal name: plant species meridional
in scheme: Thesaurustrait
term status: stable
pref unit: unitless (category)

Submeridional species
type: Class
type: NamedIndividual
type: Concept
in scheme: Thesaurustrait
reference: Jaeger, E. J.& Werner K. (2002): Rothmaler, Exkursionsflora von Deutschland. Gefaesspflanzen: Kritischer Band, Berlin, Spectrum, 948 pages (adapted)
formal name: plant species submeridional
definition: plant species (Mayr:species) with individuals ocurring in the submeridional floristic zone, which is restricted to the Northern Hemisphere south of the temperate zone and north of the meridional zone, and characterised by summer-green dry forests and steppes
pref unit: unitless (category)
term status: stable

Temperate species
type: Class
type: NamedIndividual
type: Concept
in scheme: Thesaurustrait
definition: plant species (Mayr:species) with individuals ocurring in the temperate floristic zone, which is located on the northern hemisphere between the tropic of Cancer and the arctic circle and on the southern hemisphere between the tropic of Capricorn and the antarctic circle, and which is characterised by summer-green deciduous (TOP:summer green leaf) forests
formal name: plant species temperate
pref unit: unitless (category)
reference: Jaeger, E. J.& Werner K. (2002): Rothmaler, Exkursionsflora von Deutschland. Gefaesspflanzen: Kritischer Band, Berlin, Spectrum, 948 pages (adapted)
term status: stable

Boreal species
type: Class
type: NamedIndividual
type: Concept
in scheme: Thesaurustrait
term status: stable
definition: plant species (Mayr:species) with individuals ocurring in the boreal floristic zone, which is locasted in between the northern temperate zone and the arctic zone characterised by vegetation of the northern taiga and needleleaved (TOP:needle leaf) forests
formal name: plant species boreal
pref unit: unitless (category)
reference: Jaeger, E. J.& Werner K. (2002): Rothmaler, Exkursionsflora von Deutschland. Gefaesspflanzen: Kritischer Band, Berlin, Spectrum, 948 pages (adapted)

Stem and branch trait
type: Class
subclass of: Plant trait
type: NamedIndividual
type: Concept
in scheme: Thesaurustrait
reference: Eric Garnier, Jens Kattge, Stefan Klotz, Ingolf Kühn, Ulrike Stahl
term status: testing
definition: a plant trait (TOP:plant trait) referring to the stem (PO:stem)

Plant specific leaf lamina area
type: Class
subclass of: Plant specific leaf area trait
type: NamedIndividual
type: Concept
formal name: whole plant leaf lamina area per whole plant leaf lamina dry mass
term status: stable
definition: the ratio of the whole plant leaf lamina area (TOP:plant leaf lamina area) to whole plant leaf lamina dry mass (TOP:plant leaf lamina dry mass )
pref unit: area unit / mass unit
reference: Eric Garnier, Jens Kattge, Stefan Klotz, Ingolf Kühn, Ulrike Stahl
in scheme: Thesaurustrait

Arctic species
type: Class
type: NamedIndividual
type: Concept
formal name: plant species arctic
in scheme: Thesaurustrait
definition: plant species (Mayr:species) with individuals ocurring in the artic floristic zone, which is a polar region at the northernmost part of the Earth, north of the arctic circle, characterised by vegetation of the tundras north of the treeline.
reference: Jaeger, E. J.& Werner K. (2002): Rothmaler, Exkursionsflora von Deutschland. Gefaesspflanzen: Kritischer Band, Berlin, Spectrum, 948 pages (adapted)
pref unit: unitless (category)
term status: stable

Antarctic population
type: Class
type: NamedIndividual
type: Concept
definition: plant species population with individuals ocurring in the antartic floristic zone, which is situated on the southern hemisphere corresponding to the boreal (TOP:boreal population) to arctic (TOP:arctic population) zones of the northern hemisphere
in scheme: Thesaurustrait
formal name: plant population antarctic
reference: Jaeger, E. J.& Werner K. (2002): Rothmaler, Exkursionsflora von Deutschland. Gefaesspflanzen: Kritischer Band, Berlin, Spectrum, 948 pages (adapted)
term status: stable
pref unit: unitless (category)

Austral population
type: Class
type: NamedIndividual
type: Concept
pref unit: unitless (category)
formal name: plant population austral
in scheme: Thesaurustrait
reference: Jaeger, E. J.& Werner K. (2002): Rothmaler, Exkursionsflora von Deutschland. Gefaesspflanzen: Kritischer Band, Berlin, Spectrum, 948 pages (adapted)
definition: plant species population with individuals ocurring in the austral floristic zone, which is situated on the southern hemisphere corresponding the temperate (TOP:temperate population) to meridional (TOP:meridional population) zones of the northern hemisphere
term status: stable

Tropical population
type: Class
type: NamedIndividual
type: Concept
pref unit: unitless (category)
formal name: plant population tropical
term status: stable
in scheme: Thesaurustrait
definition: plant species population with individuals ocurring in the tropical floristic zone, which is located along the geographical tropics and characterised by warm humid climate and evergreen (TOP:evergreen leaf) broadleaved (TOP:broadleaved leaf) forests
reference: Jaeger, E. J.& Werner K. (2002): Rothmaler, Exkursionsflora von Deutschland. Gefaesspflanzen: Kritischer Band, Berlin, Spectrum, 948 pages (adapted)

Subtropical population
type: Class
type: NamedIndividual
type: Concept
reference: Jaeger, E. J.& Werner K. (2002): Rothmaler, Exkursionsflora von Deutschland. Gefaesspflanzen: Kritischer Band, Berlin, Spectrum, 948 pages (adapted)
definition: plant species population with individuals ocurring in the subtropical floristic zone, which is located along the geographical subtropics and characterised by a winter dry climate and by savannahs and dry forests
pref unit: unitless (category)
formal name: plant population subtropical
term status: stable
in scheme: Thesaurustrait

Meridional population
type: Class
type: NamedIndividual
type: Concept
reference: Jaeger, E. J.& Werner K. (2002): Rothmaler, Exkursionsflora von Deutschland. Gefaesspflanzen: Kritischer Band, Berlin, Spectrum, 948 pages (adapted)
pref unit: unitless (category)
in scheme: Thesaurustrait
term status: stable
definition: plant species population with individuals ocurring in the meridional floristic zone, which is restricted to the Northern Hemisphere south of the submeridional zone and north of the subtropical zone and characterized by evergreen (TOP:evergreen leaf) broadleaved (TOP:broadleaved leaf) and needleleaved (TOP:needle leaf) forests, steppes and deserts
formal name: plant population meridional

Submeridional population
type: Class
type: NamedIndividual
type: Concept
formal name: plant population submeridional
definition: plant species population with individuals ocurring in the submeridional floristic zone, which is restricted to the Northern Hemisphere south of the temperate zone and north of the meridional zone, and characterised by summer-green dry forests and steppes
pref unit: unitless (category)
in scheme: Thesaurustrait
term status: stable
reference: Jaeger, E. J.& Werner K. (2002): Rothmaler, Exkursionsflora von Deutschland. Gefaesspflanzen: Kritischer Band, Berlin, Spectrum, 948 pages (adapted)

Temperate population
type: Class
type: NamedIndividual
type: Concept
term status: stable
pref unit: unitless (category)
in scheme: Thesaurustrait
formal name: plant population temperate
reference: Jaeger, E. J.& Werner K. (2002): Rothmaler, Exkursionsflora von Deutschland. Gefaesspflanzen: Kritischer Band, Berlin, Spectrum, 948 pages (adapted)
definition: plant species population with individuals ocurring in the temperate floristic zone, which is located on the northern hemisphere between the tropic of Cancer and the arctic circle and on the southern hemisphere between the tropic of Capricorn and the antarctic circle, and which is characterised by summer-green deciduous (TOP:summer green leaf) forests

Boreal population
type: Class
type: NamedIndividual
type: Concept
definition: plant species population with individuals ocurring in the boreal floristic zone, which is locasted in between the northern temperate zone and the arctic zone characterised by vegetation of the northern taiga and needleleaved (TOP:needle leaf) forests
term status: stable
in scheme: Thesaurustrait
formal name: plant population boreal
pref unit: unitless (category)
reference: Jaeger, E. J.& Werner K. (2002): Rothmaler, Exkursionsflora von Deutschland. Gefaesspflanzen: Kritischer Band, Berlin, Spectrum, 948 pages (adapted)

Arctic population
type: Class
type: NamedIndividual
type: Concept
term status: stable
in scheme: Thesaurustrait
pref unit: unitless (category)
formal name: plant population arctic
definition: plant species population with individuals ocurring in the artic floristic zone, which is a polar region at the northernmost part of the Earth, north of the arctic circle, characterised by vegetation of the tundras north of the treeline.
reference: Jaeger, E. J.& Werner K. (2002): Rothmaler, Exkursionsflora von Deutschland. Gefaesspflanzen: Kritischer Band, Berlin, Spectrum, 948 pages (adapted)

Plant leaf mass per area trait
type: Class
subclass of: Whole plant trait
type: NamedIndividual
type: Concept
in scheme: Thesaurustrait
term status: stable
definition: the ratio of the whole plant leaf dry mass trait (TOP:plant leaf dry mass trait) to the whole plant leaf area trait (TOP:plant leaf area trait)
formal name: whole plant leaf dry mass per whole plant leaf area trait
pref unit: mass unit/ area unit
reference: Eric Garnier, Jens Kattge, Stefan Klotz, Ingolf Kühn, Ulrike Stahl

Plant cellulose content per plant dry mass
type: Class
subclass of: Whole plant trait
type: NamedIndividual
type: Concept
related match: PATO_0000125
term status: stable
in scheme: Thesaurustrait
related match: PO_0000003
definition: The ratio of the mass (PATO:mass) of cellulose (Def:cellulose) in the whole plant (PO:whole plant) to the corresponding whole plant (PO:whole plant) mass (PATO:mass) assessed after drying
reference: Jens Kattge, Ulrike Stahl, Eric Garnier, Stefan Klotz, Ingolf Kühn
formal name: whole plant cellulose content per plant dry mass
pref unit: mass unit / mass unit
alternative label: whole plant cellulose content per dry mass

Shoot cellulose content per shoot dry mass
type: Class
subclass of: Shoot trait
type: NamedIndividual
type: Concept
pref unit: mass unit / mass unit
term status: stable
in scheme: Thesaurustrait
alternative label: shoot cellulose content per dry mass
related match: PATO_0000125
definition: The ratio of the mass (PATO:mass) of cellulose (Def:cellulose) in the shoot (PO:shoot system) to the corresponding shoot (PO:shoot system) mass (PATO:mass) assessed after drying
related match: PO_0009006
reference: Jens Kattge, Ulrike Stahl, Eric Garnier, Stefan Klotz, Ingolf Kühn
formal name: shoot cellulose content per shoot dry mass

Branch cellulose content per branch dry mass
type: Class
subclass of: Stem and branch trait
type: NamedIndividual
type: Concept
pref unit: mass unit / mass unit
formal name: branch cellulose content per branch dry mass
related match: PATO_0000125
in scheme: Thesaurustrait
alternative label: branch cellulose content per dry mass
related match: PO_0025073
term status: stable
definition: The ratio of the mass (PATO:mass) of cellulose (Def:cellulose) in the branch (PO:branch) to the corresponding branch (PO:branch) mass (PATO:mass) assessed after drying
reference: Jens Kattge, Ulrike Stahl, Eric Garnier, Stefan Klotz, Ingolf Kühn

Bark cellulose content per bark dry mass
type: Class
subclass of: Stem and branch trait
type: NamedIndividual
type: Concept
formal name: bark cellulose content per bark dry mass
alternative label: bark cellulose content per dry mass
in scheme: Thesaurustrait
reference: Jens Kattge, Ulrike Stahl, Eric Garnier, Stefan Klotz, Ingolf Kühn
related match: PATO_0000125
term status: stable
definition: The ratio of the mass (PATO:mass) of cellulose (Def:cellulose) in the bark (PO:bark) to the corresponding bark (PO:bark) mass (PATO:mass) assessed after drying
related match: PO_0004518
pref unit: mass unit / mass unit

Stem cellulose content per stem dry mass
type: Class
subclass of: Stem and branch trait
type: NamedIndividual
type: Concept
alternative label: stem cellulose content per dry mass
formal name: stem cellulose content per stem dry mass
in scheme: Thesaurustrait
term status: stable
related match: PATO_0000125
related match: PO_0009047
definition: The ratio of the mass (PATO:mass) of cellulose (Def:cellulose) in the stem (PO:stem) to the corresponding stem (PO:stem) mass (PATO:mass) assessed after drying
reference: Jens Kattge, Ulrike Stahl, Eric Garnier, Stefan Klotz, Ingolf Kühn
pref unit: mass unit / mass unit

Wood cellulose content per wood dry mass trait
type: Class
subclass of: Stem and branch trait
type: NamedIndividual
type: Concept
definition: The ratio of the mass (PATO:mass) of cellulose (Def:cellulose) in the wood (PO:secondary xylem) to the corresponding wood (PO:secondary xylem) mass (PATO:mass) assessed after drying
formal name: wood cellulose content per wood dry mass
alternative label: wood cellulose content per dry mass
in scheme: Thesaurustrait
related match: PATO_0000125
related match: PO_0005848
term status: stable
pref unit: mass unit / mass unit
reference: Jens Kattge, Ulrike Stahl, Eric Garnier, Stefan Klotz, Ingolf Kühn

Stem wood cellulose content per stem wood dry mass
type: Class
subclass of: Wood cellulose content per wood dry mass trait
type: NamedIndividual
type: Concept
alternative label: stem wood cellulose content per dry mass
in scheme: Thesaurustrait
formal name: stem wood cellulose content per stem wood dry mass
related match: PO_0005848
related match: PATO_0000125
term status: stable
reference: Jens Kattge, Ulrike Stahl, Eric Garnier, Stefan Klotz, Ingolf Kühn
definition: The ratio of the mass (PATO:mass) of cellulose (Def:cellulose) in the stem wood (PO:stem, PO:secondary xylem) to the corresponding stem wood (PO:stem, PO:secondary xylem) mass (PATO:mass) assessed after drying
pref unit: mass unit / mass unit
related match: PO_0009047

Branch wood cellulose content per branch wood dry mass
type: Class
subclass of: Wood cellulose content per wood dry mass trait
type: NamedIndividual
type: Concept
reference: Jens Kattge, Ulrike Stahl, Eric Garnier, Stefan Klotz, Ingolf Kühn
related match: PATO_0000125
in scheme: Thesaurustrait
formal name: branch wood cellulose content per branch wood dry mass
pref unit: mass unit / mass unit
related match: PO_0005848
alternative label: branch wood cellulose content per dry mass
term status: stable
definition: The ratio of the mass (PATO:mass) of cellulose (Def:cellulose) in the branch wood (PO:branch, PO:secondary xylem) to the corresponding branch wood (PO:branch, PO:secondary xylem) mass (PATO:mass) assessed after drying
related match: PO_0025073

Cotyledon cellulose content per cotyledon dry mass
type: Class
subclass of: Leaf trait
type: NamedIndividual
type: Concept
reference: Jens Kattge, Ulrike Stahl, Eric Garnier, Stefan Klotz, Ingolf Kühn
related match: PO_0020030
related match: PATO_0000125
term status: stable
definition: The ratio of the mass (PATO:mass) of cellulose (Def:cellulose) in the cotyledon (PO:cotyledon) to the corresponding cotyledon (PO:cotyledon) mass (PATO:mass) assessed after drying
in scheme: Thesaurustrait
pref unit: mass unit / mass unit
alternative label: cotyledon cellulose content per dry mass
formal name: cotyledon cellulose content per cotyledon dry mass

Leaf cellulose content per leaf dry mass
type: Class
subclass of: Leaf trait
type: NamedIndividual
type: Concept
related match: PO_0020039
related match: PO_0020049
related match: PATO_0000125
related match: PO_0025034
reference: Jens Kattge, Ulrike Stahl, Eric Garnier, Stefan Klotz, Ingolf Kühn
alternative label: leaf cellulose content per dry mass
definition: The ratio of the mass (PATO:mass) of cellulose (Def:cellulose) in the leaf (PO:leaf) or component thereof, i.e. leaf lamina or leaflet (PO:leaf lamina, PO:leaflet) per respective unit dry mass (TOP:leaf dry mass, TOP:leaf lamina dry mass, TOP:leaflet dry mass)
term status: stable
in scheme: Thesaurustrait
formal name: leaf cellulose content per leaf dry mass
pref unit: mass unit / mass unit

Plant leaf mass per area
type: Class
subclass of: Plant leaf mass per area trait
type: NamedIndividual
type: Concept
in scheme: Thesaurustrait
term status: stable
definition: the ratio of the whole plant leaf dry mass (TOP:plant leaf dry mass) to the whole plant leaf area (TOP:plant leaf area)
pref unit: mass unit / area unit
formal name: whole plant leaf dry mass per whole plant leaf area
reference: Eric Garnier, Jens Kattge, Stefan Klotz, Ingolf Kühn, Ulrike Stahl

Leaf cellulose content per leaf area
type: Class
subclass of: Leaf trait
type: NamedIndividual
type: Concept
definition: The ratio of the mass (PATO:mass) of cellulose (Def:cellulose) in the leaf (PO:leaf) or component thereof, i.e. leaf lamina or leaflet (PO:leaf lamina, PO:leaflet) per respective area (TOP:leaf area, TOP:leaf lamina area, TOP:leaflet area)
related match: PATO_0000125
term status: stable
formal name: leaf cellulose content per leaf area
related match: PO_0020039
pref unit: mass unit / mass unit
related match: PO_0020049
in scheme: Thesaurustrait
alternative label: leaf cellulose content per area
related match: PO_0025034
reference: Jens Kattge, Ulrike Stahl, Eric Garnier, Stefan Klotz, Ingolf Kühn

Root cellulose content per root dry mass trait
type: Class
subclass of: Root trait
type: NamedIndividual
type: Concept
term status: stable
alternative label: root cellulose content per dry mass
related match: PATO_0000125
in scheme: Thesaurustrait
related match: PO_0009005
formal name: root cellulose content per root dry mass
pref unit: mass unit / mass unit
definition: The ratio of the mass (PATO:mass) of cellulose (Def:cellulose) in the root (PO:root) to the corresponding root mass (PATO:mass) assessed after drying
reference: Jens Kattge, Ulrike Stahl, Eric Garnier, Stefan Klotz, Ingolf Kühn

Coarse root cellulose content per coarse root dry mass
type: Class
subclass of: Root cellulose content per root dry mass trait
type: NamedIndividual
type: Concept
in scheme: Thesaurustrait
related match: PATO_0000125
term status: stable
formal name: coarse root cellulose content per coarse root dry mass
reference: Jens Kattge, Ulrike Stahl, Eric Garnier, Stefan Klotz, Ingolf Kühn
alternative label: coarse root cellulose content per dry mass
definition: The ratio of the mass (PATO:mass) of cellulose (Def:cellulose) in the coarse root (Def:coarse root) to the corresponding coarse root mass (PATO:mass) assessed after drying
pref unit: mass unit / mass unit

Fine root cellulose content per fine root dry mass
type: Class
subclass of: Root trait
subclass of: Root cellulose content per root dry mass trait
type: NamedIndividual
type: Concept
related match: PATO_0000125
definition: The ratio of the mass (PATO:mass) of cellulose (Def:cellulose) in a first order fine root (McCormack:fine root) to the corresponding first order fine root mass (PATO:mass) assessed after drying.
alternative label: fine root cellulose content per dry mass
pref unit: mass unit / mass unit
alternative label: first oder fine root cellulose content per dry mass
term status: stable
in scheme: Thesaurustrait
formal name: first order fine root cellulose content per first order fine root dry mass
definition: The ratio of the mass (PATO:mass) of cellulose (Def:cellulose) in the fine root (McCormack:fine root) to the corresponding fine root mass (PATO:mass) assessed after drying
reference: Jens Kattge, Ulrike Stahl, Eric Garnier, Stefan Klotz, Ingolf Kühn
formal name: fine root cellulose content per fine root dry mass

Fine root cellulose content per fine root dry mass
type: Class
subclass of: Root trait
subclass of: Root cellulose content per root dry mass trait
type: NamedIndividual
type: Concept
definition: The ratio of the mass (PATO:mass) of cellulose (Def:cellulose) in a first order fine root (McCormack:fine root) to the corresponding first order fine root mass (PATO:mass) assessed after drying.
related match: PATO_0000125
alternative label: fine root cellulose content per dry mass
pref unit: mass unit / mass unit
alternative label: first oder fine root cellulose content per dry mass
term status: stable
in scheme: Thesaurustrait
reference: Jens Kattge, Ulrike Stahl, Eric Garnier, Stefan Klotz, Ingolf Kühn
formal name: first order fine root cellulose content per first order fine root dry mass
definition: The ratio of the mass (PATO:mass) of cellulose (Def:cellulose) in the fine root (McCormack:fine root) to the corresponding fine root mass (PATO:mass) assessed after drying
formal name: fine root cellulose content per fine root dry mass

Second order fine root cellulose content per per dry mass
type: Class
subclass of: Fine root cellulose content per fine root dry mass
type: NamedIndividual
type: Concept
alternative label: second order fine root cellulose content per dry mass
in scheme: Thesaurustrait
term status: stable
related match: PATO_0000125
reference: Jens Kattge, Ulrike Stahl, Eric Garnier, Stefan Klotz, Ingolf Kühn
formal name: second order fine root cellulose content per secon order fine root dry mass
definition: The ratio of the mass (PATO:mass) of cellulose (Def:cellulose) in a second order fine root (McCormack:fine root) to the corresponding second order fine root mass (PATO:mass) assessed after drying.
pref unit: mass unit / mass unit

Third order fine root cellulose content per dry mass
type: Class
subclass of: Fine root cellulose content per fine root dry mass
type: NamedIndividual
type: Concept
formal name: third order fine root cellulose content perthird order fine root dry mass
alternative label: third order fine root cellulose content per dry mass
related match: PATO_0000125
in scheme: Thesaurustrait
definition: The ratio of the mass (PATO:mass) of cellulose (Def:cellulose) in a third order fine root (McCormack:fine root) to the corresponding third order fine root mass (PATO:mass) assessed after drying.
term status: stable
reference: Jens Kattge, Ulrike Stahl, Eric Garnier, Stefan Klotz, Ingolf Kühn
pref unit: mass unit / mass unit

Fourth order fine root cellulose content per dry mass
type: Class
subclass of: Fine root cellulose content per fine root dry mass
type: NamedIndividual
type: Concept
alternative label: fourth order fine root cellulose content per dry mass
related match: PATO_0000125
term status: stable
in scheme: Thesaurustrait
reference: Jens Kattge, Ulrike Stahl, Eric Garnier, Stefan Klotz, Ingolf Kühn
pref unit: mass unit / mass unit
formal name: fourth order fine root cellulose content per fourth order fine root dry mass
definition: The ratio of the mass (PATO:mass) of cellulose (Def:cellulose) in a fourth order fine root (McCormack:fine root) to the corresponding fourth order fine root mass (PATO:mass) assessed after drying.

Absorptive fine root cellulose content per dry mass
type: Class
subclass of: Fine root cellulose content per fine root dry mass
type: NamedIndividual
type: Concept
alternative label: absorptive fine root cellulose content per dry mass
reference: Jens Kattge, Ulrike Stahl, Eric Garnier, Stefan Klotz, Ingolf Kühn
related match: PATO_0000125
in scheme: Thesaurustrait
term status: stable
pref unit: mass unit / mass unit
definition: The ratio of the mass (PATO:mass) of cellulose (Def:cellulose) in an absorptive fine root (McCormack:fine root) to the corresponding absorptive fine root mass (PATO:mass) assessed after drying.
formal name: absorptive fine root cellulose content per absorptive fine root dry mass

Transport fine root cellulose content per dry mass
type: Class
subclass of: Fine root cellulose content per fine root dry mass
type: NamedIndividual
type: Concept
reference: Jens Kattge, Ulrike Stahl, Eric Garnier, Stefan Klotz, Ingolf Kühn
alternative label: transport fine root cellulose content per dry mass
term status: stable
related match: PATO_0000125
in scheme: Thesaurustrait
pref unit: mass unit / mass unit
formal name: transport fine root cellulose content per transport fine root dry mass
definition: The ratio of the mass (PATO:mass) of cellulose (Def:cellulose) in a transport fine root (McCormack:fine root) to the corresponding transport fine root mass (PATO:mass) assessed after drying.

Plant leaf lamina mass per area
type: Class
subclass of: Plant leaf mass per area trait
type: NamedIndividual
type: Concept
definition: the ratio of the whole plant leaf lamina dry mass (TOP:plant leaf lamina dry mass) to the whole plant leaf lamina area (TOP:plant leaf lamina area)
reference: Eric Garnier, Jens Kattge, Stefan Klotz, Ingolf Kühn, Ulrike Stahl
term status: stable
formal name: whole plant leaf lamina dry mass per whole plant leaf lamina area
pref unit: mass unit / area unit
in scheme: Thesaurustrait

Seed cellulose content per seed dry mass
type: Class
subclass of: Flower and dispersule trait
type: NamedIndividual
type: Concept
related match: PO_0009010
alternative label: seed cellulose content per dry mass
in scheme: Thesaurustrait
formal name: seed cellulose content per seed dry mass
term status: stable
related match: PATO_0000125
reference: Jens Kattge, Ulrike Stahl, Eric Garnier, Stefan Klotz, Ingolf Kühn
definition: The ratio of the mass (PATO:mass) of cellulose (Def:cellulose) in the seed (PO:seed) to the corresponding seed (PO:seed) mass (PATO:mass) assessed after drying
pref unit: mass unit / mass unit

Coarse woody debris cellulose content per coarse woody debris dry mass trait
type: Class
subclass of: Litter and coarse woody debris trait
type: NamedIndividual
type: Concept
definition: The ratio of the mass (PATO:mass) of cellulose (Def:cellulose) in the coarse woody debris (Def:coarse woody debris) to the corresponding coarse woody debris mass (PATO:mass) assessed after drying
reference: Jens Kattge, Ulrike Stahl, Eric Garnier, Stefan Klotz, Ingolf Kühn
related match: PATO_0000125
in scheme: Thesaurustrait
alternative label: coarse woody debris cellulose content per dry mass
alternative label: CWD cellulose content per dry mass
term status: stable
formal name: coarse woody debris cellulose content per coarse woody debris dry mass
pref unit: mass unit / mass unit

Stem coarse woody debris cellulose content per stem coarse woody debris dry mass
type: Class
subclass of: Coarse woody debris cellulose content per coarse woody debris dry mass trait
type: NamedIndividual
type: Concept
reference: Jens Kattge, Ulrike Stahl, Eric Garnier, Stefan Klotz, Ingolf Kühn
term status: stable
related match: PATO_0000125
definition: The ratio of the mass (PATO:mass) of cellulose (Def:cellulose) in the stem (PO:stem) coarse woody debris (Def:coarse woody debris) to the corresponding stem (PO:stem) coarse woody debris mass (PATO:mass) assessed after drying
in scheme: Thesaurustrait
alternative label: stem coarse woody debris cellulose content per dry mass
alternative label: stem CWD cellulose content per dry mass
formal name: stem coarse woody debris cellulose content per stem coarse woody debris dry mass
pref unit: mass unit / mass unit
related match: PO_0009047

Branch coarse woody debris cellulose content per branch coarse woody debris dry mass
type: Class
subclass of: Coarse woody debris cellulose content per coarse woody debris dry mass trait
type: NamedIndividual
type: Concept
related match: PATO_0000125
alternative label: branch coarse woody debris cellulose content per dry mass
alternative label: branch CWD cellulose content per dry mass
term status: stable
definition: The ratio of the mass (PATO:mass) of cellulose (Def:cellulose) in the branch (PO:branch) coarse woody debris (Def:coarse woody debris) to the corresponding branch (PO:branch) coarse woody debris mass (PATO:mass) assessed after drying
in scheme: Thesaurustrait
related match: PO_0025073
formal name: branch coarse woody debris cellulose content per branch coarse woody debris dry mass
pref unit: mass unit / mass unit
reference: Jens Kattge, Ulrike Stahl, Eric Garnier, Stefan Klotz, Ingolf Kühn

Litter cellulose content per litter dry mass
type: Class
subclass of: Coarse woody debris cellulose content per coarse woody debris dry mass trait
type: NamedIndividual
type: Concept
related match: PATO_0000125
in scheme: Thesaurustrait
term status: stable
reference: Jens Kattge, Ulrike Stahl, Eric Garnier, Stefan Klotz, Ingolf Kühn
pref unit: mass unit / mass unit
formal name: litter cellulose content per litter dry mass
alternative label: litter cellulose content per dry mass
definition: The ratio of the mass (PATO:mass) of cellulose (Def:cellulose) in the litter (Garnier:litter) to the corresponding litter mass (PATO:mass) assessed after drying

Plant lignin content per plant dry mass
type: Class
subclass of: Whole plant trait
type: NamedIndividual
type: Concept
pref unit: mass unit / mass unit
in scheme: Thesaurustrait
related match: CHEBI 6457
term status: stable
related match: PO_0000003
definition: The ratio of the mass (PATO:mass) of lignin (CHEBI:lignin) in the whole plant (PO:whole plant) to the corresponding whole plant (PO:whole plant) mass (PATO:mass) assessed after drying
related match: PATO_0000125
alternative label: whole plant lignin content per dry mass
formal name: whole plant lignin content per plant dry mass
reference: Jens Kattge, Ulrike Stahl, Eric Garnier, Stefan Klotz, Ingolf Kühn

Shoot lignin content per shoot dry mass
type: Class
subclass of: Shoot trait
type: NamedIndividual
type: Concept
pref unit: mass unit / mass unit
related match: PO_0009006
term status: stable
related match: CHEBI 6457
in scheme: Thesaurustrait
definition: The ratio of the mass (PATO:mass) of lignin (CHEBI:lignin) in the shoot (PO:shoot system) to the corresponding shoot (PO:shoot system) mass (PATO:mass) assessed after drying
alternative label: shoot lignin content per dry mass
related match: PATO_0000125
reference: Jens Kattge, Ulrike Stahl, Eric Garnier, Stefan Klotz, Ingolf Kühn
formal name: shoot lignin content per shoot dry mass

Branch lignin content per branch dry mass
type: Class
subclass of: Stem and branch trait
type: NamedIndividual
type: Concept
pref unit: mass unit / mass unit
formal name: branch lignin content per branch dry mass
definition: The ratio of the mass (PATO:mass) of lignin (CHEBI:lignin) in the branch (PO:branch) to the corresponding branch (PO:branch) mass (PATO:mass) assessed after drying
term status: stable
related match: CHEBI 6457
in scheme: Thesaurustrait
alternative label: branch lignin content per dry mass
related match: PATO_0000125
reference: Jens Kattge, Ulrike Stahl, Eric Garnier, Stefan Klotz, Ingolf Kühn
related match: PO_0025073

Bark lignin content per bark dry mass
type: Class
subclass of: Stem and branch trait
type: NamedIndividual
type: Concept
alternative label: bark lignin content per dry mass
formal name: bark lignin content per bark dry mass
pref unit: mass unit / mass unit
term status: stable
related match: CHEBI 6457
related match: PATO_0000125
related match: PO_0004518
in scheme: Thesaurustrait
reference: Jens Kattge, Ulrike Stahl, Eric Garnier, Stefan Klotz, Ingolf Kühn
definition: The ratio of the mass (PATO:mass) of lignin (CHEBI:lignin) in the bark (PO:bark) to the corresponding bark (PO:bark) mass (PATO:mass) assessed after drying

Stem lignin content per stem dry mass
type: Class
subclass of: Stem and branch trait
type: NamedIndividual
type: Concept
alternative label: stem lignin content per dry mass
related match: PO_0009047
pref unit: mass unit / mass unit
reference: Jens Kattge, Ulrike Stahl, Eric Garnier, Stefan Klotz, Ingolf Kühn
related match: CHEBI 6457
term status: stable
related match: PATO_0000125
in scheme: Thesaurustrait
formal name: stem lignin content per stem dry mass
definition: The ratio of the mass (PATO:mass) of lignin (CHEBI:lignin) in the stem (PO:stem) to the corresponding stem (PO:stem) mass (PATO:mass) assessed after drying

Leaf mass ratio trait
type: Class
subclass of: Whole plant trait
type: NamedIndividual
type: Concept
definition: the ratio of the whole plant leaf dry mass trait (TOP:plant leaf dry mass trait) to the whole plant dry mass (TOP:plant dry mass)
term status: stable
formal name: whole plant leaf dry mass per whole plant dry mass trait
pref unit: mass unit / mass unit
alternative label: leaf weight ratio
abbreviation: LMR
alternative label: LWR
in scheme: Thesaurustrait
reference: Eric Garnier, Jens Kattge, Stefan Klotz, Ingolf Kühn, Ulrike Stahl

Wood lignin content per wood dry mass trait
type: Class
subclass of: Stem and branch trait
type: NamedIndividual
type: Concept
definition: The ratio of the mass (PATO:mass) of lignin (CHEBI:lignin) in the wood (PO:secondary xylem) to the corresponding wood (PO:secondary xylem) mass (PATO:mass) assessed after drying
in scheme: Thesaurustrait
related match: PATO_0000125
related match: PO_0005848
term status: stable
related match: CHEBI 6457
formal name: wood lignin content per wood dry mass
pref unit: mass unit / mass unit
alternative label: wood lignin content per dry mass
reference: Jens Kattge, Ulrike Stahl, Eric Garnier, Stefan Klotz, Ingolf Kühn

Stem wood lignin content per stem wood dry mass
type: Class
subclass of: Wood lignin content per wood dry mass trait
type: NamedIndividual
type: Concept
definition: The ratio of the mass (PATO:mass) of lignin (CHEBI:lignin) in the stem wood (PO:stem, PO:secondary xylem) to the corresponding stem wood (PO:stem, PO:secondary xylem) mass (PATO:mass) assessed after drying
related match: PO_0005848
term status: stable
related match: CHEBI 6457
pref unit: mass unit / mass unit
formal name: stem wood lignin content per stem wood dry mass
related match: PO_0009047
in scheme: Thesaurustrait
related match: PATO_0000125
alternative label: stem wood lignin content per dry mass
reference: Jens Kattge, Ulrike Stahl, Eric Garnier, Stefan Klotz, Ingolf Kühn

Branch wood lignin content per branch wood dry mass
type: Class
subclass of: Wood lignin content per wood dry mass trait
type: NamedIndividual
type: Concept
alternative label: branch wood lignin content per dry mass
related match: PATO_0000125
definition: The ratio of the mass (PATO:mass) of lignin (CHEBI:lignin) in the branch wood (PO:branch, PO:secondary xylem) to the corresponding branch wood (PO:branch, PO:secondary xylem) mass (PATO:mass) assessed after drying
pref unit: mass unit / mass unit
related match: PO_0005848
term status: stable
related match: CHEBI 6457
formal name: branch wood lignin content per branch wood dry mass
reference: Jens Kattge, Ulrike Stahl, Eric Garnier, Stefan Klotz, Ingolf Kühn
in scheme: Thesaurustrait
related match: PO_0025073

Cotyledon lignin content per cotyledon dry mass
type: Class
subclass of: Leaf trait
type: NamedIndividual
type: Concept
reference: Jens Kattge, Ulrike Stahl, Eric Garnier, Stefan Klotz, Ingolf Kühn
definition: The ratio of the mass (PATO:mass) of lignin (CHEBI:lignin) in the cotyledon (PO:cotyledon) to the corresponding cotyledon (PO:cotyledon) mass (PATO:mass) assessed after drying
related match: PO_0020030
in scheme: Thesaurustrait
term status: stable
related match: PATO_0000125
related match: CHEBI 6457
pref unit: mass unit / mass unit
formal name: cotyledon lignin content per cotyledon dry mass
alternative label: cotyledon lignin content per dry mass

Leaf lignin content per leaf dry mass
type: Class
subclass of: Leaf trait
type: NamedIndividual
type: Concept
related match: PO_0020039
related match: PO_0020049
related match: CHEBI 6457
related match: PATO_0000125
pref unit: mass unit / mass unit
formal name: leaf lignin content per leaf dry mass
alternative label: leaf lignin content per dry mass
reference: Jens Kattge, Ulrike Stahl, Eric Garnier, Stefan Klotz, Ingolf Kühn
in scheme: Thesaurustrait
term status: stable
related match: PO_0025034
definition: The ratio of the mass (PATO:mass) of lignin (CHEBI:lignin) in the leaf (PO:leaf) or component thereof, i.e. leaf lamina or leaflet (PO:leaf lamina, PO:leaflet) per respective unit dry mass (TOP:leaf dry mass, TOP:leaf lamina dry mass, TOP:leaflet dry mass)

Leaf lignin content per leaf area
type: Class
subclass of: Leaf trait
type: NamedIndividual
type: Concept
related match: PO_0020039
related match: PO_0020049
related match: PO_0025034
related match: CHEBI 6457
related match: PATO_0000125
formal name: leaf lignin content per leaf area
pref unit: mass unit / mass unit
alternative label: leaf lignin content per area
term status: stable
in scheme: Thesaurustrait
reference: Jens Kattge, Ulrike Stahl, Eric Garnier, Stefan Klotz, Ingolf Kühn
definition: The ratio of the mass (PATO:mass) of lignin (CHEBI:lignin) in the leaf (PO:leaf) or component thereof, i.e. leaf lamina or leaflet (PO:leaf lamina, PO:leaflet) per respective area (TOP:leaf area, TOP:leaf lamina area, TOP:leaflet area)

Root lignin content per root dry mass trait
type: Class
subclass of: Root trait
type: NamedIndividual
type: Concept
alternative label: root lignin content per dry mass
related match: CHEBI 6457
related match: PATO_0000125
in scheme: Thesaurustrait
term status: stable
formal name: root lignin content per root dry mass
pref unit: mass unit / mass unit
reference: Jens Kattge, Ulrike Stahl, Eric Garnier, Stefan Klotz, Ingolf Kühn
related match: PO_0009005
definition: The ratio of the mass (PATO:mass) of lignin (CHEBI:lignin) in the root (PO:root) to the corresponding root mass (PATO:mass) assessed after drying

Coarse root lignin content per coarse root dry mass
type: Class
subclass of: Root lignin content per root dry mass trait
type: NamedIndividual
type: Concept
definition: The ratio of the mass (PATO:mass) of lignin (CHEBI:lignin) in the coarse root (Def:coarse root) to the corresponding coarse root mass (PATO:mass) assessed after drying
in scheme: Thesaurustrait
pref unit: mass unit / mass unit
alternative label: coarse root lignin content per dry mass
related match: PATO_0000125
related match: CHEBI 6457
term status: stable
formal name: coarse root lignin content per coarse root dry mass
reference: Jens Kattge, Ulrike Stahl, Eric Garnier, Stefan Klotz, Ingolf Kühn

Fine root lignin content per fine root dry mass
type: Class
subclass of: Root trait
subclass of: Root lignin content per root dry mass trait
type: NamedIndividual
type: Concept
definition: The ratio of the mass (PATO:mass) of lignin (CEBI:lignin) in a first order fine root (McCormack:fine root) to the corresponding first order fine root mass (PATO:mass) assessed after drying.
related match: PATO_0000125
related match: CHEBI 6457
alternative label: first oder fine root lignin content per dry mass
formal name: first order fine root lignin content per first order fine root dry mass
formal name: fine root lignin content per fine root dry mass
definition: The ratio of the mass (PATO:mass) of lignin (CHEBI:lignin) in the fine root (McCormack:fine root) to the corresponding fine root mass (PATO:mass) assessed after drying
pref unit: mass unit / mass unit
in scheme: Thesaurustrait
term status: stable
reference: Jens Kattge, Ulrike Stahl, Eric Garnier, Stefan Klotz, Ingolf Kühn
alternative label: fine root lignin content per dry mass

Fine root lignin content per fine root dry mass
type: Class
subclass of: Root trait
subclass of: Root lignin content per root dry mass trait
type: NamedIndividual
type: Concept
alternative label: first oder fine root lignin content per dry mass
related match: CHEBI 6457
related match: PATO_0000125
alternative label: fine root lignin content per dry mass
pref unit: mass unit / mass unit
definition: The ratio of the mass (PATO:mass) of lignin (CHEBI:lignin) in the fine root (McCormack:fine root) to the corresponding fine root mass (PATO:mass) assessed after drying
formal name: first order fine root lignin content per first order fine root dry mass
formal name: fine root lignin content per fine root dry mass
term status: stable
reference: Jens Kattge, Ulrike Stahl, Eric Garnier, Stefan Klotz, Ingolf Kühn
definition: The ratio of the mass (PATO:mass) of lignin (CEBI:lignin) in a first order fine root (McCormack:fine root) to the corresponding first order fine root mass (PATO:mass) assessed after drying.
in scheme: Thesaurustrait

Leaf mass ratio
type: Class
subclass of: Leaf mass ratio trait
type: NamedIndividual
type: Concept
definition: the ratio of the whole plant leaf dry mass (TOP:plant leaf dry mass) to the whole plant dry mass (TOP:plant dry mass)
pref unit: mass unit / mass unit
formal name: whole plant leaf dry mass per whole plant dry mass
term status: stable
in scheme: Thesaurustrait
reference: Eric Garnier, Jens Kattge, Stefan Klotz, Ingolf Kühn, Ulrike Stahl

Second order fine root lignin content per per dry mass
type: Class
subclass of: Fine root lignin content per fine root dry mass
type: NamedIndividual
type: Concept
definition: The ratio of the mass (PATO:mass) of lignin (CEBI:lignin) in a second order fine root (McCormack:fine root) to the corresponding second order fine root mass (PATO:mass) assessed after drying.
in scheme: Thesaurustrait
term status: stable
related match: PATO_0000125
reference: Jens Kattge, Ulrike Stahl, Eric Garnier, Stefan Klotz, Ingolf Kühn
formal name: second order fine root lignin content per secon order fine root dry mass
pref unit: mass unit / mass unit
alternative label: second order fine root lignin content per dry mass

Third order fine root lignin content per dry mass
type: Class
subclass of: Fine root lignin content per fine root dry mass
type: NamedIndividual
type: Concept
definition: The ratio of the mass (PATO:mass) of lignin (CEBI:lignin) in a third order fine root (McCormack:fine root) to the corresponding third order fine root mass (PATO:mass) assessed after drying.
in scheme: Thesaurustrait
related match: PATO_0000125
term status: stable
formal name: third order fine root lignin content perthird order fine root dry mass
reference: Jens Kattge, Ulrike Stahl, Eric Garnier, Stefan Klotz, Ingolf Kühn
alternative label: third order fine root lignin content per dry mass
pref unit: mass unit / mass unit

Fourth order fine root lignin content per dry mass
type: Class
subclass of: Fine root lignin content per fine root dry mass
type: NamedIndividual
type: Concept
alternative label: fourth order fine root lignin content per dry mass
definition: The ratio of the mass (PATO:mass) of lignin (CEBI:lignin) in a fourth order fine root (McCormack:fine root) to the corresponding fourth order fine root mass (PATO:mass) assessed after drying.
related match: PATO_0000125
term status: stable
in scheme: Thesaurustrait
reference: Jens Kattge, Ulrike Stahl, Eric Garnier, Stefan Klotz, Ingolf Kühn
pref unit: mass unit / mass unit
formal name: fourth order fine root lignin content per fourth order fine root dry mass

Absorptive fine root lignin content per dry mass
type: Class
subclass of: Fine root lignin content per fine root dry mass
type: NamedIndividual
type: Concept
formal name: absorptive fine root lignin content per absorptive fine root dry mass
reference: Jens Kattge, Ulrike Stahl, Eric Garnier, Stefan Klotz, Ingolf Kühn
definition: The ratio of the mass (PATO:mass) of lignin (CEBI:lignin) in an absorptive fine root (McCormack:fine root) to the corresponding absorptive fine root mass (PATO:mass) assessed after drying.
related match: PATO_0000125
term status: stable
in scheme: Thesaurustrait
pref unit: mass unit / mass unit
alternative label: absorptive fine root lignin content per dry mass

Transport fine root lignin content per dry mass
type: Class
subclass of: Fine root lignin content per fine root dry mass
type: NamedIndividual
type: Concept
reference: Jens Kattge, Ulrike Stahl, Eric Garnier, Stefan Klotz, Ingolf Kühn
alternative label: transport fine root lignin content per dry mass
definition: The ratio of the mass (PATO:mass) of lignin (CEBI:lignin) in a transport fine root (McCormack:fine root) to the corresponding transport fine root mass (PATO:mass) assessed after drying.
term status: stable
related match: PATO_0000125
in scheme: Thesaurustrait
pref unit: mass unit / mass unit
formal name: transport fine root lignin content per transport fine root dry mass

Seed lignin content per seed dry mass
type: Class
subclass of: Flower and dispersule trait
type: NamedIndividual
type: Concept
related match: PO_0009010
reference: Jens Kattge, Ulrike Stahl, Eric Garnier, Stefan Klotz, Ingolf Kühn
related match: PATO_0000125
term status: stable
in scheme: Thesaurustrait
alternative label: seed lignin content per dry mass
related match: CHEBI 6457
formal name: seed lignin content per seed dry mass
definition: The ratio of the mass (PATO:mass) of lignin (CHEBI:lignin) in the seed (PO:seed) to the corresponding seed (PO:seed) mass (PATO:mass) assessed after drying
pref unit: mass unit / mass unit

Coarse woody debris lignin content per coarse woody debris dry mass trait
type: Class
subclass of: Litter and coarse woody debris trait
type: NamedIndividual
type: Concept
alternative label: coarse woody debris lignin content per dry mass
alternative label: CWD lignin content per dry mass
reference: Jens Kattge, Ulrike Stahl, Eric Garnier, Stefan Klotz, Ingolf Kühn
in scheme: Thesaurustrait
related match: PATO_0000125
related match: CHEBI 6457
term status: stable
definition: The ratio of the mass (PATO:mass) of lignin (CHEBI:lignin) in the coarse woody debris (Def:coarse woody debris) to the corresponding coarse woody debris mass (PATO:mass) assessed after drying
pref unit: mass unit / mass unit
formal name: coarse woody debris lignin content per coarse woody debris dry mass

Stem coarse woody debris lignin content per stem coarse woody debris dry mass
type: Class
subclass of: Coarse woody debris lignin content per coarse woody debris dry mass trait
type: NamedIndividual
type: Concept
in scheme: Thesaurustrait
pref unit: mass unit / mass unit
reference: Jens Kattge, Ulrike Stahl, Eric Garnier, Stefan Klotz, Ingolf Kühn
term status: stable
definition: The ratio of the mass (PATO:mass) of lignin (CHEBI:lignin) in the stem (PO:stem) coarse woody debris (Def:coarse woody debris) to the corresponding stem (PO:stem) coarse woody debris mass (PATO:mass) assessed after drying
alternative label: stem coarse woody debris lignin content per dry mass
formal name: stem coarse woody debris lignin content per stem coarse woody debris dry mass
related match: PATO_0000125
related match: CHEBI 6457
alternative label: stem CWD lignin content per dry mass
related match: PO_0009047

Branch coarse woody debris lignin content per branch coarse woody debris dry mass
type: Class
subclass of: Coarse woody debris lignin content per coarse woody debris dry mass trait
type: NamedIndividual
type: Concept
alternative label: branch coarse woody debris lignin content per dry mass
term status: stable
in scheme: Thesaurustrait
reference: Jens Kattge, Ulrike Stahl, Eric Garnier, Stefan Klotz, Ingolf Kühn
definition: The ratio of the mass (PATO:mass) of lignin (CHEBI:lignin) in the branch (PO:branch) coarse woody debris (Def:coarse woody debris) to the corresponding branch (PO:branch) coarse woody debris mass (PATO:mass) assessed after drying
pref unit: mass unit / mass unit
related match: PO_0025073
related match: PATO_0000125
alternative label: branch CWD lignin content per dry mass
related match: CHEBI 6457
formal name: branch coarse woody debris lignin content per branch coarse woody debris dry mass

Litter lignin content per litter dry mass
type: Class
subclass of: Coarse woody debris lignin content per coarse woody debris dry mass trait
type: NamedIndividual
type: Concept
formal name: litter lignin content per litter dry mass
pref unit: mass unit / mass unit
term status: stable
in scheme: Thesaurustrait
related match: CHEBI 6457
related match: PATO_0000125
definition: The ratio of the mass (PATO:mass) of lignin (CHEBI:lignin) in the litter (Garnier:litter) to the corresponding litter mass (PATO:mass) assessed after drying
reference: Jens Kattge, Ulrike Stahl, Eric Garnier, Stefan Klotz, Ingolf Kühn
alternative label: litter lignin content per dry mass

Leaf lamina mass ratio
type: Class
subclass of: Leaf mass ratio trait
type: NamedIndividual
type: Concept
formal name: whole plant leaf lamina dry mass per whole plant dry mass
pref unit: mass unit / mass unit
definition: the ratio of the whole plant leaf lamina dry mass (TOP:plant leaf lamina dry mass) to the whole plant dry mass (TOP:plant dry mass)
term status: stable
reference: Eric Garnier, Jens Kattge, Stefan Klotz, Ingolf Kühn, Ulrike Stahl
in scheme: Thesaurustrait

Plant lipid content per plant dry mass
type: Class
subclass of: Whole plant trait
type: NamedIndividual
type: Concept
pref unit: mass unit / mass unit
in scheme: Thesaurustrait
term status: stable
related match: PO_0000003
related match: PATO_0000125
related match: CHEBI_18059
reference: Jens Kattge, Ulrike Stahl, Eric Garnier, Stefan Klotz, Ingolf Kühn
formal name: whole plant lipid content per plant dry mass
definition: The ratio of the mass (PATO:mass) of lipid (CHEBI:lipid) in the whole plant (PO:whole plant) to the corresponding whole plant (PO:whole plant) mass (PATO:mass) assessed after drying
alternative label: whole plant lipid content per dry mass

Shoot lipid content per shoot dry mass
type: Class
subclass of: Shoot trait
type: NamedIndividual
type: Concept
pref unit: mass unit / mass unit
related match: PO_0009006
in scheme: Thesaurustrait
term status: stable
related match: PATO_0000125
related match: CHEBI_18059
reference: Jens Kattge, Ulrike Stahl, Eric Garnier, Stefan Klotz, Ingolf Kühn
alternative label: shoot lipid content per dry mass
definition: The ratio of the mass (PATO:mass) of lipid (CHEBI:lipid) in the shoot (PO:shoot system) to the corresponding shoot (PO:shoot system) mass (PATO:mass) assessed after drying
formal name: shoot lipid content per shoot dry mass

Branch lipid content per branch dry mass
type: Class
subclass of: Stem and branch trait
type: NamedIndividual
type: Concept
pref unit: mass unit / mass unit
in scheme: Thesaurustrait
term status: stable
related match: PATO_0000125
reference: Jens Kattge, Ulrike Stahl, Eric Garnier, Stefan Klotz, Ingolf Kühn
related match: CHEBI_18059
formal name: branch lipid content per branch dry mass
definition: The ratio of the mass (PATO:mass) of lipid (CHEBI:lipid) in the branch (PO:branch) to the corresponding branch (PO:branch) mass (PATO:mass) assessed after drying
alternative label: branch lipid content per dry mass
related match: PO_0025073

Bark lipid content per bark dry mass
type: Class
subclass of: Stem and branch trait
type: NamedIndividual
type: Concept
pref unit: mass unit / mass unit
related match: CHEBI_18059
definition: The ratio of the mass (PATO:mass) of lipid (CHEBI:lipid) in the bark (PO:bark) to the corresponding bark (PO:bark) mass (PATO:mass) assessed after drying
formal name: bark lipid content per bark dry mass
related match: PATO_0000125
term status: stable
related match: PO_0004518
in scheme: Thesaurustrait
reference: Jens Kattge, Ulrike Stahl, Eric Garnier, Stefan Klotz, Ingolf Kühn
alternative label: bark lipid content per dry mass

Stem lipid content per stem dry mass
type: Class
subclass of: Stem and branch trait
type: NamedIndividual
type: Concept
related match: CHEBI_18059
related match: PO_0009047
pref unit: mass unit / mass unit
reference: Jens Kattge, Ulrike Stahl, Eric Garnier, Stefan Klotz, Ingolf Kühn
formal name: stem lipid content per stem dry mass
definition: The ratio of the mass (PATO:mass) of lipid (CHEBI:lipid) in the stem (PO:stem) to the corresponding stem (PO:stem) mass (PATO:mass) assessed after drying
term status: stable
related match: PATO_0000125
alternative label: stem lipid content per dry mass
in scheme: Thesaurustrait

Wood lipid content per wood dry mass trait
type: Class
subclass of: Stem and branch trait
type: NamedIndividual
type: Concept
related match: CHEBI_18059
definition: The ratio of the mass (PATO:mass) of lipid (CHEBI:lipid) in the wood (PO:secondary xylem) to the corresponding wood (PO:secondary xylem) mass (PATO:mass) assessed after drying
reference: Jens Kattge, Ulrike Stahl, Eric Garnier, Stefan Klotz, Ingolf Kühn
formal name: wood lipid content per wood dry mass
alternative label: wood lipid content per dry mass
term status: stable
related match: PATO_0000125
related match: PO_0005848
pref unit: mass unit / mass unit
in scheme: Thesaurustrait

Stem wood lipid content per stem wood dry mass
type: Class
subclass of: Wood lipid content per wood dry mass trait
type: NamedIndividual
type: Concept
related match: PO_0009047
definition: The ratio of the mass (PATO:mass) of lipid (CHEBI:lipid) in the stem wood (PO:stem, PO:secondary xylem) to the corresponding stem wood (PO:stem, PO:secondary xylem) mass (PATO:mass) assessed after drying
related match: PATO_0000125
related match: PO_0005848
pref unit: mass unit / mass unit
alternative label: stem wood lipid content per dry mass
related match: CHEBI_18059
formal name: stem wood lipid content per stem wood dry mass
term status: stable
reference: Jens Kattge, Ulrike Stahl, Eric Garnier, Stefan Klotz, Ingolf Kühn
in scheme: Thesaurustrait

Branch wood lipid content per branch wood dry mass
type: Class
subclass of: Wood lipid content per wood dry mass trait
type: NamedIndividual
type: Concept
formal name: branch wood lipid content per branch wood dry mass
alternative label: branch wood lipid content per dry mass
related match: PO_0005848
definition: The ratio of the mass (PATO:mass) of lipid (CHEBI:lipid) in the branch wood (PO:branch, PO:secondary xylem) to the corresponding branch wood (PO:branch, PO:secondary xylem) mass (PATO:mass) assessed after drying
related match: PATO_0000125
pref unit: mass unit / mass unit
reference: Jens Kattge, Ulrike Stahl, Eric Garnier, Stefan Klotz, Ingolf Kühn
related match: CHEBI_18059
term status: stable
in scheme: Thesaurustrait
related match: PO_0025073

Cotyledon lipid content per cotyledon dry mass
type: Class
subclass of: Leaf trait
type: NamedIndividual
type: Concept
related match: PATO_0000125
term status: stable
pref unit: mass unit / mass unit
reference: Jens Kattge, Ulrike Stahl, Eric Garnier, Stefan Klotz, Ingolf Kühn
in scheme: Thesaurustrait
alternative label: cotyledon lipid content per dry mass
related match: CHEBI_18059
formal name: cotyledon lipid content per cotyledon dry mass
related match: PO_0020030
definition: The ratio of the mass (PATO:mass) of lipid (CHEBI:lipid) in the cotyledon (PO:cotyledon) to the corresponding cotyledon (PO:cotyledon) mass (PATO:mass) assessed after drying

Leaf lipid content per leaf dry mass
type: Class
subclass of: Leaf trait
type: NamedIndividual
type: Concept
related match: PO_0020039
related match: PATO_0000125
formal name: leaf lipid content per leaf dry mass
related match: PO_0025034
related match: PO_0020049
definition: The ratio of the mass (PATO:mass) of lipid (CHEBI:lipid) in the leaf (PO:leaf) or component thereof, i.e. leaf lamina or leaflet (PO:leaf lamina, PO:leaflet) per respective unit dry mass (TOP:leaf dry mass, TOP:leaf lamina dry mass, TOP:leaflet dry mass)
term status: stable
pref unit: mass unit / mass unit
alternative label: leaf lipid content per dry mass
reference: Jens Kattge, Ulrike Stahl, Eric Garnier, Stefan Klotz, Ingolf Kühn
related match: CHEBI_18059
in scheme: Thesaurustrait

Leaf area ratio trait
type: Class
subclass of: Whole plant trait
type: NamedIndividual
type: Concept
pref unit: area unit / mass unit
abbreviation: LAR
definition: the ratio of the whole plant leaf area trait (TOP:plant leaf area trait) to the whole plant dry mass (TOP:plant dry mass)
formal name: whole plant leaf area per whole plant dry mass trait
in scheme: Thesaurustrait
term status: stable
reference: Eric Garnier, Jens Kattge, Stefan Klotz, Ingolf Kühn, Ulrike Stahl

Leaf lipid content per leaf area
type: Class
subclass of: Leaf trait
type: NamedIndividual
type: Concept
definition: The ratio of the mass (PATO:mass) of lipid (CHEBI:lipid) in the leaf (PO:leaf) or component thereof, i.e. leaf lamina or leaflet (PO:leaf lamina, PO:leaflet) per respective area (TOP:leaf area, TOP:leaf lamina area, TOP:leaflet area)
formal name: leaf lipid content per leaf area
related match: PO_0020039
related match: PO_0020049
related match: PO_0025034
related match: PATO_0000125
alternative label: leaf lipid content per area
term status: stable
in scheme: Thesaurustrait
reference: Jens Kattge, Ulrike Stahl, Eric Garnier, Stefan Klotz, Ingolf Kühn
related match: CHEBI_18059
pref unit: mass unit / mass unit

Root lipid content per root dry mass trait
type: Class
subclass of: Root trait
type: NamedIndividual
type: Concept
related match: PATO_0000125
term status: stable
in scheme: Thesaurustrait
pref unit: mass unit / mass unit
reference: Jens Kattge, Ulrike Stahl, Eric Garnier, Stefan Klotz, Ingolf Kühn
formal name: root lipid content per root dry mass
definition: The ratio of the mass (PATO:mass) of lipid (CHEBI:lipid) in the root (PO:root) to the corresponding root mass (PATO:mass) assessed after drying
alternative label: root lipid content per dry mass
related match: CHEBI_18059
related match: PO_0009005

Coarse root lipid content per coarse root dry mass
type: Class
subclass of: Root lipid content per root dry mass trait
type: NamedIndividual
type: Concept
pref unit: mass unit / mass unit
in scheme: Thesaurustrait
related match: PATO_0000125
term status: stable
formal name: coarse root lipid content per coarse root dry mass
definition: The ratio of the mass (PATO:mass) of lipid (CHEBI:lipid) in the coarse root (Def:coarse root) to the corresponding coarse root mass (PATO:mass) assessed after drying
reference: Jens Kattge, Ulrike Stahl, Eric Garnier, Stefan Klotz, Ingolf Kühn
related match: CHEBI_18059
alternative label: coarse root lipid content per dry mass

Fine root lipid content per fine root dry mass
type: Class
subclass of: Root trait
subclass of: Root lipid content per root dry mass trait
type: NamedIndividual
type: Concept
definition: The ratio of the mass (PATO:mass) of lipid (CHEBI:lipid) in a first order fine root (McCormack:fine root) to the corresponding first order fine root mass (PATO:mass) assessed after drying.
formal name: fine root lipid content per fine root dry mass
alternative label: fine root lipid content per dry mass
related match: PATO_0000125
reference: Jens Kattge, Ulrike Stahl, Eric Garnier, Stefan Klotz, Ingolf Kühn
related match: CHEBI_18059
formal name: first order fine root lipid content per first order fine root dry mass
pref unit: mass unit / mass unit
in scheme: Thesaurustrait
alternative label: first oder fine root lipid content per dry mass
definition: The ratio of the mass (PATO:mass) of lipid (CHEBI:lipid) in the fine root (McCormack:fine root) to the corresponding fine root mass (PATO:mass) assessed after drying
term status: stable

Fine root lipid content per fine root dry mass
type: Class
subclass of: Root trait
subclass of: Root lipid content per root dry mass trait
type: NamedIndividual
type: Concept
formal name: first order fine root lipid content per first order fine root dry mass
related match: PATO_0000125
reference: Jens Kattge, Ulrike Stahl, Eric Garnier, Stefan Klotz, Ingolf Kühn
related match: CHEBI_18059
alternative label: first oder fine root lipid content per dry mass
in scheme: Thesaurustrait
formal name: fine root lipid content per fine root dry mass
definition: The ratio of the mass (PATO:mass) of lipid (CHEBI:lipid) in a first order fine root (McCormack:fine root) to the corresponding first order fine root mass (PATO:mass) assessed after drying.
pref unit: mass unit / mass unit
term status: stable
definition: The ratio of the mass (PATO:mass) of lipid (CHEBI:lipid) in the fine root (McCormack:fine root) to the corresponding fine root mass (PATO:mass) assessed after drying
alternative label: fine root lipid content per dry mass

Second order fine root lipid content per per dry mass
type: Class
subclass of: Fine root lipid content per fine root dry mass
type: NamedIndividual
type: Concept
definition: The ratio of the mass (PATO:mass) of lipid (CHEBI:lipid) in a second order fine root (McCormack:fine root) to the corresponding second order fine root mass (PATO:mass) assessed after drying.
pref unit: mass unit / mass unit
term status: stable
reference: Jens Kattge, Ulrike Stahl, Eric Garnier, Stefan Klotz, Ingolf Kühn
in scheme: Thesaurustrait
related match: PATO_0000125
alternative label: second order fine root lipid content per dry mass
related match: CHEBI_18059
formal name: second order fine root lipid content per secon order fine root dry mass

Third order fine root lipid content per dry mass
type: Class
subclass of: Fine root lipid content per fine root dry mass
type: NamedIndividual
type: Concept
pref unit: mass unit / mass unit
alternative label: third order fine root lipid content per dry mass
reference: Jens Kattge, Ulrike Stahl, Eric Garnier, Stefan Klotz, Ingolf Kühn
formal name: third order fine root lipid content perthird order fine root dry mass
related match: PATO_0000125
term status: stable
in scheme: Thesaurustrait
definition: The ratio of the mass (PATO:mass) of lipid (CHEBI:lipid) in a third order fine root (McCormack:fine root) to the corresponding third order fine root mass (PATO:mass) assessed after drying.
related match: CHEBI_18059

Fourth order fine root lipid content per dry mass
type: Class
subclass of: Fine root lipid content per fine root dry mass
type: NamedIndividual
type: Concept
alternative label: fourth order fine root lipid content per dry mass
pref unit: mass unit / mass unit
formal name: fourth order fine root lipid content per fourth order fine root dry mass
reference: Jens Kattge, Ulrike Stahl, Eric Garnier, Stefan Klotz, Ingolf Kühn
in scheme: Thesaurustrait
term status: stable
related match: PATO_0000125
definition: The ratio of the mass (PATO:mass) of lipid (CHEBI:lipid) in a fourth order fine root (McCormack:fine root) to the corresponding fourth order fine root mass (PATO:mass) assessed after drying.
related match: CHEBI_18059

Absorptive fine root lipid content per dry mass
type: Class
subclass of: Fine root lipid content per fine root dry mass
type: NamedIndividual
type: Concept
related match: CHEBI_18059
formal name: absorptive fine root lipid content per absorptive fine root dry mass
reference: Jens Kattge, Ulrike Stahl, Eric Garnier, Stefan Klotz, Ingolf Kühn
pref unit: mass unit / mass unit
alternative label: absorptive fine root lipid content per dry mass
term status: stable
related match: PATO_0000125
in scheme: Thesaurustrait
definition: The ratio of the mass (PATO:mass) of lipid (CHEBI:lipid) in an absorptive fine root (McCormack:fine root) to the corresponding absorptive fine root mass (PATO:mass) assessed after drying.

Transport fine root lipid content per dry mass
type: Class
subclass of: Fine root lipid content per fine root dry mass
type: NamedIndividual
type: Concept
reference: Jens Kattge, Ulrike Stahl, Eric Garnier, Stefan Klotz, Ingolf Kühn
alternative label: transport fine root lipid content per dry mass
term status: stable
pref unit: mass unit / mass unit
definition: The ratio of the mass (PATO:mass) of lipid (CHEBI:lipid) in a transport fine root (McCormack:fine root) to the corresponding transport fine root mass (PATO:mass) assessed after drying.
related match: PATO_0000125
in scheme: Thesaurustrait
related match: CHEBI_18059
formal name: transport fine root lipid content per transport fine root dry mass

Leaf area ratio
type: Class
subclass of: Leaf area ratio trait
type: NamedIndividual
type: Concept
definition: the ratio of the whole plant leaf area (TOP:plant leaf area) to the whole plant dry mass (TOP:plant dry mass)
formal name: whole plant leaf area per whole plant dry mass
in scheme: Thesaurustrait
reference: Eric Garnier, Jens Kattge, Stefan Klotz, Ingolf Kühn, Ulrike Stahl
term status: stable
pref unit: area unit / mass unit

Seed lipid content per seed dry mass
type: Class
subclass of: Flower and dispersule trait
type: NamedIndividual
type: Concept
reference: Jens Kattge, Ulrike Stahl, Eric Garnier, Stefan Klotz, Ingolf Kühn
related match: PO_0009010
formal name: seed lipid content per seed dry mass
definition: The ratio of the mass (PATO:mass) of lipid (CHEBI:lipid) in the seed (PO:seed) to the corresponding seed (PO:seed) mass (PATO:mass) assessed after drying
related match: CHEBI_18059
term status: stable
in scheme: Thesaurustrait
related match: PATO_0000125
pref unit: mass unit / mass unit
alternative label: seed lipid content per dry mass

Coarse woody debris lipid content per coarse woody debris dry mass trait
type: Class
subclass of: Litter and coarse woody debris trait
type: NamedIndividual
type: Concept
definition: The ratio of the mass (PATO:mass) of lipid (CHEBI:lipid) in the coarse woody debris (Def:coarse woody debris) to the corresponding coarse woody debris mass (PATO:mass) assessed after drying
reference: Jens Kattge, Ulrike Stahl, Eric Garnier, Stefan Klotz, Ingolf Kühn
related match: CHEBI_18059
in scheme: Thesaurustrait
alternative label: CWD lipid content per dry mass
alternative label: coarse woody debris lipid content per dry mass
related match: PATO_0000125
term status: stable
pref unit: mass unit / mass unit
formal name: coarse woody debris lipid content per coarse woody debris dry mass

Stem coarse woody debris lipid content per stem coarse woody debris dry mass
type: Class
subclass of: Coarse woody debris lipid content per coarse woody debris dry mass trait
type: NamedIndividual
type: Concept
in scheme: Thesaurustrait
alternative label: stem CWD lipid content per dry mass
pref unit: mass unit / mass unit
reference: Jens Kattge, Ulrike Stahl, Eric Garnier, Stefan Klotz, Ingolf Kühn
term status: stable
related match: PO_0009047
related match: PATO_0000125
alternative label: stem coarse woody debris lipid content per dry mass
formal name: stem coarse woody debris lipid content per stem coarse woody debris dry mass
related match: CHEBI_18059
definition: The ratio of the mass (PATO:mass) of lipid (CHEBI:lipid) in the stem (PO:stem) coarse woody debris (Def:coarse woody debris) to the corresponding stem (PO:stem) coarse woody debris mass (PATO:mass) assessed after drying

Branch coarse woody debris lipid content per branch coarse woody debris dry mass
type: Class
subclass of: Coarse woody debris lipid content per coarse woody debris dry mass trait
type: NamedIndividual
type: Concept
term status: stable
in scheme: Thesaurustrait
reference: Jens Kattge, Ulrike Stahl, Eric Garnier, Stefan Klotz, Ingolf Kühn
pref unit: mass unit / mass unit
alternative label: branch coarse woody debris lipid content per dry mass
related match: PATO_0000125
formal name: branch coarse woody debris lipid content per branch coarse woody debris dry mass
related match: PO_0025073
related match: CHEBI_18059
alternative label: branch CWD lipid content per dry mass
definition: The ratio of the mass (PATO:mass) of lipid (CHEBI:lipid) in the branch (PO:branch) coarse woody debris (Def:coarse woody debris) to the corresponding branch (PO:branch) coarse woody debris mass (PATO:mass) assessed after drying

Litter lipid content per litter dry mass
type: Class
subclass of: Coarse woody debris lipid content per coarse woody debris dry mass trait
type: NamedIndividual
type: Concept
term status: stable
in scheme: Thesaurustrait
pref unit: mass unit / mass unit
related match: PATO_0000125
alternative label: litter lipid content per dry mass
reference: Jens Kattge, Ulrike Stahl, Eric Garnier, Stefan Klotz, Ingolf Kühn
formal name: litter lipid content per litter dry mass
related match: CHEBI_18059
definition: The ratio of the mass (PATO:mass) of lipid (CHEBI:lipid) in the litter (Garnier:litter) to the corresponding litter mass (PATO:mass) assessed after drying

Plant hemicellulose content per plant dry mass
type: Class
subclass of: Whole plant trait
type: NamedIndividual
type: Concept
pref unit: mass unit / mass unit
formal name: whole plant hemicellulose content per plant dry mass
alternative label: whole plant hemicellulose content per dry mass
related match: PATO_0000125
definition: The ratio of the mass (PATO:mass) of hemicellulose (CHEBI:hemicellulose) in the whole plant (PO:whole plant) to the corresponding whole plant (PO:whole plant) mass (PATO:mass) assessed after drying
term status: stable
reference: Jens Kattge, Ulrike Stahl, Eric Garnier, Stefan Klotz, Ingolf Kühn
related match: CHEBI_61266
in scheme: Thesaurustrait
related match: PO_0000003

Shoot hemicellulose content per shoot dry mass
type: Class
subclass of: Shoot trait
type: NamedIndividual
type: Concept
formal name: shoot hemicellulose content per shoot dry mass
related match: PO_0009006
alternative label: shoot hemicellulose content per dry mass
term status: stable
definition: The ratio of the mass (PATO:mass) of hemicellulose (CHEBI:hemicellulose) in the shoot (PO:shoot system) to the corresponding shoot (PO:shoot system) mass (PATO:mass) assessed after drying
pref unit: mass unit / mass unit
reference: Jens Kattge, Ulrike Stahl, Eric Garnier, Stefan Klotz, Ingolf Kühn
related match: PATO_0000125
in scheme: Thesaurustrait
related match: CHEBI_61266

Branch hemicellulose content per branch dry mass
type: Class
subclass of: Stem and branch trait
type: NamedIndividual
type: Concept
alternative label: branch hemicellulose content per dry mass
related match: PO_0025073
definition: The ratio of the mass (PATO:mass) of hemicellulose (CHEBI:hemicellulose) in the branch (PO:branch) to the corresponding branch (PO:branch) mass (PATO:mass) assessed after drying
reference: Jens Kattge, Ulrike Stahl, Eric Garnier, Stefan Klotz, Ingolf Kühn
pref unit: mass unit / mass unit
formal name: branch hemicellulose content per branch dry mass
related match: PATO_0000125
term status: stable
related match: CHEBI_61266
in scheme: Thesaurustrait

Bark hemicellulose content per bark dry mass
type: Class
subclass of: Stem and branch trait
type: NamedIndividual
type: Concept
related match: CHEBI_61266
pref unit: mass unit / mass unit
formal name: bark hemicellulose content per bark dry mass
reference: Jens Kattge, Ulrike Stahl, Eric Garnier, Stefan Klotz, Ingolf Kühn
definition: The ratio of the mass (PATO:mass) of hemicellulose (CHEBI:hemicellulose) in the bark (PO:bark) to the corresponding bark (PO:bark) mass (PATO:mass) assessed after drying
related match: PATO_0000125
alternative label: bark hemicellulose content per dry mass
related match: PO_0004518
term status: stable
in scheme: Thesaurustrait

Stem hemicellulose content per stem dry mass
type: Class
subclass of: Stem and branch trait
type: NamedIndividual
type: Concept
definition: The ratio of the mass (PATO:mass) of hemicellulose (CHEBI:hemicellulose) in the stem (PO:stem) to the corresponding stem (PO:stem) mass (PATO:mass) assessed after drying
formal name: stem hemicellulose content per stem dry mass
related match: CHEBI_61266
reference: Jens Kattge, Ulrike Stahl, Eric Garnier, Stefan Klotz, Ingolf Kühn
pref unit: mass unit / mass unit
related match: PO_0009047
related match: PATO_0000125
term status: stable
alternative label: stem hemicellulose content per dry mass
in scheme: Thesaurustrait

Leaf lamina area ratio
type: Class
subclass of: Leaf area ratio trait
type: NamedIndividual
type: Concept
definition: the ratio of the whole plant leaf lamina area (TOP:plant leaf lamina area) to the whole plant dry mass (TOP:plant dry mass)
formal name: whole plant leaf lamina area per whole plant dry mass
reference: Eric Garnier, Jens Kattge, Stefan Klotz, Ingolf Kühn, Ulrike Stahl
in scheme: Thesaurustrait
pref unit: area unit / mass unit
term status: stable

Wood hemicellulose content per wood dry mass trait
type: Class
subclass of: Stem and branch trait
type: NamedIndividual
type: Concept
definition: The ratio of the mass (PATO:mass) of hemicellulose (CHEBI:hemicellulose) in the wood (PO:secondary xylem) to the corresponding wood (PO:secondary xylem) mass (PATO:mass) assessed after drying
reference: Jens Kattge, Ulrike Stahl, Eric Garnier, Stefan Klotz, Ingolf Kühn
alternative label: wood hemicellulose content per dry mass
term status: stable
formal name: wood hemicellulose content per wood dry mass
related match: PO_0005848
related match: PATO_0000125
pref unit: mass unit / mass unit
in scheme: Thesaurustrait
related match: CHEBI_61266

Stem wood hemicellulose content per stem wood dry mass
type: Class
subclass of: Wood hemicellulose content per wood dry mass trait
type: NamedIndividual
type: Concept
related match: CHEBI_61266
related match: PO_0009047
definition: The ratio of the mass (PATO:mass) of hemicellulose (CHEBI:hemicellulose) in the stem wood (PO:stem, PO:secondary xylem) to the corresponding stem wood (PO:stem, PO:secondary xylem) mass (PATO:mass) assessed after drying
related match: PATO_0000125
related match: PO_0005848
in scheme: Thesaurustrait
formal name: stem wood hemicellulose content per stem wood dry mass
term status: stable
reference: Jens Kattge, Ulrike Stahl, Eric Garnier, Stefan Klotz, Ingolf Kühn
pref unit: mass unit / mass unit
alternative label: stem wood hemicellulose content per dry mass

Branch wood hemicellulose content per branch wood dry mass
type: Class
subclass of: Wood hemicellulose content per wood dry mass trait
type: NamedIndividual
type: Concept
formal name: branch wood hemicellulose content per branch wood dry mass
alternative label: branch wood hemicellulose content per dry mass
definition: The ratio of the mass (PATO:mass) of hemicellulose (CHEBI:hemicellulose) in the branch wood (PO:branch, PO:secondary xylem) to the corresponding branch wood (PO:branch, PO:secondary xylem) mass (PATO:mass) assessed after drying
related match: PO_0005848
related match: PATO_0000125
in scheme: Thesaurustrait
related match: PO_0025073
related match: CHEBI_61266
reference: Jens Kattge, Ulrike Stahl, Eric Garnier, Stefan Klotz, Ingolf Kühn
term status: stable
pref unit: mass unit / mass unit

Cotyledon hemicellulose content per cotyledon dry mass
type: Class
subclass of: Leaf trait
type: NamedIndividual
type: Concept
formal name: cotyledon hemicellulose content per cotyledon dry mass
alternative label: cotyledon hemicellulose content per dry mass
related match: PATO_0000125
term status: stable
pref unit: mass unit / mass unit
reference: Jens Kattge, Ulrike Stahl, Eric Garnier, Stefan Klotz, Ingolf Kühn
related match: CHEBI_61266
in scheme: Thesaurustrait
related match: PO_0020030
definition: The ratio of the mass (PATO:mass) of hemicellulose (CHEBI:hemicellulose) in the cotyledon (PO:cotyledon) to the corresponding cotyledon (PO:cotyledon) mass (PATO:mass) assessed after drying

Leaf hemicellulose content per leaf dry mass
type: Class
subclass of: Leaf trait
type: NamedIndividual
type: Concept
related match: PO_0020039
related match: PATO_0000125
related match: PO_0025034
formal name: leaf hemicellulose content per leaf dry mass
related match: PO_0020049
related match: CHEBI_61266
in scheme: Thesaurustrait
definition: The ratio of the mass (PATO:mass) of hemicellulose (CHEBI:hemicellulose) in the leaf (PO:leaf) or component thereof, i.e. leaf lamina or leaflet (PO:leaf lamina, PO:leaflet) per respective unit dry mass (TOP:leaf dry mass, TOP:leaf lamina dry mass, TOP:leaflet dry mass)
term status: stable
pref unit: mass unit / mass unit
alternative label: leaf hemicellulose content per dry mass
reference: Jens Kattge, Ulrike Stahl, Eric Garnier, Stefan Klotz, Ingolf Kühn

Leaf hemicellulose content per leaf area
type: Class
subclass of: Leaf trait
type: NamedIndividual
type: Concept
related match: PATO_0000125
formal name: leaf hemicellulose content per leaf area
related match: PO_0020049
related match: PO_0020039
definition: The ratio of the mass (PATO:mass) of hemicellulose (CHEBI:hemicellulose) in the leaf (PO:leaf) or component thereof, i.e. leaf lamina or leaflet (PO:leaf lamina, PO:leaflet) per respective area (TOP:leaf area, TOP:leaf lamina area, TOP:leaflet area)
related match: PO_0025034
related match: CHEBI_61266
term status: stable
in scheme: Thesaurustrait
alternative label: leaf hemicellulose content per area
reference: Jens Kattge, Ulrike Stahl, Eric Garnier, Stefan Klotz, Ingolf Kühn
pref unit: mass unit / mass unit

Root hemicellulose content per root dry mass trait
type: Class
subclass of: Root trait
type: NamedIndividual
type: Concept
related match: PATO_0000125
term status: stable
alternative label: root hemicellulose content per dry mass
related match: PO_0009005
reference: Jens Kattge, Ulrike Stahl, Eric Garnier, Stefan Klotz, Ingolf Kühn
pref unit: mass unit / mass unit
related match: CHEBI_61266
formal name: root hemicellulose content per root dry mass
definition: The ratio of the mass (PATO:mass) of hemicellulose (CHEBI:hemicellulose) in the root (PO:root) to the corresponding root mass (PATO:mass) assessed after drying
in scheme: Thesaurustrait

Coarse root hemicellulose content per coarse root dry mass
type: Class
subclass of: Root hemicellulose content per root dry mass trait
type: NamedIndividual
type: Concept
pref unit: mass unit / mass unit
alternative label: coarse root hemicellulose content per dry mass
term status: stable
definition: The ratio of the mass (PATO:mass) of hemicellulose (CHEBI:hemicellulose) in the coarse root (Def:coarse root) to the corresponding coarse root mass (PATO:mass) assessed after drying
reference: Jens Kattge, Ulrike Stahl, Eric Garnier, Stefan Klotz, Ingolf Kühn
formal name: coarse root hemicellulose content per coarse root dry mass
related match: CHEBI_61266
related match: PATO_0000125
in scheme: Thesaurustrait

Fine root hemicellulose content per fine root dry mass
type: Class
subclass of: Root trait
subclass of: Root hemicellulose content per root dry mass trait
type: NamedIndividual
type: Concept
formal name: first order fine root hemicellulose content per first order fine root dry mass
definition: The ratio of the mass (PATO:mass) of hemicellulose (CHEBI:hemicellulose) in a first order fine root (McCormack:fine root) to the corresponding first order fine root mass (PATO:mass) assessed after drying.
alternative label: first oder fine root hemicellulose content per dry mass
related match: CHEBI_61266
in scheme: Thesaurustrait
term status: stable
formal name: fine root hemicellulose content per fine root dry mass
pref unit: mass unit / mass unit
reference: Jens Kattge, Ulrike Stahl, Eric Garnier, Stefan Klotz, Ingolf Kühn
related match: PATO_0000125
definition: The ratio of the mass (PATO:mass) of hemicellulose (CHEBI:hemicellulose) in the fine root (McCormack:fine root) to the corresponding fine root mass (PATO:mass) assessed after drying
alternative label: fine root hemicellulose content per dry mass

Fine root hemicellulose content per fine root dry mass
type: Class
subclass of: Root trait
subclass of: Root hemicellulose content per root dry mass trait
type: NamedIndividual
type: Concept
formal name: first order fine root hemicellulose content per first order fine root dry mass
definition: The ratio of the mass (PATO:mass) of hemicellulose (CHEBI:hemicellulose) in a first order fine root (McCormack:fine root) to the corresponding first order fine root mass (PATO:mass) assessed after drying.
alternative label: first oder fine root hemicellulose content per dry mass
term status: stable
formal name: fine root hemicellulose content per fine root dry mass
in scheme: Thesaurustrait
related match: CHEBI_61266
pref unit: mass unit / mass unit
reference: Jens Kattge, Ulrike Stahl, Eric Garnier, Stefan Klotz, Ingolf Kühn
alternative label: fine root hemicellulose content per dry mass
related match: PATO_0000125
definition: The ratio of the mass (PATO:mass) of hemicellulose (CHEBI:hemicellulose) in the fine root (McCormack:fine root) to the corresponding fine root mass (PATO:mass) assessed after drying

Litter and coarse woody debris trait
type: Class
subclass of: Plant trait
type: NamedIndividual
type: Concept
reference: Eric Garnier, Jens Kattge, Stefan Klotz, Ingolf Kühn, Ulrike Stahl
in scheme: Thesaurustrait
term status: testing
definition: a plant trait (TOP:plant trait) referring to litter or coarse woody debris

Dispersule length trait
type: Class
subclass of: Flower and dispersule trait
type: NamedIndividual
type: Concept
formal name: dispersule length
related match: PATO_0000122
alternative label: propagule length
alternative label: diaspore length
related match: PO_0009001
related match: PO_0009010
reference: Eric Garnier, Jens Kattge, Stefan Klotz, Ingolf Kühn, Ulrike Stahl
definition: the longest linear dimension of a dispersule (Perez:dispersule) or component thereof (PO:seed, PO:fruit, Leda:germinule) or if clearly recognizable the length (PATO:length) from its base to its apex
pref unit: length unit
term status: stable
in scheme: Thesaurustrait

Second order fine root hemicellulose content per per dry mass
type: Class
subclass of: Fine root hemicellulose content per fine root dry mass
type: NamedIndividual
type: Concept
related match: CHEBI_61266
reference: Jens Kattge, Ulrike Stahl, Eric Garnier, Stefan Klotz, Ingolf Kühn
pref unit: mass unit / mass unit
definition: The ratio of the mass (PATO:mass) of hemicellulose (CHEBI:hemicellulose) in a second order fine root (McCormack:fine root) to the corresponding second order fine root mass (PATO:mass) assessed after drying.
related match: PATO_0000125
formal name: second order fine root hemicellulose content per secon order fine root dry mass
term status: stable
alternative label: second order fine root hemicellulose content per dry mass
in scheme: Thesaurustrait

Third order fine root hemicellulose content per dry mass
type: Class
subclass of: Fine root hemicellulose content per fine root dry mass
type: NamedIndividual
type: Concept
related match: CHEBI_61266
reference: Jens Kattge, Ulrike Stahl, Eric Garnier, Stefan Klotz, Ingolf Kühn
alternative label: third order fine root hemicellulose content per dry mass
formal name: third order fine root hemicellulose content perthird order fine root dry mass
pref unit: mass unit / mass unit
definition: The ratio of the mass (PATO:mass) of hemicellulose (CHEBI:hemicellulose) in a third order fine root (McCormack:fine root) to the corresponding third order fine root mass (PATO:mass) assessed after drying.
term status: stable
related match: PATO_0000125
in scheme: Thesaurustrait

Fourth order fine root hemicellulose content per dry mass
type: Class
subclass of: Fine root hemicellulose content per fine root dry mass
type: NamedIndividual
type: Concept
formal name: fourth order fine root hemicellulose content per fourth order fine root dry mass
reference: Jens Kattge, Ulrike Stahl, Eric Garnier, Stefan Klotz, Ingolf Kühn
related match: CHEBI_61266
alternative label: fourth order fine root hemicellulose content per dry mass
pref unit: mass unit / mass unit
definition: The ratio of the mass (PATO:mass) of hemicellulose (CHEBI:hemicellulose) in a fourth order fine root (McCormack:fine root) to the corresponding fourth order fine root mass (PATO:mass) assessed after drying.
in scheme: Thesaurustrait
term status: stable
related match: PATO_0000125

Absorptive fine root hemicellulose content per dry mass
type: Class
subclass of: Fine root hemicellulose content per fine root dry mass
type: NamedIndividual
type: Concept
formal name: absorptive fine root hemicellulose content per absorptive fine root dry mass
reference: Jens Kattge, Ulrike Stahl, Eric Garnier, Stefan Klotz, Ingolf Kühn
related match: CHEBI_61266
pref unit: mass unit / mass unit
alternative label: absorptive fine root hemicellulose content per dry mass
definition: The ratio of the mass (PATO:mass) of hemicellulose (CHEBI:hemicellulose) in an absorptive fine root (McCormack:fine root) to the corresponding absorptive fine root mass (PATO:mass) assessed after drying.
term status: stable
in scheme: Thesaurustrait
related match: PATO_0000125

Transport fine root hemicellulose content per dry mass
type: Class
subclass of: Fine root hemicellulose content per fine root dry mass
type: NamedIndividual
type: Concept
formal name: transport fine root hemicellulose content per transport fine root dry mass
term status: stable
in scheme: Thesaurustrait
reference: Jens Kattge, Ulrike Stahl, Eric Garnier, Stefan Klotz, Ingolf Kühn
pref unit: mass unit / mass unit
definition: The ratio of the mass (PATO:mass) of hemicellulose (CHEBI:hemicellulose) in a transport fine root (McCormack:fine root) to the corresponding transport fine root mass (PATO:mass) assessed after drying.
related match: CHEBI_61266
alternative label: transport fine root hemicellulose content per dry mass
related match: PATO_0000125

Seed hemicellulose content per seed dry mass
type: Class
subclass of: Flower and dispersule trait
type: NamedIndividual
type: Concept
related match: PATO_0000125
in scheme: Thesaurustrait
term status: stable
pref unit: mass unit / mass unit
related match: PO_0009010
related match: CHEBI_61266
alternative label: seed hemicellulose content per dry mass
definition: The ratio of the mass (PATO:mass) of hemicellulose (CHEBI:hemicellulose) in the seed (PO:seed) to the corresponding seed (PO:seed) mass (PATO:mass) assessed after drying
reference: Jens Kattge, Ulrike Stahl, Eric Garnier, Stefan Klotz, Ingolf Kühn
formal name: seed hemicellulose content per seed dry mass

Coarse woody debris hemicellulose content per coarse woody debris dry mass trait
type: Class
subclass of: Litter and coarse woody debris trait
type: NamedIndividual
type: Concept
formal name: coarse woody debris hemicellulose content per coarse woody debris dry mass
in scheme: Thesaurustrait
pref unit: mass unit / mass unit
related match: CHEBI_61266
alternative label: coarse woody debris hemicellulose content per dry mass
reference: Jens Kattge, Ulrike Stahl, Eric Garnier, Stefan Klotz, Ingolf Kühn
alternative label: CWD hemicellulose content per dry mass
definition: The ratio of the mass (PATO:mass) of hemicellulose (CHEBI:hemicellulose) in the coarse woody debris (Def:coarse woody debris) to the corresponding coarse woody debris mass (PATO:mass) assessed after drying
related match: PATO_0000125
term status: stable

Stem coarse woody debris hemicellulose content per stem coarse woody debris dry mass
type: Class
subclass of: Coarse woody debris hemicellulose content per coarse woody debris dry mass trait
type: NamedIndividual
type: Concept
definition: The ratio of the mass (PATO:mass) of hemicellulose (CHEBI:hemicellulose) in the stem (PO:stem) coarse woody debris (Def:coarse woody debris) to the corresponding stem (PO:stem) coarse woody debris mass (PATO:mass) assessed after drying
reference: Jens Kattge, Ulrike Stahl, Eric Garnier, Stefan Klotz, Ingolf Kühn
alternative label: stem coarse woody debris hemicellulose content per dry mass
related match: PATO_0000125
pref unit: mass unit / mass unit
in scheme: Thesaurustrait
related match: CHEBI_61266
related match: PO_0009047
alternative label: stem CWD hemicellulose content per dry mass
formal name: stem coarse woody debris hemicellulose content per stem coarse woody debris dry mass
term status: stable

Branch coarse woody debris hemicellulose content per branch coarse woody debris dry mass
type: Class
subclass of: Coarse woody debris hemicellulose content per coarse woody debris dry mass trait
type: NamedIndividual
type: Concept
alternative label: branch coarse woody debris hemicellulose content per dry mass
related match: PO_0025073
definition: The ratio of the mass (PATO:mass) of hemicellulose (CHEBI:hemicellulose) in the branch (PO:branch) coarse woody debris (Def:coarse woody debris) to the corresponding branch (PO:branch) coarse woody debris mass (PATO:mass) assessed after drying
reference: Jens Kattge, Ulrike Stahl, Eric Garnier, Stefan Klotz, Ingolf Kühn
related match: PATO_0000125
alternative label: branch CWD hemicellulose content per dry mass
pref unit: mass unit / mass unit
in scheme: Thesaurustrait
related match: CHEBI_61266
term status: stable
formal name: branch coarse woody debris hemicellulose content per branch coarse woody debris dry mass

Litter hemicellulose content per litter dry mass
type: Class
subclass of: Coarse woody debris hemicellulose content per coarse woody debris dry mass trait
type: NamedIndividual
type: Concept
definition: The ratio of the mass (PATO:mass) of hemicellulose (CHEBI:hemicellulose) in the litter (Garnier:litter) to the corresponding litter mass (PATO:mass) assessed after drying
related match: CHEBI_61266
alternative label: litter hemicellulose content per dry mass
related match: PATO_0000125
in scheme: Thesaurustrait
pref unit: mass unit / mass unit
term status: stable
reference: Jens Kattge, Ulrike Stahl, Eric Garnier, Stefan Klotz, Ingolf Kühn
formal name: litter hemicellulose content per litter dry mass

Seed length
type: Class
subclass of: Dispersule length trait
type: NamedIndividual
type: Concept
related match: PO_0009010
definition: the longest linear dimension of a seed (PO:seed) or if clearly recognizable the length (PATO:length) from its base to its apex
term status: stable
pref unit: length unit
formal name: seed length
related match: PATO_0000122
in scheme: Thesaurustrait
reference: Eric Garnier, Jens Kattge, Stefan Klotz, Ingolf Kühn, Ulrike Stahl

Plant sugar content per plant dry mass
type: Class
subclass of: Whole plant trait
type: NamedIndividual
type: Concept
definition: The ratio of the mass (PATO:mass) of sugar (Def:sugar) in the whole plant (PO:whole plant) to the corresponding whole plant (PO:whole plant) mass (PATO:mass) assessed after drying
pref unit: mass unit / mass unit
related match: PO_0000003
formal name: whole plant sugar content per plant dry mass
reference: Jens Kattge, Ulrike Stahl, Eric Garnier, Stefan Klotz, Ingolf Kühn
term status: stable
in scheme: Thesaurustrait
related match: PATO_0000125
alternative label: whole plant sugar content per dry mass

Shoot sugar content per shoot dry mass
type: Class
subclass of: Shoot trait
type: NamedIndividual
type: Concept
related match: PO_0009006
pref unit: mass unit / mass unit
definition: The ratio of the mass (PATO:mass) of sugar (Def:sugar) in the shoot (PO:shoot system) to the corresponding shoot (PO:shoot system) mass (PATO:mass) assessed after drying
related match: PATO_0000125
in scheme: Thesaurustrait
term status: stable
alternative label: shoot sugar content per dry mass
reference: Jens Kattge, Ulrike Stahl, Eric Garnier, Stefan Klotz, Ingolf Kühn
formal name: shoot sugar content per shoot dry mass

Branch sugar content per branch dry mass
type: Class
subclass of: Stem and branch trait
type: NamedIndividual
type: Concept
definition: The ratio of the mass (PATO:mass) of sugar (Def:sugar) in the branch (PO:branch) to the corresponding branch (PO:branch) mass (PATO:mass) assessed after drying
reference: Jens Kattge, Ulrike Stahl, Eric Garnier, Stefan Klotz, Ingolf Kühn
related match: PO_0025073
term status: stable
in scheme: Thesaurustrait
formal name: branch sugar content per branch dry mass
pref unit: mass unit / mass unit
alternative label: branch sugar content per dry mass
related match: PATO_0000125

Bark sugar content per bark dry mass
type: Class
subclass of: Stem and branch trait
type: NamedIndividual
type: Concept
reference: Jens Kattge, Ulrike Stahl, Eric Garnier, Stefan Klotz, Ingolf Kühn
definition: The ratio of the mass (PATO:mass) of sugar (Def:sugar) in the bark (PO:bark) to the corresponding bark (PO:bark) mass (PATO:mass) assessed after drying
alternative label: bark sugar content per dry mass
formal name: bark sugar content per bark dry mass
in scheme: Thesaurustrait
pref unit: mass unit / mass unit
related match: PO_0004518
term status: stable
related match: PATO_0000125

Stem sugar content per stem dry mass
type: Class
subclass of: Stem and branch trait
type: NamedIndividual
type: Concept
reference: Jens Kattge, Ulrike Stahl, Eric Garnier, Stefan Klotz, Ingolf Kühn
definition: The ratio of the mass (PATO:mass) of sugar (Def:sugar) in the stem (PO:stem) to the corresponding stem (PO:stem) mass (PATO:mass) assessed after drying
related match: PO_0009047
alternative label: stem sugar content per dry mass
formal name: stem sugar content per stem dry mass
pref unit: mass unit / mass unit
related match: PATO_0000125
term status: stable
in scheme: Thesaurustrait

Wood sugar content per wood dry mass trait
type: Class
subclass of: Stem and branch trait
type: NamedIndividual
type: Concept
reference: Jens Kattge, Ulrike Stahl, Eric Garnier, Stefan Klotz, Ingolf Kühn
in scheme: Thesaurustrait
formal name: wood sugar content per wood dry mass
alternative label: wood sugar content per dry mass
definition: The ratio of the mass (PATO:mass) of sugar (Def:sugar) in the wood (PO:secondary xylem) to the corresponding wood (PO:secondary xylem) mass (PATO:mass) assessed after drying
pref unit: mass unit / mass unit
related match: PO_0005848
related match: PATO_0000125
term status: stable

Stem wood sugar content per stem wood dry mass
type: Class
subclass of: Wood sugar content per wood dry mass trait
type: NamedIndividual
type: Concept
related match: PO_0005848
related match: PATO_0000125
in scheme: Thesaurustrait
formal name: stem wood sugar content per stem wood dry mass
definition: The ratio of the mass (PATO:mass) of sugar (Def:sugar) in the stem wood (PO:stem, PO:secondary xylem) to the corresponding stem wood (PO:stem, PO:secondary xylem) mass (PATO:mass) assessed after drying
related match: PO_0009047
pref unit: mass unit / mass unit
reference: Jens Kattge, Ulrike Stahl, Eric Garnier, Stefan Klotz, Ingolf Kühn
alternative label: stem wood sugar content per dry mass
term status: stable

Branch wood sugar content per branch wood dry mass
type: Class
subclass of: Wood sugar content per wood dry mass trait
type: NamedIndividual
type: Concept
related match: PATO_0000125
term status: stable
related match: PO_0005848
in scheme: Thesaurustrait
formal name: branch wood sugar content per branch wood dry mass
related match: PO_0025073
alternative label: branch wood sugar content per dry mass
definition: The ratio of the mass (PATO:mass) of sugar (Def:sugar) in the branch wood (PO:branch, PO:secondary xylem) to the corresponding branch wood (PO:branch, PO:secondary xylem) mass (PATO:mass) assessed after drying
reference: Jens Kattge, Ulrike Stahl, Eric Garnier, Stefan Klotz, Ingolf Kühn
pref unit: mass unit / mass unit

Cotyledon sugar content per cotyledon dry mass
type: Class
subclass of: Leaf trait
type: NamedIndividual
type: Concept
pref unit: mass unit / mass unit
in scheme: Thesaurustrait
term status: stable
related match: PATO_0000125
definition: The ratio of the mass (PATO:mass) of sugar (Def:sugar) in the cotyledon (PO:cotyledon) to the corresponding cotyledon (PO:cotyledon) mass (PATO:mass) assessed after drying
related match: PO_0020030
formal name: cotyledon sugar content per cotyledon dry mass
alternative label: cotyledon sugar content per dry mass
reference: Jens Kattge, Ulrike Stahl, Eric Garnier, Stefan Klotz, Ingolf Kühn

Leaf sugar content per leaf dry mass
type: Class
subclass of: Leaf trait
type: NamedIndividual
type: Concept
pref unit: mass unit / mass unit
in scheme: Thesaurustrait
definition: The ratio of the mass (PATO:mass) of sugar (Def:sugar) in the leaf (PO:leaf) or component thereof, i.e. leaf lamina or leaflet (PO:leaf lamina, PO:leaflet) per respective unit dry mass (TOP:leaf dry mass, TOP:leaf lamina dry mass, TOP:leaflet dry mass)
related match: PO_0020039
term status: stable
related match: PO_0020049
formal name: leaf sugar content per leaf dry mass
related match: PO_0025034
alternative label: leaf sugar content per dry mass
related match: PATO_0000125
reference: Jens Kattge, Ulrike Stahl, Eric Garnier, Stefan Klotz, Ingolf Kühn

Fruit length
type: Class
subclass of: Dispersule length trait
type: NamedIndividual
type: Concept
term status: stable
definition: the longest linear dimension of a fruit (PO:fruit) or if clearly recognizable the length (PATO:length) from its base to its apex
pref unit: length unit
related match: PO_0009001
related match: PATO_0000122
formal name: fruit length
in scheme: Thesaurustrait
reference: Eric Garnier, Jens Kattge, Stefan Klotz, Ingolf Kühn, Ulrike Stahl

Leaf sugar content per leaf area
type: Class
subclass of: Leaf trait
type: NamedIndividual
type: Concept
pref unit: mass unit / mass unit
reference: Jens Kattge, Ulrike Stahl, Eric Garnier, Stefan Klotz, Ingolf Kühn
related match: PATO_0000125
related match: PO_0025034
related match: PO_0020049
formal name: leaf sugar content per leaf area
alternative label: leaf sugar content per area
related match: PO_0020039
in scheme: Thesaurustrait
term status: stable
definition: The ratio of the mass (PATO:mass) of sugar (Def:sugar) in the leaf (PO:leaf) or component thereof, i.e. leaf lamina or leaflet (PO:leaf lamina, PO:leaflet) per respective area (TOP:leaf area, TOP:leaf lamina area, TOP:leaflet area)

Root sugar content per root dry mass trait
type: Class
subclass of: Root trait
type: NamedIndividual
type: Concept
related match: PO_0009005
formal name: root sugar content per root dry mass
pref unit: mass unit / mass unit
reference: Jens Kattge, Ulrike Stahl, Eric Garnier, Stefan Klotz, Ingolf Kühn
definition: The ratio of the mass (PATO:mass) of sugar (Def:sugar) in the root (PO:root) to the corresponding root mass (PATO:mass) assessed after drying
term status: stable
in scheme: Thesaurustrait
alternative label: root sugar content per dry mass
related match: PATO_0000125

Coarse root sugar content per coarse root dry mass
type: Class
subclass of: Root sugar content per root dry mass trait
type: NamedIndividual
type: Concept
definition: The ratio of the mass (PATO:mass) of sugar (Def:sugar) in the coarse root (Def:coarse root) to the corresponding coarse root mass (PATO:mass) assessed after drying
pref unit: mass unit / mass unit
formal name: coarse root sugar content per coarse root dry mass
alternative label: coarse root sugar content per dry mass
reference: Jens Kattge, Ulrike Stahl, Eric Garnier, Stefan Klotz, Ingolf Kühn
in scheme: Thesaurustrait
related match: PATO_0000125
term status: stable

Fine root sugar content per fine root dry mass
type: Class
subclass of: Root trait
subclass of: Root sugar content per root dry mass trait
type: NamedIndividual
type: Concept
alternative label: fine root sugar content per dry mass
related match: PATO_0000125
reference: Jens Kattge, Ulrike Stahl, Eric Garnier, Stefan Klotz, Ingolf Kühn
definition: The ratio of the mass (PATO:mass) of sugar (Def:sugar) in the fine root (McCormack:fine root) to the corresponding fine root mass (PATO:mass) assessed after drying
alternative label: first oder fine root sugar content per dry mass
definition: The ratio of the mass (PATO:mass) of sugar (Def:sugar) in a first order fine root (McCormack:fine root) to the corresponding first order fine root mass (PATO:mass) assessed after drying.
formal name: first order fine root sugar content per first order fine root dry mass
in scheme: Thesaurustrait
pref unit: mass unit / mass unit
formal name: fine root sugar content per fine root dry mass
term status: stable

Fine root sugar content per fine root dry mass
type: Class
subclass of: Root trait
subclass of: Root sugar content per root dry mass trait
type: NamedIndividual
type: Concept
alternative label: fine root sugar content per dry mass
related match: PATO_0000125
definition: The ratio of the mass (PATO:mass) of sugar (Def:sugar) in the fine root (McCormack:fine root) to the corresponding fine root mass (PATO:mass) assessed after drying
reference: Jens Kattge, Ulrike Stahl, Eric Garnier, Stefan Klotz, Ingolf Kühn
alternative label: first oder fine root sugar content per dry mass
definition: The ratio of the mass (PATO:mass) of sugar (Def:sugar) in a first order fine root (McCormack:fine root) to the corresponding first order fine root mass (PATO:mass) assessed after drying.
formal name: first order fine root sugar content per first order fine root dry mass
pref unit: mass unit / mass unit
in scheme: Thesaurustrait
formal name: fine root sugar content per fine root dry mass
term status: stable

Second order fine root sugar content per per dry mass
type: Class
subclass of: Fine root sugar content per fine root dry mass
type: NamedIndividual
type: Concept
formal name: second order fine root sugar content per secon order fine root dry mass
definition: The ratio of the mass (PATO:mass) of sugar (Def:sugar) in a second order fine root (McCormack:fine root) to the corresponding second order fine root mass (PATO:mass) assessed after drying.
alternative label: second order fine root sugar content per dry mass
pref unit: mass unit / mass unit
in scheme: Thesaurustrait
related match: PATO_0000125
reference: Jens Kattge, Ulrike Stahl, Eric Garnier, Stefan Klotz, Ingolf Kühn
term status: stable

Third order fine root sugar content per dry mass
type: Class
subclass of: Fine root sugar content per fine root dry mass
type: NamedIndividual
type: Concept
reference: Jens Kattge, Ulrike Stahl, Eric Garnier, Stefan Klotz, Ingolf Kühn
definition: The ratio of the mass (PATO:mass) of sugar (Def:sugar) in a third order fine root (McCormack:fine root) to the corresponding third order fine root mass (PATO:mass) assessed after drying.
in scheme: Thesaurustrait
formal name: third order fine root sugar content perthird order fine root dry mass
alternative label: third order fine root sugar content per dry mass
pref unit: mass unit / mass unit
related match: PATO_0000125
term status: stable

Fourth order fine root sugar content per dry mass
type: Class
subclass of: Fine root sugar content per fine root dry mass
type: NamedIndividual
type: Concept
related match: PATO_0000125
alternative label: fourth order fine root sugar content per dry mass
in scheme: Thesaurustrait
formal name: fourth order fine root sugar content per fourth order fine root dry mass
definition: The ratio of the mass (PATO:mass) of sugar (Def:sugar) in a fourth order fine root (McCormack:fine root) to the corresponding fourth order fine root mass (PATO:mass) assessed after drying.
term status: stable
pref unit: mass unit / mass unit
reference: Jens Kattge, Ulrike Stahl, Eric Garnier, Stefan Klotz, Ingolf Kühn

Absorptive fine root sugar content per dry mass
type: Class
subclass of: Fine root sugar content per fine root dry mass
type: NamedIndividual
type: Concept
term status: stable
related match: PATO_0000125
formal name: absorptive fine root sugar content per absorptive fine root dry mass
definition: The ratio of the mass (PATO:mass) of sugar (Def:sugar) in an absorptive fine root (McCormack:fine root) to the corresponding absorptive fine root mass (PATO:mass) assessed after drying.
in scheme: Thesaurustrait
pref unit: mass unit / mass unit
alternative label: absorptive fine root sugar content per dry mass
reference: Jens Kattge, Ulrike Stahl, Eric Garnier, Stefan Klotz, Ingolf Kühn

Transport fine root sugar content per dry mass
type: Class
subclass of: Fine root sugar content per fine root dry mass
type: NamedIndividual
type: Concept
term status: stable
alternative label: transport fine root sugar content per dry mass
related match: PATO_0000125
in scheme: Thesaurustrait
definition: The ratio of the mass (PATO:mass) of sugar (Def:sugar) in a transport fine root (McCormack:fine root) to the corresponding transport fine root mass (PATO:mass) assessed after drying.
reference: Jens Kattge, Ulrike Stahl, Eric Garnier, Stefan Klotz, Ingolf Kühn
pref unit: mass unit / mass unit
formal name: transport fine root sugar content per transport fine root dry mass

Germinule length
type: Class
subclass of: Dispersule length trait
type: NamedIndividual
type: Concept
pref unit: length unit
term status: stable
related match: PATO_0000122
definition: the longest linear dimension of a germinule (Leda:germinule) or if clearly recognizable the length (PATO:length) from its base to its apex
formal name: germinule length
in scheme: Thesaurustrait
reference: Eric Garnier, Jens Kattge, Stefan Klotz, Ingolf Kühn, Ulrike Stahl

Seed sugar content per seed dry mass
type: Class
subclass of: Flower and dispersule trait
type: NamedIndividual
type: Concept
related match: PATO_0000125
term status: stable
alternative label: seed sugar content per dry mass
in scheme: Thesaurustrait
pref unit: mass unit / mass unit
related match: PO_0009010
formal name: seed sugar content per seed dry mass
definition: The ratio of the mass (PATO:mass) of sugar (Def:sugar) in the seed (PO:seed) to the corresponding seed (PO:seed) mass (PATO:mass) assessed after drying
reference: Jens Kattge, Ulrike Stahl, Eric Garnier, Stefan Klotz, Ingolf Kühn

Coarse woody debris sugar content per coarse woody debris dry mass trait
type: Class
subclass of: Litter and coarse woody debris trait
type: NamedIndividual
type: Concept
alternative label: coarse woody debris sugar content per dry mass
pref unit: mass unit / mass unit
in scheme: Thesaurustrait
alternative label: CWD sugar content per dry mass
formal name: coarse woody debris sugar content per coarse woody debris dry mass
reference: Jens Kattge, Ulrike Stahl, Eric Garnier, Stefan Klotz, Ingolf Kühn
related match: PATO_0000125
definition: The ratio of the mass (PATO:mass) of sugar (Def:sugar) in the coarse woody debris (Def:coarse woody debris) to the corresponding coarse woody debris mass (PATO:mass) assessed after drying
term status: stable

Stem coarse woody debris sugar content per stem coarse woody debris dry mass
type: Class
subclass of: Coarse woody debris sugar content per coarse woody debris dry mass trait
type: NamedIndividual
type: Concept
pref unit: mass unit / mass unit
formal name: stem coarse woody debris sugar content per stem coarse woody debris dry mass
definition: The ratio of the mass (PATO:mass) of sugar (Def:sugar) in the stem (PO:stem) coarse woody debris (Def:coarse woody debris) to the corresponding stem (PO:stem) coarse woody debris mass (PATO:mass) assessed after drying
in scheme: Thesaurustrait
reference: Jens Kattge, Ulrike Stahl, Eric Garnier, Stefan Klotz, Ingolf Kühn
alternative label: stem CWD sugar content per dry mass
alternative label: stem coarse woody debris sugar content per dry mass
related match: PO_0009047
related match: PATO_0000125
term status: stable

Branch coarse woody debris sugar content per branch coarse woody debris dry mass
type: Class
subclass of: Coarse woody debris sugar content per coarse woody debris dry mass trait
type: NamedIndividual
type: Concept
pref unit: mass unit / mass unit
in scheme: Thesaurustrait
definition: The ratio of the mass (PATO:mass) of sugar (Def:sugar) in the branch (PO:branch) coarse woody debris (Def:coarse woody debris) to the corresponding branch (PO:branch) coarse woody debris mass (PATO:mass) assessed after drying
related match: PO_0025073
formal name: branch coarse woody debris sugar content per branch coarse woody debris dry mass
reference: Jens Kattge, Ulrike Stahl, Eric Garnier, Stefan Klotz, Ingolf Kühn
alternative label: branch coarse woody debris sugar content per dry mass
alternative label: branch CWD sugar content per dry mass
term status: stable
related match: PATO_0000125

Litter sugar content per litter dry mass
type: Class
subclass of: Coarse woody debris sugar content per coarse woody debris dry mass trait
type: NamedIndividual
type: Concept
definition: The ratio of the mass (PATO:mass) of sugar (Def:sugar) in the litter (Garnier:litter) to the corresponding litter mass (PATO:mass) assessed after drying
alternative label: litter sugar content per dry mass
formal name: litter sugar content per litter dry mass
in scheme: Thesaurustrait
related match: PATO_0000125
pref unit: mass unit / mass unit
reference: Jens Kattge, Ulrike Stahl, Eric Garnier, Stefan Klotz, Ingolf Kühn
term status: stable

Specific root length trait
type: Class
subclass of: Root trait
type: NamedIndividual
type: Concept
formal name: root length per root dry mass
abbreviation: SRL
pref unit: length unit / mass unit
related match: PATO_0000125
term status: stable
in scheme: Thesaurustrait
definition: The ratio of the length (PATO:length) of roots (PO:root) to the corresponding root mass (PATO:mass) assessed after drying
reference: Jens Kattge, Ulrike Stahl, Eric Garnier, Stefan Klotz, Ingolf Kühn
related match: PO_0009005
related match: PATO_0000122

Specific coarse root length
type: Class
subclass of: Specific root length trait
type: NamedIndividual
type: Concept
abbreviation: SRL
related match: PO_0009005
formal name: coarse root length per coarse root dry mass
term status: stable
in scheme: Thesaurustrait
pref unit: length unit / mass unit
related match: PATO_0000125
definition: The ratio of the length (PATO:length) of coarse roots (PO:coarse root) to the corresponding coarse root mass (PATO:mass) assessed after drying
related match: PATO_0000122
reference: Jens Kattge, Ulrike Stahl, Eric Garnier, Stefan Klotz, Ingolf Kühn

Specific fine root length
type: Class
subclass of: Root trait
subclass of: Specific root length trait
type: NamedIndividual
type: Concept
reference: Pérez-Harguindeguy N., Díaz S., Garnier E., Lavorel S., Poorter H., Jaureguiberry P., Bret-Harte M. S., Cornwell W. K., Craine J. M., Gurvich D. E., Urcelay C., Veneklaas E. J., Reich P. B., Poorter L., Wright I. J., Ray P., Enrico L., Pausas J. G., de Vos A. C., Buchmann N., Funes G., Quétier F., Hodgson J. G., Thompson K., Morgan H. D., ter Steege H., van der Heijden M. G. A., Sack L., Blonder B., Poschlod P., Vaieretti M. V., Conti G., Staver A. C., Aquino S., Cornelissen J. H. C. (2013) New handbook for standardised measurement of plant functional traits worldwide. Australian Journal of Botany 61, 167_234 (adapted)
in scheme: Thesaurustrait
formal name: first order fine root length per first order fine root dry mass
formal name: fine root length per fine root dry mass
term status: stable
definition: The ratio of the length (PATO:length) of fine roots (McCormack:fine root) to the corresponding fine root mass (PATO:mass) assessed after drying
abbreviation: SRL
related match: PATO_0000122
definition: The ratio of the length (PATO:length) of a first order fine root (McCormack:fine root) to the corresponding first order fine root mass (PATO:mass) assessed after drying.
pref unit: length unit / mass unit
related match: PATO_0000125

Specific fine root length
type: Class
subclass of: Root trait
subclass of: Specific root length trait
type: NamedIndividual
type: Concept
in scheme: Thesaurustrait
formal name: first order fine root length per first order fine root dry mass
formal name: fine root length per fine root dry mass
term status: stable
pref unit: length unit / mass unit
related match: PATO_0000125
definition: The ratio of the length (PATO:length) of fine roots (McCormack:fine root) to the corresponding fine root mass (PATO:mass) assessed after drying
abbreviation: SRL
definition: The ratio of the length (PATO:length) of a first order fine root (McCormack:fine root) to the corresponding first order fine root mass (PATO:mass) assessed after drying.
reference: Pérez-Harguindeguy N., Díaz S., Garnier E., Lavorel S., Poorter H., Jaureguiberry P., Bret-Harte M. S., Cornwell W. K., Craine J. M., Gurvich D. E., Urcelay C., Veneklaas E. J., Reich P. B., Poorter L., Wright I. J., Ray P., Enrico L., Pausas J. G., de Vos A. C., Buchmann N., Funes G., Quétier F., Hodgson J. G., Thompson K., Morgan H. D., ter Steege H., van der Heijden M. G. A., Sack L., Blonder B., Poschlod P., Vaieretti M. V., Conti G., Staver A. C., Aquino S., Cornelissen J. H. C. (2013) New handbook for standardised measurement of plant functional traits worldwide. Australian Journal of Botany 61, 167_234 (adapted)
related match: PATO_0000122

Specific second order fine root length
type: Class
subclass of: Specific fine root length
type: NamedIndividual
type: Concept
pref unit: length unit / mass unit
term status: stable
abbreviation: SRL
related match: PATO_0000125
in scheme: Thesaurustrait
reference: Pérez-Harguindeguy N., Díaz S., Garnier E., Lavorel S., Poorter H., Jaureguiberry P., Bret-Harte M. S., Cornwell W. K., Craine J. M., Gurvich D. E., Urcelay C., Veneklaas E. J., Reich P. B., Poorter L., Wright I. J., Ray P., Enrico L., Pausas J. G., de Vos A. C., Buchmann N., Funes G., Quétier F., Hodgson J. G., Thompson K., Morgan H. D., ter Steege H., van der Heijden M. G. A., Sack L., Blonder B., Poschlod P., Vaieretti M. V., Conti G., Staver A. C., Aquino S., Cornelissen J. H. C. (2013) New handbook for standardised measurement of plant functional traits worldwide. Australian Journal of Botany 61, 167_234 (adapted)
related match: PATO_0000122
formal name: second order fine root length per secon order fine root dry mass
definition: The ratio of the length (PATO:length) of a second order fine root (McCormack:fine root) to the corresponding second order fine root mass (PATO:mass) assessed after drying.

Dispersule width trait
type: Class
subclass of: Flower and dispersule trait
type: NamedIndividual
type: Concept
in scheme: Thesaurustrait
term status: stable
alternative label: diaspore width
related match: PATO_0000921
definition: the longest width (PATO:width) axis of a dispersule (Perez:dispersule) or component thereof, i.e. seed, fruit or germinule (PO:seed, PO:fruit, Leda:germinule) orthogonal to its length (TOP:dispersule length trait)
pref unit: length unit
related match: PO_0009010
related match: PO_0009001
formal name: dispersule width
reference: Eric Garnier, Jens Kattge, Stefan Klotz, Ingolf Kühn, Ulrike Stahl
alternative label: propagule width

Specific third order fine root length
type: Class
subclass of: Specific fine root length
type: NamedIndividual
type: Concept
formal name: third order fine root length perthird order fine root dry mass
in scheme: Thesaurustrait
definition: The ratio of the length (PATO:length) of a third order fine root (McCormack:fine root) to the corresponding third order fine root mass (PATO:mass) assessed after drying.
abbreviation: SRL
pref unit: length unit / mass unit
reference: Pérez-Harguindeguy N., Díaz S., Garnier E., Lavorel S., Poorter H., Jaureguiberry P., Bret-Harte M. S., Cornwell W. K., Craine J. M., Gurvich D. E., Urcelay C., Veneklaas E. J., Reich P. B., Poorter L., Wright I. J., Ray P., Enrico L., Pausas J. G., de Vos A. C., Buchmann N., Funes G., Quétier F., Hodgson J. G., Thompson K., Morgan H. D., ter Steege H., van der Heijden M. G. A., Sack L., Blonder B., Poschlod P., Vaieretti M. V., Conti G., Staver A. C., Aquino S., Cornelissen J. H. C. (2013) New handbook for standardised measurement of plant functional traits worldwide. Australian Journal of Botany 61, 167_234 (adapted)
related match: PATO_0000125
related match: PATO_0000122
term status: stable

Specific fourth order fine root length
type: Class
subclass of: Specific fine root length
type: NamedIndividual
type: Concept
pref unit: length unit / mass unit
related match: PATO_0000125
in scheme: Thesaurustrait
abbreviation: SRL
reference: Pérez-Harguindeguy N., Díaz S., Garnier E., Lavorel S., Poorter H., Jaureguiberry P., Bret-Harte M. S., Cornwell W. K., Craine J. M., Gurvich D. E., Urcelay C., Veneklaas E. J., Reich P. B., Poorter L., Wright I. J., Ray P., Enrico L., Pausas J. G., de Vos A. C., Buchmann N., Funes G., Quétier F., Hodgson J. G., Thompson K., Morgan H. D., ter Steege H., van der Heijden M. G. A., Sack L., Blonder B., Poschlod P., Vaieretti M. V., Conti G., Staver A. C., Aquino S., Cornelissen J. H. C. (2013) New handbook for standardised measurement of plant functional traits worldwide. Australian Journal of Botany 61, 167_234 (adapted)
definition: The ratio of the length (PATO:length) of a fourth order fine root (McCormack:fine root) to the corresponding fourth order fine root mass (PATO:mass) assessed after drying.
related match: PATO_0000122
formal name: fourth order fine root length per fourth order fine root dry mass
term status: stable

Specific absorptive fine root length
type: Class
subclass of: Specific fine root length
type: NamedIndividual
type: Concept
term status: stable
in scheme: Thesaurustrait
related match: PATO_0000125
pref unit: length unit / mass unit
definition: The ratio of the length (PATO:length) of an absorptive fine root (McCormack:fine root) to the corresponding absorptive fine root mass (PATO:mass) assessed after drying.
reference: Pérez-Harguindeguy N., Díaz S., Garnier E., Lavorel S., Poorter H., Jaureguiberry P., Bret-Harte M. S., Cornwell W. K., Craine J. M., Gurvich D. E., Urcelay C., Veneklaas E. J., Reich P. B., Poorter L., Wright I. J., Ray P., Enrico L., Pausas J. G., de Vos A. C., Buchmann N., Funes G., Quétier F., Hodgson J. G., Thompson K., Morgan H. D., ter Steege H., van der Heijden M. G. A., Sack L., Blonder B., Poschlod P., Vaieretti M. V., Conti G., Staver A. C., Aquino S., Cornelissen J. H. C. (2013) New handbook for standardised measurement of plant functional traits worldwide. Australian Journal of Botany 61, 167_234 (adapted)
abbreviation: SRL
formal name: absorptive fine root length per absorptive fine root dry mass
related match: PATO_0000122

Specific transport fine root length
type: Class
subclass of: Specific fine root length
type: NamedIndividual
type: Concept
term status: stable
in scheme: Thesaurustrait
related match: PATO_0000125
pref unit: length unit / mass unit
formal name: transport fine root length per transport fine root dry mass
definition: The ratio of the length (PATO:length) of a transport fine root (McCormack:fine root) to the corresponding transport fine root mass (PATO:mass) assessed after drying.
reference: Pérez-Harguindeguy N., Díaz S., Garnier E., Lavorel S., Poorter H., Jaureguiberry P., Bret-Harte M. S., Cornwell W. K., Craine J. M., Gurvich D. E., Urcelay C., Veneklaas E. J., Reich P. B., Poorter L., Wright I. J., Ray P., Enrico L., Pausas J. G., de Vos A. C., Buchmann N., Funes G., Quétier F., Hodgson J. G., Thompson K., Morgan H. D., ter Steege H., van der Heijden M. G. A., Sack L., Blonder B., Poschlod P., Vaieretti M. V., Conti G., Staver A. C., Aquino S., Cornelissen J. H. C. (2013) New handbook for standardised measurement of plant functional traits worldwide. Australian Journal of Botany 61, 167_234 (adapted)
abbreviation: SRL
related match: PATO_0000122

Root diameter trait
type: Class
subclass of: Root trait
type: NamedIndividual
type: Concept
related match: Pato diameter
pref unit: length unit
in scheme: Thesaurustrait
definition: The diameter (PATO:diameter) of a root (PO:root) .
term status: stable
formal name: root diameter
reference: Jens Kattge, Ulrike Stahl, Eric Garnier, Stefan Klotz, Ingolf Kühn
related match: PO_0009005

Coarse root diameter
type: Class
subclass of: Root diameter trait
type: NamedIndividual
type: Concept
related match: Pato diameter
definition: The diameter (PATO:diameter) of a coarse root (Def:coarse root) .
in scheme: Thesaurustrait
reference: Jens Kattge, Ulrike Stahl, Eric Garnier, Stefan Klotz, Ingolf Kühn
pref unit: length unit
term status: stable
formal name: coarse root diameter

Fine root diameter
type: Class
subclass of: Root trait
subclass of: Root diameter trait
type: NamedIndividual
type: Concept
related match: Pato diameter
formal name: first order fine root diameter
formal name: fine root diameter
in scheme: Thesaurustrait
pref unit: length unit
term status: stable
definition: The diameter (PATO:diameter) of a fine root (McCormack:fine root) .
definition: The diameter (PATO:diameter) of a first order fine root (McCormack:fine root) .
reference: Jens Kattge, Ulrike Stahl, Eric Garnier, Stefan Klotz, Ingolf Kühn

Fine root diameter
type: Class
subclass of: Root trait
subclass of: Root diameter trait
type: NamedIndividual
type: Concept
related match: Pato diameter
formal name: first order fine root diameter
formal name: fine root diameter
in scheme: Thesaurustrait
pref unit: length unit
term status: stable
definition: The diameter (PATO:diameter) of a fine root (McCormack:fine root) .
reference: Jens Kattge, Ulrike Stahl, Eric Garnier, Stefan Klotz, Ingolf Kühn
definition: The diameter (PATO:diameter) of a first order fine root (McCormack:fine root) .

Second order fine root diameter
type: Class
subclass of: Fine root diameter
type: NamedIndividual
type: Concept
in scheme: Thesaurustrait
formal name: second order fine root diameter
pref unit: length unit
definition: The diameter (PATO:diameter) of a second order fine root (McCormack:fine root) .
term status: stable
related match: Pato diameter
reference: Jens Kattge, Ulrike Stahl, Eric Garnier, Stefan Klotz, Ingolf Kühn

Third order fine root diameter
type: Class
subclass of: Fine root diameter
type: NamedIndividual
type: Concept
definition: The diameter (PATO:diameter) of a third order fine root (McCormack:fine root) .
reference: Jens Kattge, Ulrike Stahl, Eric Garnier, Stefan Klotz, Ingolf Kühn
in scheme: Thesaurustrait
related match: Pato diameter
term status: stable
pref unit: length unit
formal name: third order fine root diameter

Seed width
type: Class
subclass of: Dispersule width trait
type: NamedIndividual
type: Concept
reference: Eric Garnier, Jens Kattge, Stefan Klotz, Ingolf Kühn, Ulrike Stahl
in scheme: Thesaurustrait
term status: stable
related match: PO_0009010
formal name: seed width
pref unit: length unit
related match: PATO_0000921
definition: the longest width (PATO:width) axis of a seed (PO:seed) orthogonal to its length (TOP:seed length)

Fourth order fine root diameter
type: Class
subclass of: Fine root diameter
type: NamedIndividual
type: Concept
formal name: fourth order fine root diameter
definition: The diameter (PATO:diameter) of a fourth order fine root (McCormack:fine root) .
related match: Pato diameter
pref unit: length unit
in scheme: Thesaurustrait
term status: stable
reference: Jens Kattge, Ulrike Stahl, Eric Garnier, Stefan Klotz, Ingolf Kühn

Absorptive fine root diameter
type: Class
subclass of: Fine root diameter
type: NamedIndividual
type: Concept
reference: Jens Kattge, Ulrike Stahl, Eric Garnier, Stefan Klotz, Ingolf Kühn
in scheme: Thesaurustrait
definition: The diameter (PATO:diameter) of an absorptive fine root (McCormack:fine root) .
pref unit: length unit
formal name: absorptive fine root diameter
related match: Pato diameter
term status: stable

Transport fine root diameter
type: Class
subclass of: Fine root diameter
type: NamedIndividual
type: Concept
pref unit: length unit
in scheme: Thesaurustrait
related match: Pato diameter
definition: The diameter (PATO:diameter) of a transport fine root (McCormack:fine root) .
formal name: transport fine root diameter
term status: stable
reference: Jens Kattge, Ulrike Stahl, Eric Garnier, Stefan Klotz, Ingolf Kühn

Fruit width
type: Class
subclass of: Dispersule width trait
type: NamedIndividual
type: Concept
reference: Eric Garnier, Jens Kattge, Stefan Klotz, Ingolf Kühn, Ulrike Stahl
formal name: fruit width
related match: PO_0009001
pref unit: length unit
in scheme: Thesaurustrait
term status: stable
definition: the longest width (PATO:width) axis of a fruit (PO:fruit) orthogonal to its length (TOP:fruit length)
related match: PATO_0000921

Germinule width
type: Class
subclass of: Dispersule width trait
type: NamedIndividual
type: Concept
formal name: germinule width
pref unit: length unit
in scheme: Thesaurustrait
related match: PATO_0000921
term status: stable
definition: the longest width (PATO:width) axis of a germinule (PO:germinule) orthogonal to its length (TOP:germinule length)
reference: Eric Garnier, Jens Kattge, Stefan Klotz, Ingolf Kühn, Ulrike Stahl

Dispersule thickness trait
type: Class
subclass of: Flower and dispersule trait
type: NamedIndividual
type: Concept
related match: PO_0009001
related match: PATO_0000915
related match: PO_0009010
definition: the thickness (PATO:thickness) of a dispersule (Perez:dispersule) or component thereof, i.e. seed, fruit or germinule (PO:seed, PO:fruit, Leda:germinule)
alternative label: diaspore thickness
formal name: dispersule thickness
alternative label: propagule thickness
pref unit: length unit
in scheme: Thesaurustrait
reference: Eric Garnier, Jens Kattge, Stefan Klotz, Ingolf Kühn, Ulrike Stahl
term status: stable

Seed thickness
type: Class
subclass of: Dispersule thickness trait
type: NamedIndividual
type: Concept
related match: PATO_0000915
formal name: seed thickness
related match: PO_0009010
pref unit: length unit
in scheme: Thesaurustrait
reference: Eric Garnier, Jens Kattge, Stefan Klotz, Ingolf Kühn, Ulrike Stahl
definition: the thickness (PATO:thickness) of a seed (PO:seed)
term status: stable