Wood in the rough from the main stem and branches
type: Concept
notation: 012.1
in scheme: Forest Products Classification and Definitions (FPC&D) v2022
definition: Wood in the rough from the main stem and branches that will be used in the production of other goods and services (except as a source of fuel). It includes sawlogs and veneer logs; pulpwood, round and split; and other industrial roundwood.
broader: WOOD IN THE ROUGH OTHER THAN WOOD FUEL
narrower: Sawlogs and veneer logs
narrower: Pulpwood, round and split and wood for wood-based panels
narrower: Other industrial roundwood

Dry process fibreboard of a density exceeding 0.5 g/cm³ but not exceeding 0.8 g/cm³ , of a thickness not exceeding 5 mm
type: Concept
notation: 074.121
in scheme: Forest Products Classification and Definitions (FPC&D) v2022
definition: N.A.
broader: Dry process fibreboard of a density exceeding 0.5 g/cm³ but not exceeding 0.8 g/cm³

Sulphite chemical wood pulp, unbleached
type: Concept
notation: 083.21
in scheme: Forest Products Classification and Definitions (FPC&D) v2022
definition: Pulp not treated with chemicals to increase its brightness.
broader: Sulphite chemical wood pulp
narrower: Sulphite chemical wood pulp, unbleached, coniferous
narrower: Other unbleached sulphite chemical wood pulp

Other case materials
type: Concept
notation: 113.19
in scheme: Forest Products Classification and Definitions (FPC&D) v2022
definition: Other case materials not mention in subgroups 11311, 11312 and 11313.
broader: Case materials

WOOD-BASED PANELS
top concept of: Forest Products Classification and Definitions (FPC&D) v2022
type: Concept
notation: 07
in scheme: Forest Products Classification and Definitions (FPC&D) v2022
definition: This product category is an aggregate comprising plywood, particle board, oriented strand board (OSB), fibreboard, densified wood, combination board and other panels based on wood or other ligno-cellulosic materials.
narrower: Plywood
narrower: Particle board
narrower: Oriented strand board (OSB)
narrower: Fibreboard
narrower: Densified wood
narrower: Combination board
narrower: Other panels based on wood or other ligno-cellulosic materials

Wood chips and particles from recovered wood products, coniferous, for pulp
type: Concept
notation: 032.311
in scheme: Forest Products Classification and Definitions (FPC&D) v2022
definition: N.A.
broader: Wood chips and particles from recovered wood products, coniferous

Decorative veneer sheets, tropical non-coniferous, for plywood (faces)
type: Concept
notation: 061.21
in scheme: Forest Products Classification and Definitions (FPC&D) v2022
definition: Decorative veneer sheets for the manufacture of plywood. Because of its specific decorative characteristics this material is usually used on the face of plywood.
broader: Decorative veneer sheets, tropical non-coniferous

Tropical non-coniferous, other
type: Concept
notation: 052.9
in scheme: Forest Products Classification and Definitions (FPC&D) v2022
definition: N.A.
broader: Tropical non-coniferous, sawnwood and sleepers

Builder's joinery and carpentry of wood
type: Concept
notation: 135.
in scheme: Forest Products Classification and Definitions (FPC&D) v2022
definition: It includes windows, doors and coverings thereof as well as cellular wood panels, assembled parquet panels, shingles and shakes. It excludes bamboo-based products.
broader: SECONDARY WOOD PRODUCTS
narrower: Windows, French-windows and their frames
narrower: Doors and their frames and thresholds
narrower: Shuttering for concrete constructional work
narrower: Shingles and shakes
narrower: Posts and beams
narrower: Assembled flooring panels
narrower: Engineered structural timber products
narrower: Other builder's joinery and carpentry of wood

Roundwood treated with preservatives, coniferous, for piling
type: Concept
notation: 023.12
in scheme: Forest Products Classification and Definitions (FPC&D) v2022
definition: Long straight pieces, suitable for driving into the ground under impact. They are used principally in construction of harbour works and underpinning for bridges and buildings.
broader: Roundwood treated with preservatives, coniferous

Other industrial roundwood, tropical non-coniferous, used for poles
type: Concept
notation: 012.1321
in scheme: Forest Products Classification and Definitions (FPC&D) v2022
definition: N.A.
broader: Other industrial roundwood, tropical non-coniferous

Pulpwood and wood for wood-based panels, coniferous, for fibreboard
type: Concept
notation: 012.1213
in scheme: Forest Products Classification and Definitions (FPC&D) v2022
definition: N.A.
broader: Pulpwood and wood for wood-based panels, coniferous

Other load-bearing OSB
type: Concept
notation: 073.29
in scheme: Forest Products Classification and Definitions (FPC&D) v2022
definition: Load-bearing OSB used in dry (grade OSB/2) or humid (grade OSB/3) conditions.
broader: Load-bearing OSB

Cartonboard, other kraft paper and paperboard weighing 225 g/m² or more
type: Concept
notation: 113.24
in scheme: Forest Products Classification and Definitions (FPC&D) v2022
definition: Other kraft paper and paperboard weighing 225 g/m² or more, in rolls or sheets, can bleached or unbleached.
broader: Cartonboard

Coated graphic papers, mechanical, light-weight coated paper
type: Concept
notation: 111.311
in scheme: Forest Products Classification and Definitions (FPC&D) v2022
definition: Light-weight coated paper is a coated paper with a high mechanical pulp content. They are used for high quality magazines and advertising materials with demanding colour-printing requirements.
broader: Coated graphic papers, mechanical

Other wood fuel simply worked
type: Concept
notation: 027.9
in scheme: Forest Products Classification and Definitions (FPC&D) v2022
definition: N.A.
broader: Wood fuel simply worked
narrower: Other wood fuel simply worked, split (firewood)
narrower: Other wood fuel simply worked, n.e.c.

Dry process fibreboard of a density not exceeding 0.5 g/cm³
type: Concept
notation: 074.11
in scheme: Forest Products Classification and Definitions (FPC&D) v2022
definition: Low density fibreboard is a wood-fibre insulation board produced in the dry process.
broader: Dry process fibreboard

Wet process fibreboard
type: Concept
notation: 074.2
in scheme: Forest Products Classification and Definitions (FPC&D) v2022
definition: The wet fibres are formed into a mat which is either rolled (softboards), or rolled and then pressed, at a high temperature to the desired thickness. The primary bond is generally derived from the felting together of the fibres and their inherent adhesive properties, although in some instances a synthetic adhesive may be added to the fibres. Other additives such as wax, bitumen emulsion, natural oil or fire retardant chemicals may also be added. Wet process fibreboards have a fibre moisture content of more than 20 % at the forming stage.
broader: Fibreboard
narrower: Wet process fibreboard, of a density not exceeding 0.5 g/cm³
narrower: Wet process fibreboard, of a density exceeding 0.5 g/cm³ but not exceeding 0.8 g/cm³
narrower: Wet process fibreboard, of a density exceeding 0.8 g/cm³

Other sawlogs and veneer logs, for uses n.e.c.
type: Concept
notation: 012.1199
in scheme: Forest Products Classification and Definitions (FPC&D) v2022
definition: N.A.
broader: Other sawlogs and veneer logs

Thermo-mechanical pulp
type: Concept
notation: 081.4
in scheme: Forest Products Classification and Definitions (FPC&D) v2022
definition: It is produced from wood chips or wafers in refiners discharging after high-pressure steaming of the wood.
broader: Mechanical wood pulp
narrower: Thermo-mechanical pulp, unbleached
narrower: Thermo-mechanical pulp, bleached

Tops, small branches and twigs, coniferous, for uses n.e.c.
type: Concept
notation: 011.9119
in scheme: Forest Products Classification and Definitions (FPC&D) v2022
definition: N.A.
broader: Tops, small branches and twigs, coniferous

Torrefied wood, coniferous
type: Concept
notation: 022.1
in scheme: Forest Products Classification and Definitions (FPC&D) v2022
definition: It includes wood chips and wood pellets that were torrefied. In the torrefaction process, biomass is heated to a temperature of approx. 250-350°C in an atmosphere with low oxygen concentrations, so that all moisture is removed as well as a fraction of the volatile matter of the dry biomass. Due to the substantial weight loss and a relatively smaller loss of calorific content, the heating value of processed biomass per mass unit increases significantly in the process.
broader: Torrefied wood
narrower: Torrefied wood, coniferous, for energy
narrower: Torrefied wood, coniferous, for uses n.e.c.

Wrapping papers, kraft paper and paperboard weighing 150 g/m² or less
type: Concept
notation: 113.32
in scheme: Forest Products Classification and Definitions (FPC&D) v2022
definition: Kraftpaper paper and paperboard means paper and paperboard of which not less than 80 % by weight of the total fibre content consists of fibres obtained by the chemical sulphate or soda processes.
broader: Wrapping papers
narrower: Wrapping papers, kraft paper and paperboard weighing 150 g/m² or less, unbleached
narrower: Wrapping papers, kraft paper and paperboard weighing 150 g/m² or less, bleached

Solid wood processing residues, coniferous
type: Concept
notation: 031.11
in scheme: Forest Products Classification and Definitions (FPC&D) v2022
definition: Pieces of wood arising during processing, which have not been broken down into chips, sawdust, shavings or smaller particles. These pieces are suitable as raw material for the manufacture of pulp, particle board, fibreboard, etc. This category includes for example sawmill rejects, slabs, edgings and trimmings, veneer log cores, veneer rejects, sawdust, residues from carpentry and joinery production, etc. Excluded are bark and contaminated residues.
broader: Solid wood processing residues
narrower: Solid wood processing residues, coniferous, for pulp
narrower: Solid wood processing residues, coniferous, for particle board
narrower: Solid wood processing residues, coniferous, for fibreboard
narrower: Solid wood processing residues, coniferous, for energy
narrower: Solid wood processing residues, coniferous, for uses n.e.c.

Other residues of wood processing, not of solid wood, coniferous, for uses n.e.c.
type: Concept
notation: 031.919
in scheme: Forest Products Classification and Definitions (FPC&D) v2022
definition: N.A.
broader: Other residues of wood processing, not of solid wood, coniferous

Other roughly trimmed wood, pointed piles, pickets and stakes
type: Concept
notation: 024.93
in scheme: Forest Products Classification and Definitions (FPC&D) v2022
definition: This class cover round or split poles, pointed at the ends, which can be peeled or impregnated with preservative
broader: Other roughly trimmed wood

Shavings, coniferous, for particle board
type: Concept
notation: 031.312
in scheme: Forest Products Classification and Definitions (FPC&D) v2022
definition: N.A.
broader: Shavings, coniferous

Tropical non-coniferous, sawnwood planed
type: Concept
notation: 052.3
in scheme: Forest Products Classification and Definitions (FPC&D) v2022
definition: Wood sawn or chipped lengthwise, and planed, sanded or finger-jointed.
broader: Tropical non-coniferous, sawnwood and sleepers
narrower: Tropical non-coniferous, sawnwood planed, treated or impregnated
narrower: Tropical non-coniferous, sawnwood planed, n.e.c.

Cross - laminated timber (CLT or X-lam)
type: Concept
notation: 135.72
in scheme: Forest Products Classification and Definitions (FPC&D) v2022
definition: Cross-laminated timber consists of several layers of structural lumber boards stacked crosswise (typically at 90 degrees) and glued together on their wide faces and, sometimes, on the narrow faces as well. A cross-section of a CLT element has at least three glued layers of boards placed in orthogonally alternating orientation to the neighbouring layers. In special configurations, consecutive layers may be placed in the same direction, giving a double layer (e.g. double longitudinal layers at the outer faces and additional double layers at the core of the panel) to obtain specific structural capacities. CLT products are usually fabricated with three to seven layers and even more in some cases.
broader: Engineered structural timber products

Other articles of paper and paperboard ready for use
type: Concept
notation: 146.
in scheme: Forest Products Classification and Definitions (FPC&D) v2022
definition: It includes products ready for use: e.g. wallpaper and similar wall coverings; window transparencies of paper; floor coverings on a base of paper or of paperboard, whether or not cut to size; all office material like for correspondence, document storage as well as albums, labels of all kinds, bobbins, spools, cops and similar supports of paper pulp, paper or paperboard (whether or not perforated or hardened); all other paper, paperboard, cellulose wadding and webs of cellulose fibres, cut to size or shape; other articles of paper pulp, paper, paperboard, cellulose wadding or webs of cellulose fibres.
broader: SECONDARY PAPER PRODUCTS
narrower: Wallpaper and similar wall coverings
narrower: Window transparencies of paper
narrower: Paper and paperboard stationery
narrower: Paper and paperboard labels
narrower: Bobbins, spools, cops and similar supports of paper pulp, paper or paperboard
narrower: Other articles of paper and paperboard ready for use

Wood chips and particles from wood processing, coniferous
type: Concept
notation: 032.21
in scheme: Forest Products Classification and Definitions (FPC&D) v2022
definition: Wood, which has been deliberately reduced to chips, particles, flakes, etc. during the processing of wood.
broader: Wood chips and particles from wood processing
narrower: Wood chips and particles from wood processing, coniferous, for pulp
narrower: Wood chips and particles from wood processing, coniferous, for particle board
narrower: Wood chips and particles from wood processing, coniferous, for fibreboard
narrower: Wood chips and particles from wood processing, coniferous, for energy
narrower: Wood chips and particles from wood processing, coniferous, for uses n.e.c.

Laminated veneered lumber, with at least one outer ply of tropical wood
type: Concept
notation: 071.42
in scheme: Forest Products Classification and Definitions (FPC&D) v2022
definition: Laminated veneer lumber is the wood product that uses multiple layers of thin wood assembled with adhesives. Laminated veneer lumber is similar in appearance to plywood without crossbands.
broader: Laminated veneered lumber (LVL)

Cartonboard, paper and paperboard coated, impregnated or covered with plastics (excluding adhesives) weighing more than 150 g/m²
type: Concept
notation: 113.23
in scheme: Forest Products Classification and Definitions (FPC&D) v2022
definition: Paper and paperboard coated, impregnated or covered with plastics (excluding adhesives) weighing more than 150 g/m², if the layer of plastics does not constitute more than half the total thickness.
broader: Cartonboard

Toilet or facial tissue stock, towel or napkin stock and similar papers
type: Concept
notation: 112.1
in scheme: Forest Products Classification and Definitions (FPC&D) v2022
definition: Toilet or facial tissue stock, towel or napkin stock and similar paper of a kind used for household or sanitary purposes.
broader: Sanitary and household papers

Packing cases, boxes, crates, drums and similar packings
type: Concept
notation: 132.1
in scheme: Forest Products Classification and Definitions (FPC&D) v2022
definition: It includes packing cases and boxes with solid sides, lids and bottoms; crates, fruit or vegetable boxes, egg trays and other containers with slatted sides and open tops; boxes made of sliced or peeled wood; match boxes and conical open containers for marketing butter, fruit, etc.
broader: Wooden wrapping and packaging material

Other bobbins, spools, cops and similar supports of paper pulp, paper or paperboard
type: Concept
notation: 146.59
in scheme: Forest Products Classification and Definitions (FPC&D) v2022
definition: It includes bobbins, tubes, spools, cops, cones and similar supports used for other materials than winding textile yarn.
broader: Bobbins, spools, cops and similar supports of paper pulp, paper or paperboard

Wet process fibreboard, of a density exceeding 0.5 g/cm³ but not exceeding 0.8 g/cm³
type: Concept
notation: 074.22
in scheme: Forest Products Classification and Definitions (FPC&D) v2022
definition: It is a wet-process fibreboard of a density exceeding 0.5 g/cm3 but not exceeding 0.8 g/cm³. It is mainly used in furniture production and for interior or exterior walls.
broader: Wet process fibreboard

Coniferous, sawnwood planed, treated or impregnated
type: Concept
notation: 051.31
in scheme: Forest Products Classification and Definitions (FPC&D) v2022
definition: Wood sawn or chipped lengthwise, and planed, sanded or finger-jointed, which was not kiln- or air-dried but was treated with insecticides or fungicides for the purpose of protection. For long-term preservation they can be impregnated with creosote or other substances.
broader: Coniferous, sawnwood planed

Stumps and roots, coniferous, for fibreboard
type: Concept
notation: 012.2213
in scheme: Forest Products Classification and Definitions (FPC&D) v2022
definition: N.A.
broader: Stumps and roots, coniferous

Other residues of wood processing, not of solid wood, coniferous, for energy
type: Concept
notation: 031.911
in scheme: Forest Products Classification and Definitions (FPC&D) v2022
definition: N.A.
broader: Other residues of wood processing, not of solid wood, coniferous

Sawlogs and veneer logs, coniferous, for uses n.e.c.
type: Concept
notation: 012.1119
in scheme: Forest Products Classification and Definitions (FPC&D) v2022
definition: N.A.
broader: Sawlogs and veneer logs, coniferous

Further processed sawnwood, tropical non-coniferous, rounded wood
type: Concept
notation: 131.25
in scheme: Forest Products Classification and Definitions (FPC&D) v2022
definition: It covers drawn woods, which are used in the manufacture of certain types of match splints, pegs for footwear, certain types of wooden sun blinds, toothpicks, cheese making screens, etc.
broader: Further processed sawnwood, tropical non-coniferous

Other wood fuel simply worked, split (firewood)
type: Concept
notation: 027.91
in scheme: Forest Products Classification and Definitions (FPC&D) v2022
definition: Split logs or billets.
broader: Other wood fuel simply worked

Roughly trimmed wood, coniferous, split poles
type: Concept
notation: 024.12
in scheme: Forest Products Classification and Definitions (FPC&D) v2022
definition: This products incorporate stems or branches of trees split along the length. They are used as supports in horticulture, agriculture, for fencing, etc.
broader: Roughly trimmed wood, coniferous

Sawdust, coniferous, for uses n.e.c.
type: Concept
notation: 031.219
in scheme: Forest Products Classification and Definitions (FPC&D) v2022
definition: N.A.
broader: Sawdust, coniferous

Other non-coniferous, sleepers, treated or impregnated
type: Concept
notation: 053.11
in scheme: Forest Products Classification and Definitions (FPC&D) v2022
definition: Sleepers may be surface treated with insecticides, fungicides or impregnated with creosote or other substances for long-term preservation.
broader: Other non-coniferous, sleepers

Other paper and paperboard, wallpaper base
type: Concept
notation: 114.1
in scheme: Forest Products Classification and Definitions (FPC&D) v2022
definition: Uncoated paper of a kind used for further converting into acrylic or vinyl wallpapers.
broader: Other paper and paperboard

Other stumps and roots
type: Concept
notation: 012.229
in scheme: Forest Products Classification and Definitions (FPC&D) v2022
definition: Includes all the biomass of the tree below the separation of the harvested stem. The height of this cut will vary according to local practices and conditions.
broader: Stumps and roots
narrower: Other stumps and roots, for pulp
narrower: Other stumps and roots, for particle board
narrower: Other stumps and roots, for fibreboard
narrower: Other stumps and roots, for uses n.e.c.

Wrapping papers, sack kraft paper, unbleached
type: Concept
notation: 113.311
in scheme: Forest Products Classification and Definitions (FPC&D) v2022
definition: Sack kraft paper made wholly or principally of unbleached sulphate pulp.
broader: Wrapping papers, sack kraft paper

Heat transfer papers
type: Concept
notation: 143.3
in scheme: Forest Products Classification and Definitions (FPC&D) v2022
definition: It includes papers coated on one side with thermosensitive substance, for use in and infra-red copying machine.
broader: Carbon paper and copying paper ready for use

Other residues of wood processing, not of solid wood
type: Concept
notation: 031.9
in scheme: Forest Products Classification and Definitions (FPC&D) v2022
definition: This item includes notably sander dust and contaminated process residues.
broader: Wood residues (including wood for agglomerates)
narrower: Other residues of wood processing, not of solid wood, coniferous
narrower: Other residues of wood processing, not of solid wood n.e.c.

Other non-coniferous, sleepers
type: Concept
notation: 053.1
in scheme: Forest Products Classification and Definitions (FPC&D) v2022
definition: Railway or tramway sleepers are pieces of unplaned wood, of more or less rectangular section of the kind commonly used to support railway or tramway track. There are also included switch ties, which are longer than sleepers, and bridge ties, which are wider and thicker and usually longer than sleepers. It includes sawn sleepers, hewn sleepers, untreated and treated sleepers
broader: Other non-coniferous, sawnwood and sleepers
narrower: Other non-coniferous, sleepers, treated or impregnated
narrower: Other non-coniferous, sleepers, other

Other wood chips and particles from wood processing, for pulp
type: Concept
notation: 032.291
in scheme: Forest Products Classification and Definitions (FPC&D) v2022
definition: N.A.
broader: Other wood chips and particles from wood processing

Other pulpwood and wood for wood-based panels, for particle board
type: Concept
notation: 012.1292
in scheme: Forest Products Classification and Definitions (FPC&D) v2022
definition: N.A.
broader: Other pulpwood and wood for wood-based panels

Other wood chips and particles from wood in the rough, for energy
type: Concept
notation: 032.194
in scheme: Forest Products Classification and Definitions (FPC&D) v2022
definition: N.A.
broader: Other wood chips and particles from wood in the rough

Doors and their frames and thresholds, tropical non-coniferous
type: Concept
notation: 135.21
in scheme: Forest Products Classification and Definitions (FPC&D) v2022
definition: Doors and their frames and thresholds used in the construction. They can be made from of ordinary wood or of particle board, fibreboard, laminated wood or densified wood.
broader: Doors and their frames and thresholds

Other wood pellets, for uses n.e.c. (bedding, absorbents,…)
type: Concept
notation: 041.99
in scheme: Forest Products Classification and Definitions (FPC&D) v2022
definition: N.A.
broader: Other wood pellets

Veneer plywood, coniferous, exterior grade
type: Concept
notation: 071.112
in scheme: Forest Products Classification and Definitions (FPC&D) v2022
definition: Veneer plywood in which waterproof glue is used to bond plies. It is a resin-based glue similar to the glue used in wooden ships. It dries to a hard, crystal substance that will never yield to moisture of any kind. It is suitable for indoor and outdoor applications.
broader: Veneer plywood, coniferous

Statuettes and other ornaments
type: Concept
notation: 133.5
in scheme: Forest Products Classification and Definitions (FPC&D) v2022
definition: It includes statuettes, animals, figures and other ornaments.
broader: Wood products for domestic/decorative use
narrower: Statuettes and other ornaments, tropical non-coniferous
narrower: Other Statuettes and other ornaments

Shingles and shakes
type: Concept
notation: 135.4
in scheme: Forest Products Classification and Definitions (FPC&D) v2022
definition: A shingle is a thin piece of wood having parallel sides and tapered so that one end is thicker than the other, sawn from a shingle bolt. It is primarily used to cover roofs and walls of buildings to protect them from the weather. A shake is a shingle obtained by splitting, instead of sawing the bolt or plank. Shakes may be straight split or hand split and resawn tapered. It is primarily used to cover roofs and walls of buildings to protect them from the weather.
broader: Builder's joinery and carpentry of wood

Tops, small branches and twigs, tropical non-coniferous
type: Concept
notation: 011.912
in scheme: Forest Products Classification and Definitions (FPC&D) v2022
definition: N.A.
broader: Tops, small branches and twigs
narrower: Tops, small branches and twigs, tropical non-coniferous, for pellets
narrower: Tops, small branches and twigs, tropical non-coniferous, for uses n.e.c.

Roundwood treated with preservatives, coniferous, for uses n.e.c.
type: Concept
notation: 023.19
in scheme: Forest Products Classification and Definitions (FPC&D) v2022
definition: Roundwood treated with preservatives, other than poles, pilings and posts.
broader: Roundwood treated with preservatives, coniferous

SAWNWOOD
top concept of: Forest Products Classification and Definitions (FPC&D) v2022
type: Concept
notation: 05
in scheme: Forest Products Classification and Definitions (FPC&D) v2022
definition: Wood that has been produced from both domestic and imported roundwood, either by sawing lengthways or by a profile-chipping process and that exceeds 6 mm in thickness. Both sawn and hewn sleepers are included. It includes planks, beams, joists, boards, rafters, scantlings, laths, boxboards and "lumber", etc., in the following forms: unplaned, planed, etc. It excludes wooden flooring, mouldings (sawnwood continuously shaped along any of its edges or faces, like tongued, grooved, rebated, V-jointed, beaded, moulded, rounded or the like) and sawnwood produced by resawing previously sawn pieces.
narrower: Coniferous, sawnwood and sleepers
narrower: Tropical non-coniferous, sawnwood and sleepers
narrower: Other non-coniferous, sawnwood and sleepers

Refiner mechanical pulp
type: Concept
notation: 081.3
in scheme: Forest Products Classification and Definitions (FPC&D) v2022
definition: It is produced from wood chips or wafers in refiners discharging at atmospheric pressure.
broader: Mechanical wood pulp
narrower: Refiner mechanical pulp, unbleached
narrower: Refiner mechanical pulp, bleached

Other bleached chemi-mechanical pulp
type: Concept
notation: 082.229
in scheme: Forest Products Classification and Definitions (FPC&D) v2022
definition: N.A.
broader: Chemi-mechanical pulp, bleached

Special coated paper, gummed or adhesive paper and paperboard
type: Concept
notation: 142.2
in scheme: Forest Products Classification and Definitions (FPC&D) v2022
definition: Gummed paper is coated with a moisture activated adhesive, dextrin, gum Arabic, etc.
broader: Special coated paper and pulp products
narrower: Special coated paper, gummed or adhesive paper and paperboard, self-adhesive
narrower: Other special coated gummed or adhesive paper and paperboard

Cement bonded panels, fibre-reinforced cement board
type: Concept
notation: 077.14
in scheme: Forest Products Classification and Definitions (FPC&D) v2022
definition: There is a combination of cement and reinforcing fibers. These fibers can be of different origin (cellulose fibres, glass fibres, … )
broader: Cement bonded panels

Solid wood processing residues, coniferous, for uses n.e.c.
type: Concept
notation: 031.119
in scheme: Forest Products Classification and Definitions (FPC&D) v2022
definition: N.A.
broader: Solid wood processing residues, coniferous

Tops, small branches and twigs, coniferous
type: Concept
notation: 011.911
in scheme: Forest Products Classification and Definitions (FPC&D) v2022
definition: N.A.
broader: Tops, small branches and twigs
narrower: Tops, small branches and twigs, coniferous, for pellets
narrower: Tops, small branches and twigs, coniferous, for uses n.e.c.

Wood fuel simply worked, coniferous
type: Concept
notation: 027.1
in scheme: Forest Products Classification and Definitions (FPC&D) v2022
definition: N.A.
broader: Wood fuel simply worked
narrower: Wood fuel simply worked, coniferous, split (firewood)
narrower: Wood fuel simply worked, coniferous, n.e.c.

Other contaminated recoverable wood products
type: Concept
notation: 033.29
in scheme: Forest Products Classification and Definitions (FPC&D) v2022
definition: The recoverable wood products have been contaminated (e.g. by impregnation, gluing, coating, painting or nailing) to such an extent that they are unsuitable as raw material for pulp particle board or fibreboard. They are usually only suitable as energy source.
broader: Contaminated recoverable wood products
narrower: Other contaminated recoverable wood products, for energy
narrower: Other contaminated recoverable wood products, for uses n.e.c.

Veneer plywood, tropical non-coniferous, exterior grade
type: Concept
notation: 071.122
in scheme: Forest Products Classification and Definitions (FPC&D) v2022
definition: Veneer plywood in which waterproof glue is used to bond plies. It is a resin-based glue similar to the glue used in wooden ships. It dries to a hard, crystal substance that will never yield to moisture of any kind. It is suitable for indoor and outdoor applications.
broader: Veneer plywood, tropical non-coniferous

Wood chips and particles from recovered wood products
type: Concept
notation: 032.3
in scheme: Forest Products Classification and Definitions (FPC&D) v2022
definition: Wood, which has been deliberately reduced to chips, particles, flakes, etc. from products wholly or mostly of wood or wood-based panels, which are no longer used for their original purpose.
broader: Wood chips and particles
narrower: Wood chips and particles from recovered wood products, coniferous
narrower: Other wood chips and particles from recovered wood products

Wood products for domestic/decorative use
type: Concept
notation: 133.
in scheme: Forest Products Classification and Definitions (FPC&D) v2022
definition: It includes wooden frames for paintings, photographs, mirrors or similar objects; tableware and kitchenware of wood; and wood marquetry and inlaid wood, cases for jewellery or cutlery, statuettes and other ornaments of wood; hat racks. It excludes bamboo-based products.
broader: SECONDARY WOOD PRODUCTS
narrower: Wooden frames for paintings, photographs, mirrors or similar objects
narrower: Tableware and kitchenware
narrower: Wood marquetry and inlaid wood
narrower: Caskets and cases for jewellery or cutlery
narrower: Statuettes and other ornaments
narrower: Other wood products for domestic or decorative use

Load-bearing OSB, used in dry conditions
type: Concept
notation: 073.21
in scheme: Forest Products Classification and Definitions (FPC&D) v2022
definition: Load-bearing OSB used in dry (grade OSB/2) or humid (grade OSB/3) conditions.
broader: Load-bearing OSB

Sawlogs and veneer logs
type: Concept
notation: 012.11
in scheme: Forest Products Classification and Definitions (FPC&D) v2022
definition: Roundwood that will be sawn (or chipped) lengthways for the manufacture of sawnwood or railway sleepers (ties) or used for the production of veneer (mainly by peeling or slicing). It includes: roundwood (whether or not it is roughly squared) that will be used for these purposes; shingle bolts and stave bolts; match billets and other special types of roundwood (e.g. burls and roots, etc.) used for veneer production.
broader: Wood in the rough from the main stem and branches
narrower: Sawlogs and veneer logs, coniferous
narrower: Sawlogs and veneer logs, tropical non-coniferous
narrower: Other sawlogs and veneer logs

Wood chips and particles from recovered wood products, coniferous, for fibreboard
type: Concept
notation: 032.313
in scheme: Forest Products Classification and Definitions (FPC&D) v2022
definition: N.A.
broader: Wood chips and particles from recovered wood products, coniferous

Other uncontaminated recoverable wood products
type: Concept
notation: 033.19
in scheme: Forest Products Classification and Definitions (FPC&D) v2022
definition: The recoverable wood products have not been contaminated (e.g. by impregnation, gluing, coating, painting or nailing) to such an extent that they are unsuitable as raw material for pulp particle board or fibreboard. Examples are some pallets and wood packing cases.
broader: Uncontaminated recoverable wood products
narrower: Other uncontaminated recoverable wood products, for pulp
narrower: Other uncontaminated recoverable wood products, for particle board
narrower: Other uncontaminated recoverable wood products, for fibreboard
narrower: Other uncontaminated recoverable wood products, for energy
narrower: Other uncontaminated recoverable wood products, for uses n.e.c.

Wood chips and particles from wood processing
type: Concept
notation: 032.2
in scheme: Forest Products Classification and Definitions (FPC&D) v2022
definition: Wood, which has been deliberately reduced to chips, particles, flakes, etc. during the processing of wood.
broader: Wood chips and particles
narrower: Wood chips and particles from wood processing, coniferous
narrower: Other wood chips and particles from wood processing

Other bleached pressurised stone groundwood
type: Concept
notation: 081.229
in scheme: Forest Products Classification and Definitions (FPC&D) v2022
definition: N.A.
broader: Pressurised stone groundwood, bleached

Wood pellets, coniferous
type: Concept
notation: 041.1
in scheme: Forest Products Classification and Definitions (FPC&D) v2022
definition: Agglomerates produced either directly by compression or by the addition of a binder in a proportion not exceeding 3% by weight. Such pellets are cylindrical, with a diameter not exceeding 25 mm and a length not exceeding 100 mm.
broader: Wood pellets
narrower: Wood pellets, coniferous, for energy
narrower: Wood pellets, coniferous, for uses n.e.c. (bedding, absorbents,…)

Bark removed during processing, coniferous, for horticulture purposes
type: Concept
notation: 031.411
in scheme: Forest Products Classification and Definitions (FPC&D) v2022
definition: N.A.
broader: Bark removed during processing, coniferous

Other bark removed during processing, for energy
type: Concept
notation: 031.492
in scheme: Forest Products Classification and Definitions (FPC&D) v2022
definition: N.A.
broader: Other bark removed during processing

Wood chips and particles from wood processing, coniferous, for energy
type: Concept
notation: 032.214
in scheme: Forest Products Classification and Definitions (FPC&D) v2022
definition: N.A.
broader: Wood chips and particles from wood processing, coniferous

WOOD SIMPLY WORKED OR PROCESSED
top concept of: Forest Products Classification and Definitions (FPC&D) v2022
type: Concept
notation: 02
in scheme: Forest Products Classification and Definitions (FPC&D) v2022
definition: This section includes wood charcoal; roughly trimmed wood suitable for the manufacture of walking sticks, umbrellas, tool handles etc.; wood wool and wood flour.
narrower: Wood charcoal
narrower: Torrefied wood
narrower: Roundwood treated with preservatives
narrower: Roughly trimmed wood
narrower: Wood wool
narrower: Wood flour
narrower: Wood fuel simply worked

Wooden furniture
type: Concept
notation: 136.
in scheme: Forest Products Classification and Definitions (FPC&D) v2022
definition: It includes seats with wooden frames, such as wooden camping and garden seats etc. and parts thereof except seats convertible into beds, swivel seats, medical seats. Wooden furniture other than seats as of a kind used in offices, in the kitchen, bedrooms and elsewhere, as well as parts of all these.
broader: SECONDARY WOOD PRODUCTS
narrower: Wood swivel seats with variable height adjustment
narrower: Wood seats other than garden seats or camping equipment, convertible into beds
narrower: Other seats with wooden frames
narrower: Wooden parts of seats
narrower: Wooden furniture
narrower: Wood parts of the furniture

Tops, small branches and twigs, tropical non-coniferous, for fibreboard
type: Concept
notation: 012.2123
in scheme: Forest Products Classification and Definitions (FPC&D) v2022
definition: N.A.
broader: Tops, small branches and twigs, tropical non-coniferous

Further processed sawnwood, coniferous, beaded wood
type: Concept
notation: 131.13
in scheme: Forest Products Classification and Definitions (FPC&D) v2022
definition: It covers wood tongued and grooved with a simple bead between the edge or end and the tongue.
broader: Further processed sawnwood, coniferous

WOOD CHIPS AND PARTICLES, RESIDUES AND RECOVERABLE WOOD PRODUCTS
top concept of: Forest Products Classification and Definitions (FPC&D) v2022
type: Concept
notation: 03
in scheme: Forest Products Classification and Definitions (FPC&D) v2022
definition: N.A.
narrower: Wood residues (including wood for agglomerates)
narrower: Wood chips and particles
narrower: Recoverable wood products

Coated graphic papers, mechanical
type: Concept
notation: 111.31
in scheme: Forest Products Classification and Definitions (FPC&D) v2022
definition: Coated paper and paperboard containing 10 % or more fibres obtained by mechanical or thermo-mechanical process.
broader: Coated graphic papers
narrower: Coated graphic papers, mechanical, light-weight coated paper
narrower: Other mechanical coated graphic papers

Other industrial roundwood, tropical non-coniferous, for other uses - tanning, distillation, match blocks, gazogenes
type: Concept
notation: 012.1329
in scheme: Forest Products Classification and Definitions (FPC&D) v2022
definition: N.A.
broader: Other industrial roundwood, tropical non-coniferous

Wrapping papers
type: Concept
notation: 113.3
in scheme: Forest Products Classification and Definitions (FPC&D) v2022
definition: Wrappings papers (up to 150 g/m2) whose main use is wrapping or packaging made from any combination of virgin or recovered fibres, bleached or unbleached. They may be subject to various finishing and/or marking processes. It includes sack kraft, other wrapping krafts, sulphite and greaseproof papers as well as coated paper and paperboard not uniformly bleached throughout the mass, except multi-ply. It excludes: tracing papers.
broader: Packaging materials
narrower: Wrapping papers, sack kraft paper
narrower: Wrapping papers, kraft paper and paperboard weighing 150 g/m² or less
narrower: Wrapping papers, sulphite wrapping paper
narrower: Wrapping papers, vegetable parchment
narrower: Wrapping papers, greaseproof papers
narrower: Wrapping papers, glassine and other glazed transparent or translucent papers
narrower: Wrapping papers, corrugated paper and paperboard
narrower: Wrapping papers, kraft paper creped or crinkled
narrower: Other wrapping papers n.e.c.

Other further processed sawnwood, V-jointed wood
type: Concept
notation: 131.92
in scheme: Forest Products Classification and Definitions (FPC&D) v2022
definition: It covers i.e., wood tongued and grooved with chamfered edges or ends.
broader: Other further processed sawnwood

Dry process fibreboard of a density exceeding 0.8 g/cm³, of a thickness exceeding 5 mm but not exceeding 9 mm
type: Concept
notation: 074.132
in scheme: Forest Products Classification and Definitions (FPC&D) v2022
definition: N.A.
broader: Dry process fibreboard of a density exceeding 0.8 g/cm³

Torrefied wood, coniferous, for uses n.e.c.
type: Concept
notation: 022.19
in scheme: Forest Products Classification and Definitions (FPC&D) v2022
definition: N.A.
broader: Torrefied wood, coniferous

Other packing containers, including record sleeves
type: Concept
notation: 145.5
in scheme: Forest Products Classification and Definitions (FPC&D) v2022
definition: It includes other packing containers, including record sleeves using as outermost cardboard covering of a record, i.e. the record jacket or album jacket.
broader: Packaging cartons, boxes, etc.

Other wood flour
type: Concept
notation: 026.9
in scheme: Forest Products Classification and Definitions (FPC&D) v2022
definition: Wood flour is finely pulverized wood that has a consistency fairly equal to sand or sawdust, but can vary considerably, with particles ranging in size from a fine powder to roughly the size of a grain of rice. It is commonly used as a filler in thermosetting resins such as bakelite, and in linoleum floor coverings. Wood flour is also the main ingredient in wood-plastic composite products such as decks and roofs.
broader: Wood flour

Further processed sawnwood, coniferous, V-jointed wood
type: Concept
notation: 131.12
in scheme: Forest Products Classification and Definitions (FPC&D) v2022
definition: It covers i.e., wood tongued and grooved with chamfered edges or ends.
broader: Further processed sawnwood, coniferous

Agglomerated cork and articles of agglomerated cork, with a binding substance
type: Concept
notation: 122.1
in scheme: Forest Products Classification and Definitions (FPC&D) v2022
definition: Agglomerated cork is manufactured under heat and pressure with an added binding substance e.g. unvulcanised rubber, glue, plastics.
broader: Agglomerated cork and articles of agglomerated cork
narrower: Agglomerated cork and articles of agglomerated cork, with a binding substance, blocks, plates, sheets and strip; tiles of any shape; solid cylinders, including discs
narrower: Agglomerated cork and articles of agglomerated cork, with a binding substance, corks and stoppers
narrower: Agglomerated cork and articles of agglomerated cork, with a binding substance, gaskets, washers and other seals of agglomerated cork, for civil aircraft
narrower: Other agglomerated cork and articles of agglomerated cork, with a binding substance

Other tops, small branches and twigs, for pellets
type: Concept
notation: 011.9191
in scheme: Forest Products Classification and Definitions (FPC&D) v2022
definition: N.A.
broader: Other tops, small branches and twigs

Sawdust, coniferous, for fibreboard
type: Concept
notation: 031.213
in scheme: Forest Products Classification and Definitions (FPC&D) v2022
definition: N.A.
broader: Sawdust, coniferous

Other heavy-duty load-bearing OSB
type: Concept
notation: 073.39
in scheme: Forest Products Classification and Definitions (FPC&D) v2022
definition: Heavy-duty load-bearing boards used in humid conditions (grade OSB/4).
broader: Heavy-duty load-bearing OSB

Sawdust, coniferous, for particle board
type: Concept
notation: 031.212
in scheme: Forest Products Classification and Definitions (FPC&D) v2022
definition: N.A.
broader: Sawdust, coniferous

Other articles of paper and paperboard ready for use n.e.c.
type: Concept
notation: 146.99
in scheme: Forest Products Classification and Definitions (FPC&D) v2022
definition: Other articles of paper and paperboards not mentioned in the subgroups 146.91, 146.92, 146.93, 146.94 and 146.95, e.g. paper wool (narrow strips in tangled mass, used for packing), confectionery wrappers, cake cards and papers, paper lace and embroidery, paper gaskets and washers, sausages casings, etc.
broader: Other articles of paper and paperboard ready for use

Cement bonded panels, cement bonded wood wool board
type: Concept
notation: 077.12
in scheme: Forest Products Classification and Definitions (FPC&D) v2022
definition: The panel is made of wood wool and Portland cement with addition of natural mineralizing agent. Wood strands are first impregnated, and then by pressing they are bonded with cement in the continuous technological process. In this process wood strands become resistant to expanding, insects, rotting, water absorption, and fire resistance is also significantly improved.
broader: Cement bonded panels

Other paper or paperboard made mainly of bleached chemical pulp, not coloured in the mass
type: Concept
notation: 102.
in scheme: Forest Products Classification and Definitions (FPC&D) v2022
definition: Other paper or paperboard made mainly of bleached chemical pulp, not coloured in the mass
broader: RECOVERED PAPER

Other sawdust
type: Concept
notation: 031.29
in scheme: Forest Products Classification and Definitions (FPC&D) v2022
definition: Wood dust produced in the process of sawing.
broader: Sawdust
narrower: Other sawdust, for pulp
narrower: Other sawdust, for particle board
narrower: Other sawdust, for fibreboard
narrower: Other sawdust, for energy
narrower: Other sawdust, for uses n.e.c.

Decorative veneer sheets, coniferous
type: Concept
notation: 061.1
in scheme: Forest Products Classification and Definitions (FPC&D) v2022
definition: N.A.
broader: Decorative veneer sheets
narrower: Decorative veneer sheets, coniferous, for plywood (faces)
narrower: Decorative veneer sheets, coniferous, for other purposes (facing of sawnwood, panel, furniture, etc.)

Natural cork, debacked or roughly squared, or in rectangular blocks, plates, sheets or strip
type: Concept
notation: 121.2
in scheme: Forest Products Classification and Definitions (FPC&D) v2022
definition: Debacked cork are natural cork slabs with the whole of the back sawn or otherwise removed from the outer surface. Roughly squared cork are natural cork slabs with the outer (bark) and inner (tree) surfaces sawn or otherwise cut so as to be approximately parallel.
broader: Natural cork

Other agglomerates, coniferous
type: Concept
notation: 043.1
in scheme: Forest Products Classification and Definitions (FPC&D) v2022
definition: Agglomerates other than wood pellets and wood briquettes, for example logs.
broader: Other agglomerates
narrower: Other agglomerates, coniferous, for energy
narrower: Other agglomerates, coniferous, for uses n.e.c.

Wood in the rough other than from the main stem and branches
type: Concept
notation: 012.2
in scheme: Forest Products Classification and Definitions (FPC&D) v2022
definition: Includes tops, small branches, twigs, stumps, roots and bark removed in the forest that will be used in the production of other goods and services (except as a source of fuel).
broader: WOOD IN THE ROUGH OTHER THAN WOOD FUEL
narrower: Tops, small branches and twigs
narrower: Stumps and roots
narrower: Bark separated in the forest from wood in the rough

Further processed sawnwood, tropical non-coniferous, moulded wood
type: Concept
notation: 131.24
in scheme: Forest Products Classification and Definitions (FPC&D) v2022
definition: It covers strips of wood shaped to various contours, which are used for the manufacture of picture frames, decoration of walls, furniture, etc.
broader: Further processed sawnwood, tropical non-coniferous

Wood pellets, coniferous, for uses n.e.c. (bedding, absorbents,…)
type: Concept
notation: 041.19
in scheme: Forest Products Classification and Definitions (FPC&D) v2022
definition: N.A.
broader: Wood pellets, coniferous

Non-decorative veneer sheets, coniferous, for other purposes (match boxes, violin, … )
type: Concept
notation: 062.19
in scheme: Forest Products Classification and Definitions (FPC&D) v2022
definition: Non-decorative veneer sheets not used for the manufacture of plywood. Included in this item are veneer sheets for match boxes, violins, cigar boxes, etc. It excludes chipwood (subgroups 024.15, 024.95) which is used for plaiting or to make chip baskets, pill boxes, etc.
broader: Non-decorative veneer sheets, coniferous

Other plywood n.e.c.
type: Concept
notation: 071.9
in scheme: Forest Products Classification and Definitions (FPC&D) v2022
definition: N.A.
broader: Plywood
narrower: Other plywood n.e.c., with both outer plies of coniferous wood
narrower: Other plywood n.e.c., with at least one outer ply of tropical wood
narrower: Other plywood n.e.c., other

Tropical non-coniferous, sawnwood and sleepers
type: Concept
notation: 052.
in scheme: Forest Products Classification and Definitions (FPC&D) v2022
definition: N.A.
broader: SAWNWOOD
narrower: Tropical non-coniferous, sleepers
narrower: Tropical non-coniferous, sawnwood rough
narrower: Tropical non-coniferous, sawnwood planed
narrower: Tropical non-coniferous, other

Further processed sawnwood, coniferous, boards with rounded edges or ends
type: Concept
notation: 131.11
in scheme: Forest Products Classification and Definitions (FPC&D) v2022
definition: Wood sawn or chipped lengthwise with rounded edges or ends.
broader: Further processed sawnwood, coniferous

Pulpwood and wood for wood-based panels, tropical non-coniferous
type: Concept
notation: 012.122
in scheme: Forest Products Classification and Definitions (FPC&D) v2022
definition: Roundwood that will be used for the production of pulp, particleboard, oriented strand board (OSB) or fibreboard. It includes: roundwood (with or without bark) that will be used for these purposes in its round form or as splitwood or wood chips made directly (i.e. in the forest) from roundwood
broader: Pulpwood, round and split and wood for wood-based panels
narrower: Pulpwood and wood for wood-based panels, tropical non-coniferous, for pulp
narrower: Pulpwood and wood for wood-based panels, tropical non-coniferous, for particle board
narrower: Pulpwood and wood for wood-based panels, tropical non-coniferous, for fibreboard
narrower: Pulpwood and wood for wood-based panels, tropical non-coniferous, for wood wool
narrower: Pulpwood and wood for wood-based panels, tropical non-coniferous, for uses n.e.c.

Other panels n.e.c.
type: Concept
notation: 077.9
in scheme: Forest Products Classification and Definitions (FPC&D) v2022
definition: Includes any panels not covered by definitions of the groups 077.1, 077.2, 077.3
broader: Other panels based on wood or other ligno-cellulosic materials

Sulphite chemical wood pulp, bleached or semi-bleached
type: Concept
notation: 083.22
in scheme: Forest Products Classification and Definitions (FPC&D) v2022
definition: Pulp treated with chemicals to increase its brightness.
broader: Sulphite chemical wood pulp
narrower: Sulphite chemical wood pulp, bleached or semi-bleached, coniferous
narrower: Other bleached or semi-bleached sulphite chemical wood pulp

Coniferous, sleepers
type: Concept
notation: 051.1
in scheme: Forest Products Classification and Definitions (FPC&D) v2022
definition: Railway or tramway sleepers are pieces of unplaned wood, of more or less rectangular section of the kind commonly used to support railway or tramway track. There are also included switch ties, which are longer than sleepers, and bridge ties, which are wider and thicker and usually longer than sleepers. It includes sawn sleepers, hewn sleepers, untreated and treated sleepers
broader: Coniferous, sawnwood and sleepers
narrower: Coniferous, sleepers, treated or impregnated
narrower: Coniferous, sleepers, n.e.c.

Other pulpwood and wood for wood-based panels
type: Concept
notation: 012.129
in scheme: Forest Products Classification and Definitions (FPC&D) v2022
definition: Roundwood that will be used for the production of pulp, particleboard, oriented strand board (OSB) or fibreboard. It includes: roundwood (with or without bark) that will be used for these purposes in its round form or as splitwood or wood chips made directly (i.e. in the forest) from roundwood
broader: Pulpwood, round and split and wood for wood-based panels
narrower: Other pulpwood and wood for wood-based panels, for pulp
narrower: Other pulpwood and wood for wood-based panels, for particle board
narrower: Other pulpwood and wood for wood-based panels, for fibreboard
narrower: Other pulpwood and wood for wood-based panels, for wood wool
narrower: Other pulpwood and wood for wood-based panels, for uses n.e.c.

Stumps and roots, tropical non-coniferous, for fibreboard
type: Concept
notation: 012.2223
in scheme: Forest Products Classification and Definitions (FPC&D) v2022
definition: N.A.
broader: Stumps and roots, tropical non-coniferous

Toilet paper
type: Concept
notation: 144.1
in scheme: Forest Products Classification and Definitions (FPC&D) v2022
definition: Toilet paper in strips or rolls of a width not exceeding 36 cm.
broader: Household and sanitary paper ready for use

Other industrial roundwood, tropical non-coniferous, for other uses in the rough (fencing, …)
type: Concept
notation: 012.1325
in scheme: Forest Products Classification and Definitions (FPC&D) v2022
definition: N.A.
broader: Other industrial roundwood, tropical non-coniferous

Oriented strand board (OSB)
type: Concept
notation: 073.
in scheme: Forest Products Classification and Definitions (FPC&D) v2022
definition: A structural board in which layers of narrow wafers are layered alternately at right angles in order to give the board greater elastomechanical properties. The wafers, which resemble small pieces of veneer, are coated with e.g. waterproof phenolic resin glue, interleaved together in mats and then bonded together under heat and pressure. The resulting product is a solid, uniform building panel having high strength and water resistance.
broader: WOOD-BASED PANELS
narrower: General purpose OSB and OSB for interior fitments
narrower: Load-bearing OSB
narrower: Heavy-duty load-bearing OSB
narrower: Other oriented strandboard n.e.c.

Shavings, coniferous, for uses n.e.c.
type: Concept
notation: 031.319
in scheme: Forest Products Classification and Definitions (FPC&D) v2022
definition: N.A.
broader: Shavings, coniferous

Other further processed sawnwood n.e.c.
type: Concept
notation: 131.99
in scheme: Forest Products Classification and Definitions (FPC&D) v2022
definition: Other further processed sawnwood not mentioned in the previous items.
broader: Other further processed sawnwood

Agglomerated cork and articles of agglomerated cork, with a binding substance, blocks, plates, sheets and strip; tiles of any shape; solid cylinders, including discs
type: Concept
notation: 122.11
in scheme: Forest Products Classification and Definitions (FPC&D) v2022
definition: Agglomerated cork in the form of blocks, plates, sheets and strip; tiles of any shape; solid cylinders, including discs
broader: Agglomerated cork and articles of agglomerated cork, with a binding substance

Wood chips and particles from wood processing, coniferous, for uses n.e.c.
type: Concept
notation: 032.219
in scheme: Forest Products Classification and Definitions (FPC&D) v2022
definition: N.A.
broader: Wood chips and particles from wood processing, coniferous

Other uncontaminated recoverable wood products, for energy
type: Concept
notation: 033.194
in scheme: Forest Products Classification and Definitions (FPC&D) v2022
definition: N.A.
broader: Other uncontaminated recoverable wood products

Contaminated recoverable wood products, coniferous, for uses n.e.c.
type: Concept
notation: 033.219
in scheme: Forest Products Classification and Definitions (FPC&D) v2022
definition: N.A.
broader: Contaminated recoverable wood products, coniferous

Self-copy paper
type: Concept
notation: 143.2
in scheme: Forest Products Classification and Definitions (FPC&D) v2022
definition: Self-copy paper is a type of coated paper designed to transfer information written on the front onto sheets beneath. It has micro-encapsulated dye or ink on the back side of the top sheet, and a clay coating on the front side of the bottom sheet. When pressure is applied (from writing or impact printing), the dye capsules rupture and react with the clay to form a permanent mark duplicating the markings made to the top sheet.
broader: Carbon paper and copying paper ready for use

Other shavings, for fibreboard
type: Concept
notation: 031.393
in scheme: Forest Products Classification and Definitions (FPC&D) v2022
definition: N.A.
broader: Other shavings

Veneer plywood, tropical non-coniferous
type: Concept
notation: 071.12
in scheme: Forest Products Classification and Definitions (FPC&D) v2022
definition: Non-coniferous (tropical) plywood is defined as having at least one face sheet of non-coniferous (tropical) wood.
broader: Veneer plywood
narrower: Veneer plywood, tropical non-coniferous, interior grade
narrower: Veneer plywood, tropical non-coniferous, exterior grade

Veneer plywood, coniferous
type: Concept
notation: 071.11
in scheme: Forest Products Classification and Definitions (FPC&D) v2022
definition: N.A.
broader: Veneer plywood
narrower: Veneer plywood, coniferous, interior grade
narrower: Veneer plywood, coniferous, exterior grade

Combination board
type: Concept
notation: 076.
in scheme: Forest Products Classification and Definitions (FPC&D) v2022
definition: Boards which have special properties as a result of the combination of two or more wood-based panels. The latter may be identifiable in their own right under other items of the classification, but under the present item they form an integral part of the panel. It excludes panels covered with veneers that are classified as plywood.
broader: WOOD-BASED PANELS
narrower: Particle board covered on one or both faces with fibreboard
narrower: Several particle boards whether or not covered on one or both faces with fibreboard
narrower: Several particle boards and several fibreboards assembled in any order
narrower: Other combination boards n.e.c.

Other non-coniferous, sawnwood planed
type: Concept
notation: 053.3
in scheme: Forest Products Classification and Definitions (FPC&D) v2022
definition: Wood sawn or chipped lengthwise, and planed, sanded or finger-jointed.
broader: Other non-coniferous, sawnwood and sleepers
narrower: Other non-coniferous, sawnwood planed, treated or impregnated
narrower: Other non-coniferous, sawnwood planed, other

PAPER AND PAPERBOARD
top concept of: Forest Products Classification and Definitions (FPC&D) v2022
type: Concept
notation: 11
in scheme: Forest Products Classification and Definitions (FPC&D) v2022
definition: The paper and paperboard category is an aggregate category. In the production and trade statistics, it represents the sum of graphic papers; sanitary and household papers; packaging materials and other paper and paperboard. It excludes manufactured paper products such as boxes, cartons, books and magazines, etc.
narrower: Graphic papers
narrower: Sanitary and household papers
narrower: Packaging materials
narrower: Other paper and paperboard

Wrapping papers, sack kraft paper
type: Concept
notation: 113.31
in scheme: Forest Products Classification and Definitions (FPC&D) v2022
definition: Sack kraft paper is a porous kraft paper with high elasticity and high tear resistance, designed for packaging products with high demands for strength and durability. It contains more than 80 % by weight fibres obtained by chemical sulphate or soda processes.
broader: Wrapping papers
narrower: Wrapping papers, sack kraft paper, unbleached
narrower: Wrapping papers, sack kraft paper, bleached

Uncontaminated recoverable wood products, coniferous, for fibreboard
type: Concept
notation: 033.113
in scheme: Forest Products Classification and Definitions (FPC&D) v2022
definition: N.A.
broader: Uncontaminated recoverable wood products, coniferous

Contaminated recoverable wood products
type: Concept
notation: 033.2
in scheme: Forest Products Classification and Definitions (FPC&D) v2022
definition: The recoverable wood products have been contaminated (e.g. by impregnation, gluing, coating, painting or nailing) to such an extent that they are unsuitable as raw material for pulp particle board or fibreboard. They are usually only suitable as energy source.
broader: Recoverable wood products
narrower: Contaminated recoverable wood products, coniferous
narrower: Other contaminated recoverable wood products

Tops, small branches and twigs, tropical non-coniferous
type: Concept
notation: 012.212
in scheme: Forest Products Classification and Definitions (FPC&D) v2022
definition: Includes tops, small branches and twigs from felled trees. The lower limit of the top (the upper limit of the stem) will vary according to local logging practices
broader: Tops, small branches and twigs
narrower: Tops, small branches and twigs, tropical non-coniferous, for pulp
narrower: Tops, small branches and twigs, tropical non-coniferous, for particle board
narrower: Tops, small branches and twigs, tropical non-coniferous, for fibreboard
narrower: Tops, small branches and twigs, tropical non-coniferous, for uses n.e.c.

Other general purpose OSB and OSB for interior fitments
type: Concept
notation: 073.19
in scheme: Forest Products Classification and Definitions (FPC&D) v2022
definition: OSB used only in dry conditions, mainly for interior fitments (including furniture), grade OSB/1.
broader: General purpose OSB and OSB for interior fitments

Other wood chips and particles from recovered wood products, for particle board
type: Concept
notation: 032.392
in scheme: Forest Products Classification and Definitions (FPC&D) v2022
definition: N.A.
broader: Other wood chips and particles from recovered wood products

Roundwood treated with preservatives
type: Concept
notation: 023.
in scheme: Forest Products Classification and Definitions (FPC&D) v2022
definition: This group covers products which have been treated with paint, stains, creosote or other preservatives, in order to increase their resistance. It excludes: products treated with substances for the purpose of simply maintaining them during shipment or storage, torrefied pellets
broader: WOOD SIMPLY WORKED OR PROCESSED
narrower: Roundwood treated with preservatives, coniferous
narrower: Other roundwood treated with preservatives

Engineered structural timber products
type: Concept
notation: 135.7
in scheme: Forest Products Classification and Definitions (FPC&D) v2022
definition: Engineered structural timber products are made from sawnwood, veneers, strands of wood, or from other small wood elements that are bound together with structural resins to form structural products. They are designed for use in the same structural applications as sawnwood (e.g., girders, beams, headers, joists, studs, and columns).
broader: Builder's joinery and carpentry of wood
narrower: Glue‑laminated timber (GLULAM)
narrower: Cross - laminated timber (CLT or X-lam)
narrower: I-beams
narrower: Other Engineered structural timber products

Other industrial roundwood, coniferous, used for pitprops
type: Concept
notation: 012.1313
in scheme: Forest Products Classification and Definitions (FPC&D) v2022
definition: N.A.
broader: Other industrial roundwood, coniferous

Other torrefied wood, for energy
type: Concept
notation: 022.91
in scheme: Forest Products Classification and Definitions (FPC&D) v2022
definition: N.A.
broader: Other torrefied wood

Wood particle board, medium density particle board
type: Concept
notation: 072.12
in scheme: Forest Products Classification and Definitions (FPC&D) v2022
definition: Medium density particle board (MDP) panel is composed of a synthetic adhesive matrix and a reinforcing phase composed of wood particles (usually Eucalyptus). The wood particles are arranged in three layers. The particles are positioned in a differentiated manner, the largest are laid in the middle and the thinner particles are placed on the outer surfaces, creating three layers. They are glued and compressed with a synthetic resin by applying pressure and heat at the same time in a state-of-the-art continuous press.
broader: Wood particle board

Wood flour, coniferous
type: Concept
notation: 026.1
in scheme: Forest Products Classification and Definitions (FPC&D) v2022
definition: Wood flour is finely pulverized wood that has a consistency fairly equal to sand or sawdust, but can vary considerably, with particles ranging in size from a fine powder to roughly the size of a grain of rice. It is commonly used as a filler in thermosetting resins such as bakelite, and in linoleum floor coverings. Wood flour is also the main ingredient in wood-plastic composite products such as decks and roofs.
broader: Wood flour

Other stumps and roots
type: Concept
notation: 011.929
in scheme: Forest Products Classification and Definitions (FPC&D) v2022
definition: N.A.
broader: Stumps and roots
narrower: Other stumps and roots, for pellets
narrower: Other stumps and roots, for uses n.e.c.

Other industrial roundwood n.e.c., used for poles
type: Concept
notation: 012.1391
in scheme: Forest Products Classification and Definitions (FPC&D) v2022
definition: N.A.
broader: Other industrial roundwood n.e.c.

Other coniferous further processed sawnwood
type: Concept
notation: 131.19
in scheme: Forest Products Classification and Definitions (FPC&D) v2022
definition: Other further processed sawnwood not mentioned in the previous items.
broader: Further processed sawnwood, coniferous

Dry process fibreboard of a density exceeding 0.8 g/cm³, of a thickness exceeding 9 mm
type: Concept
notation: 074.133
in scheme: Forest Products Classification and Definitions (FPC&D) v2022
definition: N.A.
broader: Dry process fibreboard of a density exceeding 0.8 g/cm³

Other industrial roundwood n.e.c., used for posts
type: Concept
notation: 012.1394
in scheme: Forest Products Classification and Definitions (FPC&D) v2022
definition: N.A.
broader: Other industrial roundwood n.e.c.

Other wood chips and particles from wood in the rough, for fibreboard
type: Concept
notation: 032.193
in scheme: Forest Products Classification and Definitions (FPC&D) v2022
definition: N.A.
broader: Other wood chips and particles from wood in the rough

Other solid wood processing residues, for pulp
type: Concept
notation: 031.191
in scheme: Forest Products Classification and Definitions (FPC&D) v2022
definition: N.A.
broader: Other solid wood processing residues

Wrapping papers, kraft paper and paperboard weighing 150 g/m² or less, unbleached
type: Concept
notation: 113.321
in scheme: Forest Products Classification and Definitions (FPC&D) v2022
definition: Kraftpaper paper and paperboard made wholly or principally of unbleached sulphate pulp.
broader: Wrapping papers, kraft paper and paperboard weighing 150 g/m² or less

Semi-chemical wood pulp
type: Concept
notation: 082.
in scheme: Forest Products Classification and Definitions (FPC&D) v2022
definition: Wood pulp obtained by subjecting pulpwood, wood chips, particles or residues to a series of mechanical and chemical treatments, none of which alone is sufficient to make the fibres separate readily. It may be bleached or unbleached.
broader: WOOD PULP
narrower: Semi-chemical pulp
narrower: Chemi-mechanical pulp

Other veneer plywood, interior grade
type: Concept
notation: 071.191
in scheme: Forest Products Classification and Definitions (FPC&D) v2022
definition: Veneer plywood suitable only for indoor applications.
broader: Other veneer plywood

Tops, small branches and twigs, coniferous, for uses n.e.c.
type: Concept
notation: 012.2119
in scheme: Forest Products Classification and Definitions (FPC&D) v2022
definition: N.A.
broader: Tops, small branches and twigs, coniferous

Other cartonboard n.e.c.
type: Concept
notation: 113.29
in scheme: Forest Products Classification and Definitions (FPC&D) v2022
definition: Other cartonboard not mentioned in the subgroups 113.21, 113.22, 113.23 and 113.24.
broader: Cartonboard

Other non-decorative veneer sheets
type: Concept
notation: 062.9
in scheme: Forest Products Classification and Definitions (FPC&D) v2022
definition: N.A.
broader: Non-decorative veneer sheets
narrower: Other non-decorative veneer sheets, for plywood (face and core material)
narrower: Other non-decorative veneer sheets, for other purposes (match boxes, violin, … )

Special coated paper and pulp products
type: Concept
notation: 142.
in scheme: Forest Products Classification and Definitions (FPC&D) v2022
definition: Paper, paperboard, cellulose wadding and webs of cellulose fibres, coated, impregnated, covered, surface-coloured, surface-decorated or printed, in rolls or sheets. It includes tarred, bituminised or asphalted paper and paperboard. It excludes composite paper and paperboard (made by sticking flat layers of paper or paperboard together with an adhesive), not surface-coated or impregnated.
broader: SECONDARY PAPER PRODUCTS
narrower: Special coated paper, tarred, bituminised or asphalted paper and paperboard
narrower: Special coated paper, gummed or adhesive paper and paperboard
narrower: Special coated paper, impregnated or covered with wax, paraffin wax, stearin, oil or glycerol
narrower: Other special coated paper, paperboard, cellulose wadding and webs of cellulose fibres

Roughly trimmed wood, coniferous, chipwood
type: Concept
notation: 024.15
in scheme: Forest Products Classification and Definitions (FPC&D) v2022
definition: This product encompasses flexible, narrow, thin and even strips of wood suitable for plaiting or for making sieves, chip-boxes, match-boxes, etc. It is produced by slicing, peeling or it is sawned.
broader: Roughly trimmed wood, coniferous

Pressurised stone groundwood
type: Concept
notation: 081.2
in scheme: Forest Products Classification and Definitions (FPC&D) v2022
definition: It is produced from roundwood or blocks in pressurised stone grinders.
broader: Mechanical wood pulp
narrower: Pressurised stone groundwood, unbleached
narrower: Pressurised stone groundwood, bleached

Shavings, coniferous, for energy
type: Concept
notation: 031.314
in scheme: Forest Products Classification and Definitions (FPC&D) v2022
definition: N.A.
broader: Shavings, coniferous

Other industrial roundwood
type: Concept
notation: 012.13
in scheme: Forest Products Classification and Definitions (FPC&D) v2022
definition: Industrial roundwood (wood in the rough) other than sawlogs, veneer logs and/or pulpwood. It includes roundwood that will be used for poles, piling, posts, fencing, pitprops, tanning, distillation and match blocks, etc.
broader: Wood in the rough from the main stem and branches
narrower: Other industrial roundwood, coniferous
narrower: Other industrial roundwood, tropical non-coniferous
narrower: Other industrial roundwood n.e.c.

Stone groundwood, bleached
type: Concept
notation: 081.12
in scheme: Forest Products Classification and Definitions (FPC&D) v2022
definition: Pulp treated with chemicals to increase its brightness.
broader: Stone groundwood
narrower: Stone groundwood, bleached, coniferous
narrower: Other bleached stone groundwood

Solid wood processing residues, coniferous, for particle board
type: Concept
notation: 031.112
in scheme: Forest Products Classification and Definitions (FPC&D) v2022
definition: N.A.
broader: Solid wood processing residues, coniferous

Case materials, testliner (recycled liner board)
type: Concept
notation: 113.13
in scheme: Forest Products Classification and Definitions (FPC&D) v2022
definition: Testliner, like kraftliner, is used for the outer and intermediate plies of corrugated board. However, its strength is not quite as high as that of kraftliner, as it has a higher recycled fibre content.
broader: Case materials

Stone groundwood, unbleached, coniferous
type: Concept
notation: 081.111
in scheme: Forest Products Classification and Definitions (FPC&D) v2022
definition: N.A.
broader: Stone groundwood, unbleached

Further processed sawnwood, tropical non-coniferous
type: Concept
notation: 131.2
in scheme: Forest Products Classification and Definitions (FPC&D) v2022
definition: N.A.
broader: Further processed sawnwood
narrower: Further processed sawnwood, tropical non-coniferous, boards with rounded edges or ends
narrower: Further processed sawnwood, tropical non-coniferous, V-jointed wood
narrower: Further processed sawnwood, tropical non-coniferous, beaded wood
narrower: Further processed sawnwood, tropical non-coniferous, moulded wood
narrower: Further processed sawnwood, tropical non-coniferous, rounded wood
narrower: Further processed sawnwood, tropical non-coniferous, thermowood and torrefied sawnwood
narrower: Other tropical non-coniferous further processed sawnwood

RECOVERED PAPER
top concept of: Forest Products Classification and Definitions (FPC&D) v2022
type: Concept
notation: 10
in scheme: Forest Products Classification and Definitions (FPC&D) v2022
definition: Waste and scraps of paper or paperboard that have been collected for re-use or trade. It includes paper and paperboard that has been used for its original purpose and residues from paper and paperboard production.
narrower: Other paper or paperboard made mainly of bleached chemical pulp, not coloured in the mass
narrower: Paper or paperboard made mainly of mechanical pulp (newspapers, journals and similar)
narrower: Other, including unsorted waste and scrap

Soda or sulphate chemical wood pulp, bleached or semi-bleached, coniferous
type: Concept
notation: 083.121
in scheme: Forest Products Classification and Definitions (FPC&D) v2022
definition: N.A.
broader: Soda or sulphate chemical wood pulp, bleached or semi-bleached

Wood briquettes
type: Concept
notation: 042.
in scheme: Forest Products Classification and Definitions (FPC&D) v2022
definition: Agglomerates produced either directly by compression or by the addition of a binder. Briquettes are cylindrical, with a diameter exceeding 25 mm (usually from 75 mm to 90 mm) and a length up to 300 mm.
broader: WOOD PELLETS AND OTHER AGGLOMERATES
narrower: Wood briquettes, coniferous
narrower: Wood briquettes, other

Cellular board, tropical non-coniferous
type: Concept
notation: 071.32
in scheme: Forest Products Classification and Definitions (FPC&D) v2022
definition: Plywood with a core of cellular construction, which are somewhat similar in appearance to the blockboard and battenboard but the battens or laths forming the core are spaced one from the other, either parallel or in lattice form. Cellular boards are used for partitions, doors and sometimes in the manufacture of furniture.
broader: Cellular board

Further processed sawnwood, tropical non-coniferous, beaded wood
type: Concept
notation: 131.23
in scheme: Forest Products Classification and Definitions (FPC&D) v2022
definition: It covers wood tongued and grooved with a simple bead between the edge or end and the tongue.
broader: Further processed sawnwood, tropical non-coniferous

Other wood free coated graphic papers
type: Concept
notation: 111.329
in scheme: Forest Products Classification and Definitions (FPC&D) v2022
definition: Other wood free coated graphic papers n.e.c.
broader: Coated graphic papers, woodfree

Other bleached thermo-mechanical pulp
type: Concept
notation: 081.429
in scheme: Forest Products Classification and Definitions (FPC&D) v2022
definition: N.A.
broader: Thermo-mechanical pulp, bleached

Other roundwood treated with preservatives, for posts
type: Concept
notation: 023.93
in scheme: Forest Products Classification and Definitions (FPC&D) v2022
definition: Round, hewn, squared or split wood, usually less than 3 m in length, but possibly up to 5 m used for fencing, guard rails and the like.
broader: Other roundwood treated with preservatives

Sulphite chemical wood pulp, unbleached, coniferous
type: Concept
notation: 083.211
in scheme: Forest Products Classification and Definitions (FPC&D) v2022
definition: N.A.
broader: Sulphite chemical wood pulp, unbleached

Wood charcoal, coniferous, for energy
type: Concept
notation: 021.11
in scheme: Forest Products Classification and Definitions (FPC&D) v2022
definition: N.A.
broader: Wood charcoal, coniferous

Wallpaper and similar wall coverings
type: Concept
notation: 146.1
in scheme: Forest Products Classification and Definitions (FPC&D) v2022
definition: It includes wallpaper and similar wall coverings in rolls of a width of not less than 45 cm and not more than 160 cm which consisting of coated or covered paper on the face side.
broader: Other articles of paper and paperboard ready for use

Other bark removed during processing
type: Concept
notation: 031.49
in scheme: Forest Products Classification and Definitions (FPC&D) v2022
definition: Bark, separated from the wood in the wood-processing industries.
broader: Bark removed during processing
narrower: Other bark removed during processing, for horticulture purposes
narrower: Other bark removed during processing, for energy
narrower: Other bark removed during processing ,for uses n.e.c.

Other wood charcoal
type: Concept
notation: 021.9
in scheme: Forest Products Classification and Definitions (FPC&D) v2022
definition: Wood carbonised by partial combustion or the application of heat from external sources. It can be in the form of blocks, sticks or in granules or powder, or agglomerated with tar or other substances in briquettes, tablets, balls, etc. It includes: charcoal used as a fuel or for other uses, e.g. as a reduction agent in metallurgy or as an absorption or filtration medium. "
broader: Wood charcoal
narrower: Other wood charcoal, for energy
narrower: Other wood charcoal, for uses n.e.c.

Pallets, box pallets and other load boards
type: Concept
notation: 132.3
in scheme: Forest Products Classification and Definitions (FPC&D) v2022
definition: It encompasses products which serve as a portable platforms for the assembly of a quantity of goods to form a unit load for handling, transportation and storage by mechanical appliances. It includes also platforms, post platforms, collar type box platforms, side rail platforms and end rail platforms.
broader: Wooden wrapping and packaging material

Roughly trimmed wood, coniferous, n.e.c.
type: Concept
notation: 024.19
in scheme: Forest Products Classification and Definitions (FPC&D) v2022
definition: These products also cover e.g. wood shavings, which are used in the manufacture of vinegar or for the clarification of liquids.
broader: Roughly trimmed wood, coniferous

Unbleached kraft paper or paperboard or corrugated paper or paperboard
type: Concept
notation: 101.
in scheme: Forest Products Classification and Definitions (FPC&D) v2022
definition: Unbleached kraft paper or paperboard or corrugated paper or paperboard
broader: Recovered fibre pulp

Other uncontaminated recoverable wood products, for particle board
type: Concept
notation: 033.192
in scheme: Forest Products Classification and Definitions (FPC&D) v2022
definition: N.A.
broader: Other uncontaminated recoverable wood products

Stone groundwood, bleached, coniferous
type: Concept
notation: 081.121
in scheme: Forest Products Classification and Definitions (FPC&D) v2022
definition: N.A.
broader: Stone groundwood, bleached

Stumps and roots, tropical non-coniferous, for pulp
type: Concept
notation: 012.2221
in scheme: Forest Products Classification and Definitions (FPC&D) v2022
definition: N.A.
broader: Stumps and roots, tropical non-coniferous

Other paper and paperboard labels
type: Concept
notation: 146.49
in scheme: Forest Products Classification and Definitions (FPC&D) v2022
definition: It includes plain paper and paperboard labels.
broader: Paper and paperboard labels

Roughly trimmed wood, coniferous, pointed piles, pickets and stakes
type: Concept
notation: 024.13
in scheme: Forest Products Classification and Definitions (FPC&D) v2022
definition: This class cover round or split poles, pointed at the ends, which can be peeled or impregnated with preservative
broader: Roughly trimmed wood, coniferous

Other industrial roundwood n.e.c., for other uses in the rough (fencing, …)
type: Concept
notation: 012.1395
in scheme: Forest Products Classification and Definitions (FPC&D) v2022
definition: N.A.
broader: Other industrial roundwood n.e.c.

Parts of coopers' products from wood, including staves
type: Concept
notation: 132.6
in scheme: Forest Products Classification and Definitions (FPC&D) v2022
definition: It includes barrel heads, hoopwood and unfinished staves (stavewood).
broader: Wooden wrapping and packaging material

Prefabricated buildings, of wood, incomplete buildings
type: Concept
notation: 137.3
in scheme: Forest Products Classification and Definitions (FPC&D) v2022
definition: It includes incomplete buildings, whether or not assembled and having the essential character of prefabricated buildings.
broader: Prefabricated buildings of wood

Uncoated graphic papers, mechanical
type: Concept
notation: 111.21
in scheme: Forest Products Classification and Definitions (FPC&D) v2022
definition: Paper and paperboard containing 10 % or more fibres obtained by mechanical or thermo-mechanical process.
broader: Uncoated graphic papers

Other articles of paper and paperboard ready for use, trays, dishes, plates, cups and similar
type: Concept
notation: 146.93
in scheme: Forest Products Classification and Definitions (FPC&D) v2022
definition: It includes trays, dishes, plates, cups and similar, of paper and paperboard.
broader: Other articles of paper and paperboard ready for use

Core plywood, with both outer plies of coniferous wood
type: Concept
notation: 071.21
in scheme: Forest Products Classification and Definitions (FPC&D) v2022
definition: Core plywood is a plywood with a solid core. Core can consist of MDF, particle board, veneer or from narrow boards, blocks or strips of wood.
broader: Core plywood
narrower: Core plywood, with both outer plies of coniferous wood, blockboard, laminboard and battenboard
narrower: Core plywood, with both outer plies of coniferous wood, n.e.c. (MDF core, particleboard core, veneer core, etc.)

Bark removed during processing, coniferous, for energy
type: Concept
notation: 031.412
in scheme: Forest Products Classification and Definitions (FPC&D) v2022
definition: N.A.
broader: Bark removed during processing, coniferous

Other uncontaminated recoverable wood products, for uses n.e.c.
type: Concept
notation: 033.199
in scheme: Forest Products Classification and Definitions (FPC&D) v2022
definition: N.A.
broader: Other uncontaminated recoverable wood products

Sulphite dissolving wood pulp
type: Concept
notation: 084.2
in scheme: Forest Products Classification and Definitions (FPC&D) v2022
definition: Dissolving grade wood pulp obtained by use of the sulphite process (description in the group 083.2).
broader: Dissolving wood pulp
narrower: Sulphite dissolving wood pulp, coniferous
narrower: Other sulphite dissolving wood pulp

SECONDARY PAPER PRODUCTS
top concept of: Forest Products Classification and Definitions (FPC&D) v2022
type: Concept
notation: 14
in scheme: Forest Products Classification and Definitions (FPC&D) v2022
definition: It includes all articles of paper ready for use.
narrower: Composite paper and paperboard
narrower: Special coated paper and pulp products
narrower: Carbon paper and copying paper ready for use
narrower: Household and sanitary paper ready for use
narrower: Packaging cartons, boxes, etc.
narrower: Other articles of paper and paperboard ready for use

Sanitary towels and tampons, napkins and napkin liners
type: Concept
notation: 144.4
in scheme: Forest Products Classification and Definitions (FPC&D) v2022
definition: Sanitary towels and tampons, napkins and napkin liners in strips or rolls of a width not exceeding 36 cm.
broader: Household and sanitary paper ready for use

Solid wood processing residues, coniferous, for pulp
type: Concept
notation: 031.111
in scheme: Forest Products Classification and Definitions (FPC&D) v2022
definition: N.A.
broader: Solid wood processing residues, coniferous

Other industrial roundwood, coniferous, used for posts
type: Concept
notation: 012.1314
in scheme: Forest Products Classification and Definitions (FPC&D) v2022
definition: N.A.
broader: Other industrial roundwood, coniferous

Other tops, small branches and twigs, for pulp
type: Concept
notation: 012.2191
in scheme: Forest Products Classification and Definitions (FPC&D) v2022
definition: N.A.
broader: Other tops, small branches and twigs

Other wood chips and particles from wood processing, for uses n.e.c.
type: Concept
notation: 032.299
in scheme: Forest Products Classification and Definitions (FPC&D) v2022
definition: N.A.
broader: Other wood chips and particles from wood processing

Wood chips and particles from wood processing, coniferous, for pulp
type: Concept
notation: 032.211
in scheme: Forest Products Classification and Definitions (FPC&D) v2022
definition: N.A.
broader: Wood chips and particles from wood processing, coniferous

Forest Products Classification and Definitions (FPC&D) v2022
creator: Caliper team (http://www.fao.org/statistics/caliper/)
publisher: Caliper team (http://www.fao.org/statistics/caliper/)
creator: caliper
publisher: caliper
modified: 2023-03-14
conforms to: core#
media type: https://www.iana.org/assignments/media-types/application/rdf+xml
source: https://www.fao.org/3/cb8216en/cb8216en.pdf
belongs to: FPC&D2022 DATASET
is part of: caliper
type: ConceptScheme
notation: FPC&D2022
version info: 2022
levels: FPC&D2022: Level 1
levels: FPC&D2022: Level 2
levels: FPC&D2022: Level 3
levels: FPC&D2022: Level 4
levels: FPC&D2022: Level 5
levels: FPC&D2022: Level 6
number of levels: 6

Stumps and roots, tropical non-coniferous, for particle board
type: Concept
notation: 012.2222
in scheme: Forest Products Classification and Definitions (FPC&D) v2022
definition: N.A.
broader: Stumps and roots, tropical non-coniferous

Other bark separated in the forest from wood in the rough
type: Concept
notation: 012.239
in scheme: Forest Products Classification and Definitions (FPC&D) v2022
definition: Includes all bark removed from the sterns or other parts of the tree during harvesting operations, as well as bark removed at the lower landing. It can be used for horticulture purposes or for other uses.
broader: Bark separated in the forest from wood in the rough
narrower: Other bark separated in the forest from wood in the rough, for horticulture purposes
narrower: Other bark separated in the forest from wood in the rough, for uses n.e.c.

Pulpwood and wood for wood-based panels, coniferous, for particle board
type: Concept
notation: 012.1212
in scheme: Forest Products Classification and Definitions (FPC&D) v2022
definition: N.A.
broader: Pulpwood and wood for wood-based panels, coniferous

Sawdust, coniferous, for pulp
type: Concept
notation: 031.211
in scheme: Forest Products Classification and Definitions (FPC&D) v2022
definition: N.A.
broader: Sawdust, coniferous

Other solid wood processing residues
type: Concept
notation: 031.19
in scheme: Forest Products Classification and Definitions (FPC&D) v2022
definition: Pieces of wood arising during processing, which have not been broken down into chips, sawdust, shavings or smaller particles. These pieces are suitable as raw material for the manufacture of pulp, particle board, fibreboard, etc. This category includes for example sawmill rejects, slabs, edgings and trimmings, veneer log cores, veneer rejects, sawdust, residues from carpentry and joinery production, etc. Excluded are bark and contaminated residues.
broader: Solid wood processing residues
narrower: Other solid wood processing residues, for pulp
narrower: Other solid wood processing residues, for particle board
narrower: Other solid wood processing residues, for fibreboard
narrower: Other solid wood processing residues, for energy
narrower: Other solid wood processing residues, for uses n.e.c.

Other residues of wood processing, not of solid wood n.e.c., for other uses
type: Concept
notation: 031.999
in scheme: Forest Products Classification and Definitions (FPC&D) v2022
definition: N.A.
broader: Other residues of wood processing, not of solid wood n.e.c.

Other industrial roundwood, coniferous
type: Concept
notation: 012.131
in scheme: Forest Products Classification and Definitions (FPC&D) v2022
definition: Industrial roundwood (wood in the rough) other than sawlogs, veneer logs and/or pulpwood. It includes roundwood that will be used for poles, piling, posts, fencing, pitprops, tanning, distillation and match blocks, etc.
broader: Other industrial roundwood
narrower: Other industrial roundwood, coniferous, used for poles
narrower: Other industrial roundwood, coniferous, used for piling
narrower: Other industrial roundwood, coniferous, used for pitprops
narrower: Other industrial roundwood, coniferous, used for posts
narrower: Other industrial roundwood, coniferous, for other uses in the rough (fencing, …)
narrower: Other industrial roundwood, coniferous, for other uses - tanning, distillation, match blocks, gazogenes

Other sawdust, for uses n.e.c.
type: Concept
notation: 031.299
in scheme: Forest Products Classification and Definitions (FPC&D) v2022
definition: N.A.
broader: Other sawdust

Other cement bonded panels
type: Concept
notation: 077.19
in scheme: Forest Products Classification and Definitions (FPC&D) v2022
definition: Includes notably wood-cement blocks wherein the wood particles are of varying type.
broader: Cement bonded panels

Sawdust, coniferous, for energy
type: Concept
notation: 031.214
in scheme: Forest Products Classification and Definitions (FPC&D) v2022
definition: N.A.
broader: Sawdust, coniferous

Other wood pellets, for energy
type: Concept
notation: 041.91
in scheme: Forest Products Classification and Definitions (FPC&D) v2022
definition: N.A.
broader: Other wood pellets

Other solid wood processing residues, for fibreboard
type: Concept
notation: 031.193
in scheme: Forest Products Classification and Definitions (FPC&D) v2022
definition: N.A.
broader: Other solid wood processing residues

Other solid wood processing residues, for energy
type: Concept
notation: 031.194
in scheme: Forest Products Classification and Definitions (FPC&D) v2022
definition: N.A.
broader: Other solid wood processing residues

Tops, small branches and twigs, tropical non-coniferous, for pulp
type: Concept
notation: 012.2121
in scheme: Forest Products Classification and Definitions (FPC&D) v2022
definition: N.A.
broader: Tops, small branches and twigs, tropical non-coniferous

Dry process fibreboard of a density exceeding 0.8 g/cm³, of a thickness not exceeding 5 mm
type: Concept
notation: 074.131
in scheme: Forest Products Classification and Definitions (FPC&D) v2022
definition: N.A.
broader: Dry process fibreboard of a density exceeding 0.8 g/cm³

Other wood charcoal, for energy
type: Concept
notation: 021.91
in scheme: Forest Products Classification and Definitions (FPC&D) v2022
definition: N.A.
broader: Other wood charcoal

Sawlogs and veneer logs, tropical non-coniferous, for sawnwood and railway sleepers
type: Concept
notation: 012.1121
in scheme: Forest Products Classification and Definitions (FPC&D) v2022
definition: N.A.
broader: Sawlogs and veneer logs, tropical non-coniferous

Carbon paper and copying paper ready for use
type: Concept
notation: 143.
in scheme: Forest Products Classification and Definitions (FPC&D) v2022
definition: Paper coated on one side with a layer of a loosely bound dry ink or pigmented coating, bound with wax, used for making one or more copies simultaneously with the creation of an original document by applying pressure (using a typewriter or a ballpoint pen). These products must be in strips or rolls of a width not exceeding 36 cm.
broader: SECONDARY PAPER PRODUCTS
narrower: Carbon or similar copying papers
narrower: Self-copy paper
narrower: Heat transfer papers
narrower: Paper for duplicator stencils and duplicator stencils
narrower: Paper for offset plates and offset plates
narrower: Other carbon paper and copying paper ready for use

Other non-coniferous, sleepers, other
type: Concept
notation: 053.19
in scheme: Forest Products Classification and Definitions (FPC&D) v2022
definition: Sleepers which are not treated with insecticides or fungicides nor impregnated.
broader: Other non-coniferous, sleepers

Other wood chips and particles from recovered wood products, for uses n.e.c.
type: Concept
notation: 032.399
in scheme: Forest Products Classification and Definitions (FPC&D) v2022
definition: N.A.
broader: Other wood chips and particles from recovered wood products

Paper and paperboard stationery, registers, account books, note books, order books and similar
type: Concept
notation: 146.34
in scheme: Forest Products Classification and Definitions (FPC&D) v2022
definition: It includes registers, account books, note books of all kinds, order books, receipt books, copy books, diaries, letter pads, memorandum pads, engagements books, address books, etc.
broader: Paper and paperboard stationery

Soda or sulphate chemical wood pulp, bleached or semi-bleached
type: Concept
notation: 083.12
in scheme: Forest Products Classification and Definitions (FPC&D) v2022
definition: Pulp treated with chemicals to increase its brightness.
broader: Soda or sulphate chemical wood pulp
narrower: Soda or sulphate chemical wood pulp, bleached or semi-bleached, coniferous
narrower: Other bleached or semi-bleached soda or sulphate chemical wood pulp

Other articles of paper and paperboard ready for use
type: Concept
notation: 146.9
in scheme: Forest Products Classification and Definitions (FPC&D) v2022
definition: It includes other articles of paper and paperboard ready for use not mentioned in the groups 146.1, 146.2, 146.3, 146.4 and 146.5, like filter paper and paperboard, trays, dishes, plates, etc.
broader: Other articles of paper and paperboard ready for use
narrower: Other articles of paper and paperboard ready for use, filter paper and paperboard
narrower: Other articles of paper and paperboard ready for use, rolls, sheets and dials, printed for self-recording apparatus
narrower: Other articles of paper and paperboard ready for use, trays, dishes, plates, cups and similar
narrower: Other articles of paper and paperboard ready for use, moulded or pressed articles of paper pulp
narrower: Other articles of paper and paperboard ready for use, printing and writing papers ready for use
narrower: Other articles of paper and paperboard ready for use n.e.c.

Cement bonded panels, wood strand cement board (cement OSB)
type: Concept
notation: 077.13
in scheme: Forest Products Classification and Definitions (FPC&D) v2022
definition: Panels composed of long and thin wood strands bonded with Portland cement.
broader: Cement bonded panels

Agglomerated cork and articles of agglomerated cork
type: Concept
notation: 122.
in scheme: Forest Products Classification and Definitions (FPC&D) v2022
definition: Agglomerated cork is manufactured by agglomerating crushed, granulated or ground cork generally under heat and pressure either with an added binding substance or without them.
broader: CORK
narrower: Agglomerated cork and articles of agglomerated cork, with a binding substance
narrower: Agglomerated cork and articles of agglomerated cork, without a binding substance

Case materials, fluting paper, semi-chemical
type: Concept
notation: 113.121
in scheme: Forest Products Classification and Definitions (FPC&D) v2022
definition: Fluting paper made wholly or principally of semi-chemical woodpulp.
broader: Case materials, fluting paper

Pulps of fibres derived from recovered (waste and scrap) paper or paperboard, unbleached
type: Concept
notation: 092.11
in scheme: Forest Products Classification and Definitions (FPC&D) v2022
definition: Pulp not treated with chemicals to increase its brightness.
broader: Pulps of fibres derived from recovered (waste and scrap) paper or paperboard

Core plywood, with both outer plies of coniferous wood, blockboard, laminboard and battenboard
type: Concept
notation: 071.211
in scheme: Forest Products Classification and Definitions (FPC&D) v2022
definition: Plywood with a solid core (i.e. the central layer, generally thicker than the other plies) that consists of narrow boards, blocks or strips of wood placed side by side, which may or may not be glued together.
broader: Core plywood, with both outer plies of coniferous wood

Semi-chemical pulp, unbleached, coniferous
type: Concept
notation: 082.111
in scheme: Forest Products Classification and Definitions (FPC&D) v2022
definition: N.A.
broader: Semi-chemical pulp, unbleached

Cement bonded panels
type: Concept
notation: 077.1
in scheme: Forest Products Classification and Definitions (FPC&D) v2022
definition: Panels manufactured from wood wool, chips, particles, flakes, etc. of wood or other ligno-cellulosic material bonded together with cement and chemical additives. Wood constitutes the major part of the panel, by volume.
broader: Other panels based on wood or other ligno-cellulosic materials
narrower: Cement bonded panels, cement bonded particle board
narrower: Cement bonded panels, cement bonded wood wool board
narrower: Cement bonded panels, wood strand cement board (cement OSB)
narrower: Cement bonded panels, fibre-reinforced cement board
narrower: Other cement bonded panels

Other paper and paperboard, cigarette paper
type: Concept
notation: 114.6
in scheme: Forest Products Classification and Definitions (FPC&D) v2022
definition: This item cover all cigarette paper regardless of its size or presentation. This paper is of good quality (frequently of hemp or linen rag pulp), but very thin and relatively strong.
broader: Other paper and paperboard

Solid wood processing residues
type: Concept
notation: 031.1
in scheme: Forest Products Classification and Definitions (FPC&D) v2022
definition: Pieces of wood arising during processing, which have not been broken down into chips, sawdust, shavings or smaller particles. These pieces are suitable as raw material for the manufacture of pulp, particle board, fibreboard, etc. This category includes for example sawmill rejects, slabs, edgings and trimmings, veneer log cores, veneer rejects, sawdust, residues from carpentry and joinery production, etc. Excluded are bark and contaminated residues.
broader: Wood residues (including wood for agglomerates)
narrower: Solid wood processing residues, coniferous
narrower: Other solid wood processing residues

Other wooden wrapping and packaging material
type: Concept
notation: 132.9
in scheme: Forest Products Classification and Definitions (FPC&D) v2022
definition: Other wooden wrapping and packaging material not mentioned in the groups 132.1, 132.2, 132.3, 132.4, 132.5 and 132.6
broader: Wooden wrapping and packaging material

Sawlogs and veneer logs, tropical non-coniferous, for uses n.e.c.
type: Concept
notation: 012.1129
in scheme: Forest Products Classification and Definitions (FPC&D) v2022
definition: N.A.
broader: Sawlogs and veneer logs, tropical non-coniferous

Tropical non-coniferous, sawnwood planed, treated or impregnated
type: Concept
notation: 052.31
in scheme: Forest Products Classification and Definitions (FPC&D) v2022
definition: Wood sawn or chipped lengthwise, and planed, sanded or finger-jointed, which was not kiln- or air-dried but was treated with insecticides or fungicides for the purpose of protection. For long-term preservation they can be impregnated with creosote or other substances.
broader: Tropical non-coniferous, sawnwood planed

Other shavings, for uses n.e.c.
type: Concept
notation: 031.399
in scheme: Forest Products Classification and Definitions (FPC&D) v2022
definition: N.A.
broader: Other shavings

Other wood chips and particles from wood in the rough, for uses n.e.c.
type: Concept
notation: 032.199
in scheme: Forest Products Classification and Definitions (FPC&D) v2022
definition: N.A.
broader: Other wood chips and particles from wood in the rough

General purpose OSB and OSB for interior fitments
type: Concept
notation: 073.1
in scheme: Forest Products Classification and Definitions (FPC&D) v2022
definition: OSB used only in dry conditions, mainly for interior fitments (including furniture), grade OSB/1.
broader: Oriented strand board (OSB)
narrower: General purpose OSB and OSB for interior fitments, used in dry conditions
narrower: Other general purpose OSB and OSB for interior fitments

Thermo-mechanical pulp, bleached, coniferous
type: Concept
notation: 081.421
in scheme: Forest Products Classification and Definitions (FPC&D) v2022
definition: N.A.
broader: Thermo-mechanical pulp, bleached

Other tropical non-coniferous further processed sawnwood
type: Concept
notation: 131.29
in scheme: Forest Products Classification and Definitions (FPC&D) v2022
definition: Other further processed sawnwood not mentioned in the previous items.
broader: Further processed sawnwood, tropical non-coniferous

Thermoplastic bonded panels, wood-plastic composite
type: Concept
notation: 077.31
in scheme: Forest Products Classification and Definitions (FPC&D) v2022
definition: Wood-plastic composite are composite materials made of wood fibre or wood flour and thermoplastic. They are produced by thoroughly mixing ground wood particles and heated thermoplastic resin. The most common method of production is to extrude the material into the desired shape.
broader: Thermoplastic bonded panels

Roundwood treated with preservatives, coniferous
type: Concept
notation: 023.1
in scheme: Forest Products Classification and Definitions (FPC&D) v2022
definition: This group covers products which have been treated with paint, stains, creosote or other preservatives, in order to increase their resistance. It excludes: products treated with substances for the purpose of simply maintaining them during shipment or storage, torrefied pellets
broader: Roundwood treated with preservatives
narrower: Roundwood treated with preservatives, coniferous, for poles
narrower: Roundwood treated with preservatives, coniferous, for piling
narrower: Roundwood treated with preservatives, coniferous, for posts
narrower: Roundwood treated with preservatives, coniferous, for uses n.e.c.

Decorative veneer sheets, tropical non-coniferous, for other purposes (facing of sawnwood, panel, furniture, etc.)
type: Concept
notation: 061.29
in scheme: Forest Products Classification and Definitions (FPC&D) v2022
definition: Decorative veneer sheets not intended for the manufacture of plywood. Possible uses are the veneering of furniture, sawnwood, or panels other than plywood, or marquetry and inlay work.
broader: Decorative veneer sheets, tropical non-coniferous

Sulphite chemical wood pulp
type: Concept
notation: 083.2
in scheme: Forest Products Classification and Definitions (FPC&D) v2022
definition: Wood pulp obtained by mechanically reducing pulpwood, wood chips, particles or residues to small pieces that are subsequently cooked in a pressure vessel in the presence of a bisulphite cooking liquor. Bisulphites such as ammonium, calcium, magnesium and sodium are commonly used in this process. The process is used extensively for the treatment of spruce fibre. It is used alone or mixed with other pulps, for various writing or printing papers, etc.
broader: Chemical wood pulp
narrower: Sulphite chemical wood pulp, unbleached
narrower: Sulphite chemical wood pulp, bleached or semi-bleached

Stumps and roots, tropical non-coniferous
type: Concept
notation: 011.922
in scheme: Forest Products Classification and Definitions (FPC&D) v2022
definition: N.A.
broader: Stumps and roots
narrower: Stumps and roots, tropical non-coniferous, for pellets
narrower: Stumps and roots, tropical non-coniferous, for uses n.e.c.

Other oriented strandboard n.e.c.
type: Concept
notation: 073.9
in scheme: Forest Products Classification and Definitions (FPC&D) v2022
definition: N.A.
broader: Oriented strand board (OSB)

Other veneer plywood
type: Concept
notation: 071.19
in scheme: Forest Products Classification and Definitions (FPC&D) v2022
definition: N.A.
broader: Veneer plywood
narrower: Other veneer plywood, interior grade
narrower: Other veneer plywood, exterior grade

Wood fuel from the main stem and branches, tropical non-coniferous
type: Concept
notation: 011.12
in scheme: Forest Products Classification and Definitions (FPC&D) v2022
definition: It includes wood from main stem and branches where these are harvested for fuel. It also includes wood chips to be used for fuel that are made directly (i.e. in the forest) from roundwood.
broader: Wood fuel from the main stem and branches
narrower: Wood fuel, tropical non-coniferous, for pellets
narrower: Wood fuel, tropical non-coniferous, for uses n.e.c.

Other wood fuel from the main stem and branches
type: Concept
notation: 011.19
in scheme: Forest Products Classification and Definitions (FPC&D) v2022
definition: It includes wood from main stem and branches where these are harvested for fuel. It also includes wood chips to be used for fuel that are made directly (i.e. in the forest) from roundwood.
broader: Wood fuel from the main stem and branches
narrower: Other wood fuel from main stem and branches, for pellets
narrower: Other wood fuel from main stem and branches, for uses n.e.c.

Wood pellets, coniferous, for energy
type: Concept
notation: 041.11
in scheme: Forest Products Classification and Definitions (FPC&D) v2022
definition: N.A.
broader: Wood pellets, coniferous

Core plywood
type: Concept
notation: 071.2
in scheme: Forest Products Classification and Definitions (FPC&D) v2022
definition: Core plywood is a plywood with a solid core. Core can consist of MDF, particle board, veneer or from narrow boards, blocks or strips of wood.
broader: Plywood
narrower: Core plywood, with both outer plies of coniferous wood
narrower: Core plywood, with at least one outer ply of tropical wood
narrower: Other core plywood, with at least one outer ply of non-coniferous non-tropical wood

Dry process fibreboard
type: Concept
notation: 074.1
in scheme: Forest Products Classification and Definitions (FPC&D) v2022
definition: Dry process fibreboards are engineered woodbased panel materials made by bonding together wood fibres with a synthetic resin adhesive. The resinated fibres are dried and then formed into a mattress ready for pressing. The mattress is pressed between heated polished press plates to the desired thickness. Dry process fibreboards have a fibre moisture content of less than 20 % at the forming stage.
broader: Fibreboard
narrower: Dry process fibreboard of a density not exceeding 0.5 g/cm³
narrower: Dry process fibreboard of a density exceeding 0.5 g/cm³ but not exceeding 0.8 g/cm³
narrower: Dry process fibreboard of a density exceeding 0.8 g/cm³

Uncontaminated recoverable wood products
type: Concept
notation: 033.1
in scheme: Forest Products Classification and Definitions (FPC&D) v2022
definition: The recoverable wood products have not been contaminated (e.g. by impregnation, gluing, coating, painting or nailing) to such an extent that they are unsuitable as raw material for pulp particle board or fibreboard. Examples are some pallets and wood packing cases.
broader: Recoverable wood products
narrower: Uncontaminated recoverable wood products, coniferous
narrower: Other uncontaminated recoverable wood products

Plywood
type: Concept
notation: 071.
in scheme: Forest Products Classification and Definitions (FPC&D) v2022
definition: Plywood is a panel consisting of an assembly of veneer sheets bonded together with the direction of the grain in alternate plies generally at right angles. The veneer sheets are usually placed symmetrically on both sides of a central ply or core that may itself be made from a veneer sheet or another material. It includes veneer plywood, core plywood or blockboard, cellular board and composite plywood. It excludes laminated construction materials (e.g. glulam), where the grain of the veneer sheets generally runs in the same direction.
broader: WOOD-BASED PANELS
narrower: Veneer plywood
narrower: Core plywood
narrower: Cellular board
narrower: Laminated veneered lumber (LVL)
narrower: Other plywood n.e.c.

Wood chips and particles from wood in the rough, coniferous
type: Concept
notation: 032.11
in scheme: Forest Products Classification and Definitions (FPC&D) v2022
definition: Wood, which has been deliberately reduced to chips, particles, flakes, etc. directly from wood in the rough, not during the processing of wood.
broader: Wood chips and particles from wood in the rough
narrower: Wood chips and particles from wood in the rough, coniferous, for pulp
narrower: Wood chips and particles from wood in the rough, coniferous, for particle board
narrower: Wood chips and particles from wood in the rough, coniferous, for fibreboard
narrower: Wood chips and particles from wood in the rough, coniferous, for energy
narrower: Wood chips and particles from wood in the rough, coniferous, for uses n.e.c.

Uncontaminated recoverable wood products, coniferous, for particle board
type: Concept
notation: 033.112
in scheme: Forest Products Classification and Definitions (FPC&D) v2022
definition: N.A.
broader: Uncontaminated recoverable wood products, coniferous

Other non-coniferous, sawnwood rough, treated or impregnated
type: Concept
notation: 053.21
in scheme: Forest Products Classification and Definitions (FPC&D) v2022
definition: Wood sawn or chipped lengthwise, not planed, sanded or finger-jointed and which was treated with insecticides or fungicides for the purpose of protection. For long-term preservation they can be impregnated with creosote or other substances.
broader: Other non-coniferous, sawnwood rough

Tablecloths and serviettes
type: Concept
notation: 144.3
in scheme: Forest Products Classification and Definitions (FPC&D) v2022
definition: Tablecloths and serviettes in strips or rolls of a width not exceeding 36 cm.
broader: Household and sanitary paper ready for use

Clothes hangers
type: Concept
notation: 134.4
in scheme: Forest Products Classification and Definitions (FPC&D) v2022
definition: Wooden clothes hanger consists of a flat piece of wood cut into a boomerang-like shape with the edges sanded down to prevent damage to the clothing, and a hook, usually of metal, protruding from the point. Some wooden hangers have a rounded bar from tip to tip, forming a flattened triangle. This bar is designed to hang the trousers belonging to the jacket.
broader: Other manufactured wood products

Semi-chemical pulp, unbleached
type: Concept
notation: 082.11
in scheme: Forest Products Classification and Definitions (FPC&D) v2022
definition: Pulp not treated with chemicals to increase its brightness.
broader: Semi-chemical pulp
narrower: Semi-chemical pulp, unbleached, coniferous
narrower: Other unbleached semi-chemical pulp

Other wood chips and particles from wood in the rough
type: Concept
notation: 032.19
in scheme: Forest Products Classification and Definitions (FPC&D) v2022
definition: Wood, which has been deliberately reduced to chips, particles, flakes, etc. directly from wood in the rough, not during the processing of wood.
broader: Wood chips and particles from wood in the rough
narrower: Other wood chips and particles from wood in the rough, for pulp
narrower: Other wood chips and particles from wood in the rough, for particle board
narrower: Other wood chips and particles from wood in the rough, for fibreboard
narrower: Other wood chips and particles from wood in the rough, for energy
narrower: Other wood chips and particles from wood in the rough, for uses n.e.c.

Other industrial roundwood, coniferous, used for piling
type: Concept
notation: 012.1312
in scheme: Forest Products Classification and Definitions (FPC&D) v2022
definition: N.A.
broader: Other industrial roundwood, coniferous

Load-bearing OSB
type: Concept
notation: 073.2
in scheme: Forest Products Classification and Definitions (FPC&D) v2022
definition: Load-bearing OSB used in dry (grade OSB/2) or humid (grade OSB/3) conditions.
broader: Oriented strand board (OSB)
narrower: Load-bearing OSB, used in dry conditions
narrower: Other load-bearing OSB

Other paper and paperboard
type: Concept
notation: 114.
in scheme: Forest Products Classification and Definitions (FPC&D) v2022
definition: Other papers and paperboards for industrial and special purposes. It includes cigarette papers and stock of filter papers, as well as gypsum liners and special papers for insulating, roofing, and other specific applications or treatments; wallpaper base; unbleached kraft paper and paperboard that are not sack kraft paper or Kraftliner and weighing more than 150 g/m² but less than 225 g/m²; felt paper and paperboard; tracing papers; not further processed uncoated paper weighing 225 g/m² or more; and raw copying and transfer papers, in rolls or sheets except carbon or self-copy paper. It excludes all composite, not coated, paper and paper board of flat layers stuck together; coated paper and paperboard not uniformly bleached throughout the mass; and paper and paperboard covered or coated with plastics (excluding adhesives).
broader: PAPER AND PAPERBOARD
narrower: Other paper and paperboard, wallpaper base
narrower: Other paper and paperboard, filter paper and paperboard
narrower: Other paper and paperboard, felt paper and paperboard
narrower: Other paper and paperboard, tracing papers
narrower: Other paper and paperboard, filter blocks, slabs and plates of paper pulp
narrower: Other paper and paperboard, cigarette paper
narrower: Other paper and paperboard n.e.c.

Coniferous, sawnwood rough
type: Concept
notation: 051.2
in scheme: Forest Products Classification and Definitions (FPC&D) v2022
definition: Wood sawn or chipped lengthwise, not planed, sanded or finger-jointed. It may be green (undried) or dried. It excludes sawn and hewn railway sleepers, wood shingles and sawn veneer sheets.
broader: Coniferous, sawnwood and sleepers
narrower: Coniferous, sawnwood rough, treated or impregnated
narrower: Coniferous, sawnwood rough, n.e.c.

Other industrial roundwood, coniferous, used for poles
type: Concept
notation: 012.1311
in scheme: Forest Products Classification and Definitions (FPC&D) v2022
definition: N.A.
broader: Other industrial roundwood, coniferous

Other agglomerates n.e.c., for energy
type: Concept
notation: 043.91
in scheme: Forest Products Classification and Definitions (FPC&D) v2022
definition: N.A.
broader: Other agglomerates n.e.c.

Thermo-mechanical pulp, unbleached
type: Concept
notation: 081.41
in scheme: Forest Products Classification and Definitions (FPC&D) v2022
definition: Pulp not treated with chemicals to increase its brightness.
broader: Thermo-mechanical pulp
narrower: Thermo-mechanical pulp, unbleached, coniferous
narrower: Other unbleached thermo-mechanical pulp

Other industrial roundwood, tropical non-coniferous
type: Concept
notation: 012.132
in scheme: Forest Products Classification and Definitions (FPC&D) v2022
definition: Industrial roundwood (wood in the rough) other than sawlogs, veneer logs and/or pulpwood. It includes roundwood that will be used for poles, piling, posts, fencing, pitprops, tanning, distillation and match blocks, etc.
broader: Other industrial roundwood
narrower: Other industrial roundwood, tropical non-coniferous, used for poles
narrower: Other industrial roundwood, tropical non-coniferous, used for piling
narrower: Other industrial roundwood, tropical non-coniferous, used for pitprops
narrower: Other industrial roundwood, tropical non-coniferous, used for posts
narrower: Other industrial roundwood, tropical non-coniferous, for other uses in the rough (fencing, …)
narrower: Other industrial roundwood, tropical non-coniferous, for other uses - tanning, distillation, match blocks, gazogenes

FPC&D2022: Level 2
type: ClassificationLevel
depth: 2

Other combination boards n.e.c.
type: Concept
notation: 076.9
in scheme: Forest Products Classification and Definitions (FPC&D) v2022
definition: Combination boards other than those included in the groups 0761, 0762, 0763.
broader: Combination board

Heavy-duty load-bearing OSB, used in humid conditions
type: Concept
notation: 073.31
in scheme: Forest Products Classification and Definitions (FPC&D) v2022
definition: Heavy-duty load-bearing boards used in humid conditions (grade OSB/4).
broader: Heavy-duty load-bearing OSB

Other thermoplastic bonded panels
type: Concept
notation: 077.39
in scheme: Forest Products Classification and Definitions (FPC&D) v2022
definition: These composite contain no cellulose-based fibre fillers such as pulp fibres, peanut hulls, bamboo, straw, digestate, etc.
broader: Thermoplastic bonded panels

Other residues of wood processing, not of solid wood n.e.c., for energy
type: Concept
notation: 031.991
in scheme: Forest Products Classification and Definitions (FPC&D) v2022
definition: N.A.
broader: Other residues of wood processing, not of solid wood n.e.c.

Uncoated graphic papers, wood free, used as a base for photo-sensitive, heat-sensitive or electro-sensitive paper or paperboard
type: Concept
notation: 111.222
in scheme: Forest Products Classification and Definitions (FPC&D) v2022
definition: Paper and paperboard used as a base for photo-sensitive, heat-sensitive or electro-sensitive paper or paperboard.
broader: Uncoated graphic papers, wood free

Other unbleached chemi-mechanical pulp
type: Concept
notation: 082.219
in scheme: Forest Products Classification and Definitions (FPC&D) v2022
definition: N.A.
broader: Chemi-mechanical pulp, unbleached

Wrapping papers, kraft paper creped or crinkled
type: Concept
notation: 113.38
in scheme: Forest Products Classification and Definitions (FPC&D) v2022
definition: Creped and crinkled papers are made by mechanical treatment of the webs of paper in the moist state or by passing the made paper between rollers with wrinkled surfaces. The product has a wrinkled appearance and the property of high elasticity.
broader: Wrapping papers

Tropical non-coniferous, sleepers, n.e.c.
type: Concept
notation: 052.19
in scheme: Forest Products Classification and Definitions (FPC&D) v2022
definition: Sleepers which are not treated with insecticides or fungicides nor impregnated.
broader: Tropical non-coniferous, sleepers

Densified wood
type: Concept
notation: 075.
in scheme: Forest Products Classification and Definitions (FPC&D) v2022
definition: Densified wood has been chemically or physically treated to increase its density or hardness and improve its mechanical strength or resistance to chemical or electrical agencies. It may be solid or consist of several layers bonded together and have a density as great as 1.4 g/cm3. It is generally used in the manufacture of gears, shuttles, bearings and other machine parts, propellers, insulators and other electric goods, etc.
broader: WOOD-BASED PANELS

Other decorative veneer sheets, for other purposes (facing of sawnwood, panel, furniture, etc.)
type: Concept
notation: 061.99
in scheme: Forest Products Classification and Definitions (FPC&D) v2022
definition: Decorative veneer sheets not intended for the manufacture of plywood. Possible uses are the veneering of furniture, sawnwood, or panels other than plywood, or marquetry and inlay work.
broader: Other decorative veneer sheets

Roughly trimmed wood, coniferous
type: Concept
notation: 024.1
in scheme: Forest Products Classification and Definitions (FPC&D) v2022
definition: It includes: Hoopwood; split poles; piles, pickets and stakes of wood, pointed but not sawn lengthwise; wooden sticks, roughly trimmed but not turned, bent or otherwise worked, suitable for the manufacture of walking sticks, umbrellas, tool handles or the like; chipwood and the like. It includes also wood shavings, which are used in the manufacture of vinegar or for the clarification of liquids.
broader: Roughly trimmed wood
narrower: Roughly trimmed wood, coniferous, hoopwood
narrower: Roughly trimmed wood, coniferous, split poles
narrower: Roughly trimmed wood, coniferous, pointed piles, pickets and stakes
narrower: Roughly trimmed wood, coniferous, wooden sticks roughly trimmed
narrower: Roughly trimmed wood, coniferous, chipwood
narrower: Roughly trimmed wood, coniferous, n.e.c.

Other, including unsorted waste and scrap
type: Concept
notation: 109.
in scheme: Forest Products Classification and Definitions (FPC&D) v2022
definition: Other, including unsorted waste and scrap
broader: RECOVERED PAPER

Other wood chips and particles from wood processing, for fibreboard
type: Concept
notation: 032.293
in scheme: Forest Products Classification and Definitions (FPC&D) v2022
definition: N.A.
broader: Other wood chips and particles from wood processing

Other sawdust, for particle board
type: Concept
notation: 031.292
in scheme: Forest Products Classification and Definitions (FPC&D) v2022
definition: N.A.
broader: Other sawdust

Paper for duplicator stencils and duplicator stencils
type: Concept
notation: 143.4
in scheme: Forest Products Classification and Definitions (FPC&D) v2022
definition: Paper for duplicator stencils are thin, strong, unsized papers proofed by coating or impregnating with paraffin or other wax, collodion or preparations of similar products. Pressure applied by means of a typewriter or any other appropriate instrument perforates the surface coating with the textual matter or patterns to be reproduced. Duplicator stencils are usually provided with a detachable thick paper backing attached to the top edge which is specially perforated to allow for the fixing of the prepared stencil on to the duplicator.
broader: Carbon paper and copying paper ready for use

Wood fuel from the main stem and branches, coniferous
type: Concept
notation: 011.11
in scheme: Forest Products Classification and Definitions (FPC&D) v2022
definition: It includes wood from main stem and branches where these are harvested for fuel. It also includes wood chips to be used for fuel that are made directly (i.e. in the forest) from roundwood.
broader: Wood fuel from the main stem and branches
narrower: Wood fuel, coniferous, for pellets
narrower: Wood fuel, coniferous, for uses n.e.c.

Posts and beams
type: Concept
notation: 135.5
in scheme: Forest Products Classification and Definitions (FPC&D) v2022
definition: Posts are round, hewn, squared or split wood, usually less than 3 m in length, but possibly up to 5 m used for fencing, guard rails and the like. Beam is a piece of wood which is typically long and squared that can be used as a building material.
broader: Builder's joinery and carpentry of wood

Other industrial roundwood, tropical non-coniferous, used for pitprops
type: Concept
notation: 012.1323
in scheme: Forest Products Classification and Definitions (FPC&D) v2022
definition: N.A.
broader: Other industrial roundwood, tropical non-coniferous

Other stumps and roots, for fibreboard
type: Concept
notation: 012.2293
in scheme: Forest Products Classification and Definitions (FPC&D) v2022
definition: N.A.
broader: Other stumps and roots

Several particle boards whether or not covered on one or both faces with fibreboard
type: Concept
notation: 076.2
in scheme: Forest Products Classification and Definitions (FPC&D) v2022
definition: Laminated panels consisting of several particle boards whether or not covered on one or both faces with fibreboard.
broader: Combination board

Wooden furniture, used in the bedroom
type: Concept
notation: 136.53
in scheme: Forest Products Classification and Definitions (FPC&D) v2022
definition: It includes wooden furniture of a kind used in offices, in the kitchen, in the bedroom and other wooden furniture.
broader: Wooden furniture

Wood fuel, tropical non-coniferous, for pellets
type: Concept
notation: 011.121
in scheme: Forest Products Classification and Definitions (FPC&D) v2022
definition: N.A.
broader: Wood fuel from the main stem and branches, tropical non-coniferous

Stumps and roots, coniferous
type: Concept
notation: 012.221
in scheme: Forest Products Classification and Definitions (FPC&D) v2022
definition: Includes all the biomass of the tree below the separation of the harvested stem. The height of this cut will vary according to local practices and conditions.
broader: Stumps and roots
narrower: Stumps and roots, coniferous, for pulp
narrower: Stumps and roots, coniferous, for particle board
narrower: Stumps and roots, coniferous, for fibreboard
narrower: Stumps and roots, coniferous, for uses n.e.c.

Other wood chips and particles from recovered wood products, for pulp
type: Concept
notation: 032.391
in scheme: Forest Products Classification and Definitions (FPC&D) v2022
definition: N.A.
broader: Other wood chips and particles from recovered wood products

Other articles of paper and paperboard ready for use, filter paper and paperboard
type: Concept
notation: 146.91
in scheme: Forest Products Classification and Definitions (FPC&D) v2022
definition: Filter paper and paperboard are porous products, devoid of wood fibres obtained by mechanical or semi-chemical process. They are designed to remove solid particles from liquids or gases. They are produced from rag or chemical pulp or a mixture of. It includes filter paper and paperboard in strips or rolls of a width not exceeding 36 cm.
broader: Other articles of paper and paperboard ready for use

Other bark separated in the forest from wood in the rough, for uses n.e.c.
type: Concept
notation: 012.2399
in scheme: Forest Products Classification and Definitions (FPC&D) v2022
definition: N.A.
broader: Other bark separated in the forest from wood in the rough

Other unbleached pressurised stone groundwood
type: Concept
notation: 081.219
in scheme: Forest Products Classification and Definitions (FPC&D) v2022
definition: N.A.
broader: Pressurised stone groundwood, unbleached

Chemical wood pulp
type: Concept
notation: 083.
in scheme: Forest Products Classification and Definitions (FPC&D) v2022
definition: Wood pulp obtained by subjecting pulpwood, wood chips, particles or residues to a series of chemical treatments. It may be bleached, semi-bleached or unbleached. It excludes dissolving grades of wood pulp.
broader: WOOD PULP
narrower: Soda or sulphate chemical wood pulp
narrower: Sulphite chemical wood pulp

Articles of apparel and clothing accessories
type: Concept
notation: 144.5
in scheme: Forest Products Classification and Definitions (FPC&D) v2022
definition: Articles of apparel and clothing accessories in strips or rolls of a width not exceeding 36 cm.
broader: Household and sanitary paper ready for use

Other shavings
type: Concept
notation: 031.39
in scheme: Forest Products Classification and Definitions (FPC&D) v2022
definition: Long, thin pieces of wood, produced in planing operations.
broader: Shavings
narrower: Other shavings, for pulp
narrower: Other shavings, for particle board
narrower: Other shavings, for fibreboard
narrower: Other shavings, for energy
narrower: Other shavings, for uses n.e.c.

SECONDARY WOOD PRODUCTS
top concept of: Forest Products Classification and Definitions (FPC&D) v2022
type: Concept
notation: 13
in scheme: Forest Products Classification and Definitions (FPC&D) v2022
definition: Secondary wood products include essentially wood products and furniture. This item will consider the products resulting from further transformation of sawnwood and other wood-based material. The range of operations and process is very wide, starting with the cutting to size of components and ending with the manufacture of finished and complex products such as pieces of furniture.
narrower: Further processed sawnwood
narrower: Wooden wrapping and packaging material
narrower: Wood products for domestic/decorative use
narrower: Other manufactured wood products
narrower: Builder's joinery and carpentry of wood
narrower: Wooden furniture
narrower: Prefabricated buildings of wood

Wood residues (including wood for agglomerates)
type: Concept
notation: 031.
in scheme: Forest Products Classification and Definitions (FPC&D) v2022
definition: Other wood processing co-products that has not been reduced to chips or particles and has not been agglomerated. These residues may often serve as raw material for the manufacture of certain forest products, notably pulp, particle board and fibreboard and may always be used as a source of energy.
broader: WOOD CHIPS AND PARTICLES, RESIDUES AND RECOVERABLE WOOD PRODUCTS
narrower: Solid wood processing residues
narrower: Sawdust
narrower: Shavings
narrower: Bark removed during processing
narrower: Other residues of wood processing, not of solid wood

OTHER PULP
top concept of: Forest Products Classification and Definitions (FPC&D) v2022
type: Concept
notation: 09
in scheme: Forest Products Classification and Definitions (FPC&D) v2022
definition: Includes pulp, except dissolving grades, obtained by any method from fibrous ligno-cellulosic materials, except wood. It may be unbleached or bleached.
narrower: Pulp from fibres other than wood
narrower: Recovered fibre pulp

Wood fuel, coniferous, for uses n.e.c.
type: Concept
notation: 011.119
in scheme: Forest Products Classification and Definitions (FPC&D) v2022
definition: N.A.
broader: Wood fuel from the main stem and branches, coniferous

Newsprint
type: Concept
notation: 111.1
in scheme: Forest Products Classification and Definitions (FPC&D) v2022
definition: Uncoated paper mainly used for printing newspapers. It is made largely from mechanical pulp and/or recovered paper, with or without a small amount of filler. Products in this category are generally manufactured in strips or rolls of a width exceeding 36 cm. Weights usually range from 40 to 52 g/m2 but can be as high as 65 g/m2. Newsprint is machine finished or slightly calendered, white or slightly coloured and is used in reels for letterpress, offset or flexo printing.
broader: Graphic papers

Coffins
type: Concept
notation: 134.5
in scheme: Forest Products Classification and Definitions (FPC&D) v2022
definition: A coffin is a funerary box used for burial or cremation.
broader: Other manufactured wood products

Other mineral bonded panels, other than cement bonded
type: Concept
notation: 077.29
in scheme: Forest Products Classification and Definitions (FPC&D) v2022
definition: Other mineral bonded panels, other than cement bonded
broader: Mineral bonded panels, other than cement bonded

Pallet collars
type: Concept
notation: 132.4
in scheme: Forest Products Classification and Definitions (FPC&D) v2022
definition: Pallet collars are collars made up of four pieces of wood, usually with hinges on the ends to form a frame that is placed over the pallet itself.
broader: Wooden wrapping and packaging material

Other sulphite dissolving wood pulp
type: Concept
notation: 084.29
in scheme: Forest Products Classification and Definitions (FPC&D) v2022
definition: N.A.
broader: Sulphite dissolving wood pulp

Other paper and paperboard, filter blocks, slabs and plates of paper pulp
type: Concept
notation: 114.5
in scheme: Forest Products Classification and Definitions (FPC&D) v2022
definition: Filter blocks, slabs and plates, of paper pulp are manufactured by using vegetable fibres (cotton, flax, wood, etc.) with a high cellulose content, which are compressed together in the form of blocks, slabs or plates without the aid of any binding material. Filter blocks are used in filters for clarifying liquids (e.g. wine, spirits, beer, vinegar, etc.)
broader: Other paper and paperboard

Wood charcoal, coniferous
type: Concept
notation: 021.1
in scheme: Forest Products Classification and Definitions (FPC&D) v2022
definition: Wood carbonised by partial combustion or the application of heat from external sources. It can be in the form of blocks, sticks or in granules or powder, or agglomerated with tar or other substances in briquettes, tablets, balls, etc. It includes: charcoal used as a fuel or for other uses, e.g. as a reduction agent in metallurgy or as an absorption or filtration medium. "
broader: Wood charcoal
narrower: Wood charcoal, coniferous, for energy
narrower: Wood charcoal, coniferous, for uses n.e.c.

Semi-chemical pulp
type: Concept
notation: 082.1
in scheme: Forest Products Classification and Definitions (FPC&D) v2022
definition: Semi-chemical pulp is produced in a two-part process in which the wood, is first chemically softened in digesters and then mechanically refined. It is used mainly for medium-quality papers.
broader: Semi-chemical wood pulp
narrower: Semi-chemical pulp, unbleached
narrower: Semi-chemical pulp, bleached

Other uncontaminated recoverable wood products, for pulp
type: Concept
notation: 033.191
in scheme: Forest Products Classification and Definitions (FPC&D) v2022
definition: N.A.
broader: Other uncontaminated recoverable wood products

Cellular board, coniferous
type: Concept
notation: 071.31
in scheme: Forest Products Classification and Definitions (FPC&D) v2022
definition: Plywood with a core of cellular construction, which are somewhat similar in appearance to the blockboard and battenboard but the battens or laths forming the core are spaced one from the other, either parallel or in lattice form. Cellular boards are used for partitions, doors and sometimes in the manufacture of furniture.
broader: Cellular board

Further processed sawnwood, tropical non-coniferous, boards with rounded edges or ends
type: Concept
notation: 131.21
in scheme: Forest Products Classification and Definitions (FPC&D) v2022
definition: Wood sawn or chipped lengthwise with rounded edges or ends.
broader: Further processed sawnwood, tropical non-coniferous

Stone groundwood, unbleached
type: Concept
notation: 081.11
in scheme: Forest Products Classification and Definitions (FPC&D) v2022
definition: Pulp not treated with chemicals to increase its brightness.
broader: Stone groundwood
narrower: Stone groundwood, unbleached, coniferous
narrower: Other unbleached stone groundwood

Wood chips and particles from recovered wood products, coniferous
type: Concept
notation: 032.31
in scheme: Forest Products Classification and Definitions (FPC&D) v2022
definition: Wood, which has been deliberately reduced to chips, particles, flakes, etc. from products wholly or mostly of wood or wood-based panels, which are no longer used for their original purpose.
broader: Wood chips and particles from recovered wood products
narrower: Wood chips and particles from recovered wood products, coniferous, for pulp
narrower: Wood chips and particles from recovered wood products, coniferous, for particle board
narrower: Wood chips and particles from recovered wood products, coniferous, for fibreboard
narrower: Wood chips and particles from recovered wood products, coniferous, for energy
narrower: Wood chips and particles from recovered wood products, coniferous, for uses n.e.c.

Wooden furniture, used in the kitchen
type: Concept
notation: 136.52
in scheme: Forest Products Classification and Definitions (FPC&D) v2022
definition: It includes wooden furniture of a kind used in offices, in the kitchen, in the bedroom and other wooden furniture.
broader: Wooden furniture

Core plywood, with at least one outer ply of tropical wood
type: Concept
notation: 071.22
in scheme: Forest Products Classification and Definitions (FPC&D) v2022
definition: Core plywood is a plywood with a solid core. Core can consist of MDF, particle board, veneer or from narrow boards, blocks or strips of wood.
broader: Core plywood
narrower: Core plywood, with at least one outer ply of tropical wood, blockboard, laminboard and battenboard
narrower: Core plywood, with at least one outer ply of tropical wood, n.e.c. (MDF core, particleboard core, veneer core, etc.)

Wood charcoal
type: Concept
notation: 021.
in scheme: Forest Products Classification and Definitions (FPC&D) v2022
definition: Wood carbonised by partial combustion or the application of heat from external sources. It can be in the form of blocks, sticks or in granules or powder, or agglomerated with tar or other substances in briquettes, tablets, balls, etc. It includes: charcoal used as a fuel or for other uses, e.g. as a reduction agent in metallurgy or as an absorption or filtration medium.
broader: WOOD SIMPLY WORKED OR PROCESSED
narrower: Wood charcoal, coniferous
narrower: Other wood charcoal

Other agglomerates
type: Concept
notation: 043.
in scheme: Forest Products Classification and Definitions (FPC&D) v2022
definition: Agglomerates other than wood pellets and wood briquettes, for example logs.
broader: WOOD PELLETS AND OTHER AGGLOMERATES
narrower: Other agglomerates, coniferous
narrower: Other agglomerates n.e.c.

Recoverable wood products
type: Concept
notation: 033.
in scheme: Forest Products Classification and Definitions (FPC&D) v2022
definition: Products wholly or mostly of wood or wood-based panels, which are no longer used for their original purpose and which could be used as a source of raw material or energy.
broader: WOOD CHIPS AND PARTICLES, RESIDUES AND RECOVERABLE WOOD PRODUCTS
narrower: Uncontaminated recoverable wood products
narrower: Contaminated recoverable wood products

Bark separated in the forest from wood in the rough, tropical non-coniferous
type: Concept
notation: 011.932
in scheme: Forest Products Classification and Definitions (FPC&D) v2022
definition: N.A.
broader: Bark separated in the forest from wood in the rough

Bobbins, spools, cops and similar supports of paper pulp, paper or paperboard
type: Concept
notation: 146.5
in scheme: Forest Products Classification and Definitions (FPC&D) v2022
definition: It includes bobbins, tubes, spools, cops, cones and similar supports for winding yarn or wire. These goods may be made of paperboard, of rolled paper sheets or of pressed or moulded pulp.
broader: Other articles of paper and paperboard ready for use
narrower: Bobbins, spools, cops and similar supports of paper pulp, paper or paperboard, used for winding textile yarn
narrower: Other bobbins, spools, cops and similar supports of paper pulp, paper or paperboard

Other sawdust, for pulp
type: Concept
notation: 031.291
in scheme: Forest Products Classification and Definitions (FPC&D) v2022
definition: N.A.
broader: Other sawdust

Other non-coniferous, sawnwood planed, other
type: Concept
notation: 053.39
in scheme: Forest Products Classification and Definitions (FPC&D) v2022
definition: Wood sawn or chipped lengthwise, and planed, sanded or finger-jointed, which was kiln- or air-dried but not treated for the purpose of protection.
broader: Other non-coniferous, sawnwood planed

Sulphite dissolving wood pulp, coniferous
type: Concept
notation: 084.21
in scheme: Forest Products Classification and Definitions (FPC&D) v2022
definition: N.A.
broader: Sulphite dissolving wood pulp

Wood particle board, waferboard
type: Concept
notation: 072.11
in scheme: Forest Products Classification and Definitions (FPC&D) v2022
definition: Special type of platen pressed particle board, made up of long particles ("wafers"), which are less than twice as long as they are wide and thereby improving the strength characteristics of the board.
broader: Wood particle board

Pulpwood and wood for wood-based panels, tropical non-coniferous, for wood wool
type: Concept
notation: 012.1224
in scheme: Forest Products Classification and Definitions (FPC&D) v2022
definition: N.A.
broader: Pulpwood and wood for wood-based panels, tropical non-coniferous

Other roughly trimmed wood, split poles
type: Concept
notation: 024.92
in scheme: Forest Products Classification and Definitions (FPC&D) v2022
definition: This products incorporate stems or branches of trees split along the length. They are used as supports in horticulture, agriculture, for fencing, etc.
broader: Other roughly trimmed wood

Other industrial roundwood n.e.c.
type: Concept
notation: 012.139
in scheme: Forest Products Classification and Definitions (FPC&D) v2022
definition: Industrial roundwood (wood in the rough) other than sawlogs, veneer logs and/or pulpwood. It includes roundwood that will be used for poles, piling, posts, fencing, pitprops, tanning, distillation and match blocks, etc.
broader: Other industrial roundwood
narrower: Other industrial roundwood n.e.c., used for poles
narrower: Other industrial roundwood n.e.c., used for piling
narrower: Other industrial roundwood n.e.c., used for pitprops
narrower: Other industrial roundwood n.e.c., used for posts
narrower: Other industrial roundwood n.e.c., for other uses in the rough (fencing, …)
narrower: Other industrial roundwood n.e.c., for other uses - tanning, distillation, match blocks, gazogenes

Boot or shoe lasts and trees
type: Concept
notation: 134.3
in scheme: Forest Products Classification and Definitions (FPC&D) v2022
definition: Boot or shoe lasts of wood and boot or shoe trees, which are used for preserving the shape or for stretching footwear.
broader: Other manufactured wood products

Other core plywood, with at least one outer ply of non-coniferous non-tropical wood
type: Concept
notation: 071.29
in scheme: Forest Products Classification and Definitions (FPC&D) v2022
definition: Core plywood is a plywood with a solid core. Core can consist of MDF, particle board, veneer or from narrow boards, blocks or strips of wood.
broader: Core plywood
narrower: Other core plywood, with at least one outer ply of non-coniferous non-tropical wood , blockboard, laminboard and battenboard
narrower: Other core plywood, with at least one outer ply of non-coniferous non-tropical wood n.e.c. (MDF core, particleboard core, veneer core, etc.)

Other wood chips and particles from wood processing
type: Concept
notation: 032.29
in scheme: Forest Products Classification and Definitions (FPC&D) v2022
definition: Wood, which has been deliberately reduced to chips, particles, flakes, etc. during the processing of wood.
broader: Wood chips and particles from wood processing
narrower: Other wood chips and particles from wood processing, for pulp
narrower: Other wood chips and particles from wood processing, for particle board
narrower: Other wood chips and particles from wood processing, for fibreboard
narrower: Other wood chips and particles from wood processing, for energy
narrower: Other wood chips and particles from wood processing, for uses n.e.c.

Doors and their frames and thresholds
type: Concept
notation: 135.2
in scheme: Forest Products Classification and Definitions (FPC&D) v2022
definition: Doors and their frames and thresholds used in the construction. They can be made from of ordinary wood or of particle board, fibreboard, laminated wood or densified wood.
broader: Builder's joinery and carpentry of wood
narrower: Doors and their frames and thresholds, tropical non-coniferous
narrower: Doors and their frames and thresholds, other

Other roughly trimmed wood
type: Concept
notation: 024.9
in scheme: Forest Products Classification and Definitions (FPC&D) v2022
definition: It includes: Hoopwood; split poles; piles, pickets and stakes of wood, pointed but not sawn lengthwise; wooden sticks, roughly trimmed but not turned, bent or otherwise worked, suitable for the manufacture of walking sticks, umbrellas, tool handles or the like; chipwood and the like. It includes also wood shavings, which are used in the manufacture of vinegar or for the clarification of liquids.
broader: Roughly trimmed wood
narrower: Other roughly trimmed wood, hoopwood
narrower: Other roughly trimmed wood, split poles
narrower: Other roughly trimmed wood, pointed piles, pickets and stakes
narrower: Other roughly trimmed wood, wooden sticks roughly trimmed
narrower: Other roughly trimmed wood, chipwood
narrower: Other roughly trimmed wood, n.e.c.

Tops, small branches and twigs, tropical non-coniferous, for uses n.e.c.
type: Concept
notation: 012.2129
in scheme: Forest Products Classification and Definitions (FPC&D) v2022
definition: N.A.
broader: Tops, small branches and twigs, tropical non-coniferous

Other further processed sawnwood
type: Concept
notation: 131.9
in scheme: Forest Products Classification and Definitions (FPC&D) v2022
definition: N.A.
broader: Further processed sawnwood
narrower: Other further processed sawnwood, boards with rounded edges or ends
narrower: Other further processed sawnwood, V-jointed wood
narrower: Other further processed sawnwood, beaded wood
narrower: Other further processed sawnwood, moulded wood
narrower: Other further processed sawnwood, rounded wood
narrower: Other further processed sawnwood, thermowood and torrefied sawnwood
narrower: Other further processed sawnwood n.e.c.

Tops, small branches and twigs, coniferous, for pellets
type: Concept
notation: 011.9111
in scheme: Forest Products Classification and Definitions (FPC&D) v2022
definition: N.A.
broader: Tops, small branches and twigs, coniferous

Fibreboard
type: Concept
notation: 074.
in scheme: Forest Products Classification and Definitions (FPC&D) v2022
definition: A panel manufactured from fibres of wood or other ligno-cellulosic materials (bamboo, bagasse) with the primary bond deriving from the felting of the fibres and their inherent adhesive properties. Additional resins or other organic bonding substances may be used to agglomerate the fibres. Fibreboard may consist of a single sheet or of several sheets bonded together. It includes fibreboard panels that are flat-pressed and moulded fibreboard products.
broader: WOOD-BASED PANELS
narrower: Dry process fibreboard
narrower: Wet process fibreboard

Other manufactured wood products n.e.c.
type: Concept
notation: 134.9
in scheme: Forest Products Classification and Definitions (FPC&D) v2022
definition: It includes match splints which are manufactured to the dimensions of matches; wood paving blocks; spools, cops, bobbins, sewing thread reels; ladders and steps; clothes pegs; oars, paddles, rudders; coffins, etc.
broader: Other manufactured wood products

Paper and paperboard stationery, boxes, pouches, wallets and writing compendium
type: Concept
notation: 146.33
in scheme: Forest Products Classification and Definitions (FPC&D) v2022
definition: It includes boxes, pouches, wallets and writing compendiums of paper and paperboard, containing an assortment of paper stationery.
broader: Paper and paperboard stationery

Coniferous, sawnwood and sleepers
type: Concept
notation: 051.
in scheme: Forest Products Classification and Definitions (FPC&D) v2022
definition: N.A.
broader: SAWNWOOD
narrower: Coniferous, sleepers
narrower: Coniferous, sawnwood rough
narrower: Coniferous, sawnwood planed
narrower: Coniferous, other

Heavy-duty load-bearing OSB
type: Concept
notation: 073.3
in scheme: Forest Products Classification and Definitions (FPC&D) v2022
definition: Heavy-duty load-bearing boards used in humid conditions (grade OSB/4).
broader: Oriented strand board (OSB)
narrower: Heavy-duty load-bearing OSB, used in humid conditions
narrower: Other heavy-duty load-bearing OSB

Further processed sawnwood, tropical non-coniferous, thermowood and torrefied sawnwood
type: Concept
notation: 131.26
in scheme: Forest Products Classification and Definitions (FPC&D) v2022
definition: The manufacturing process of ThermoWood is based on the use of high temperature and steam. No chemicals are used in the treatment. The process improves dimensional stability and biological durability of wood. Another improvement is in the insulation properties of the final material, the process leads to a reduction in thermal conductivity. Due to the high treatment temperatures the resin is removed from the wood. The manufacture of torrefied sawnwood consists of heating the wood at a very high temperature (from 190 to 240°C), in a torrefaction kiln (autoclave) at controlled atmosphere and low in oxygen. The length of the process, as well as the temperature degree sustained during a determined period, depends on the torrefied specie and the desired colour. This technology requires a pre-drying process using conventional kiln driers, to lower the moisture level between 6% and 10%. After that, the torrefaction kiln lowers the moisture level to 0%. Finally, the wood is placed in a conditioning chamber where the temperature is gradually lowered by controlled steam injection. The moisture level of the product is increased between 3% and 6%, in order to give back to the wood its natural flexibility. This conditioning stabilizes the wood and allows better quality manufacturing.
broader: Further processed sawnwood, tropical non-coniferous

Other paper and paperboard stationery
type: Concept
notation: 146.39
in scheme: Forest Products Classification and Definitions (FPC&D) v2022
definition: It includes e.g. stationery bound with materials other than paper (e.g., leather, plastics or textile material) and have reinforcement of fittings of metal, plastics, etc.
broader: Paper and paperboard stationery

Other stumps and roots, for uses n.e.c.
type: Concept
notation: 012.2299
in scheme: Forest Products Classification and Definitions (FPC&D) v2022
definition: N.A.
broader: Other stumps and roots

Wood parts of the furniture
type: Concept
notation: 136.6
in scheme: Forest Products Classification and Definitions (FPC&D) v2022
definition: It includes identifiable parts of furniture made from wood.
broader: Wooden furniture

Case materials, kraftliner, unbleached
type: Concept
notation: 113.111
in scheme: Forest Products Classification and Definitions (FPC&D) v2022
definition: Kraftliner made wholly or principally of unbleached sulphate pulp.
broader: Case materials, kraftliner

Wooden furniture
type: Concept
notation: 136.5
in scheme: Forest Products Classification and Definitions (FPC&D) v2022
definition: It includes wooden furniture of a kind used in offices, in the kitchen, in the bedroom and other wooden furniture.
broader: Wooden furniture
narrower: Wooden furniture, used in offices
narrower: Wooden furniture, used in the kitchen
narrower: Wooden furniture, used in the bedroom
narrower: Wooden furniture n.e.c.

Cartonboard, other uncoated paper and paperboard weighing more than 150 g/m² but less than 225 g/m²
type: Concept
notation: 113.22
in scheme: Forest Products Classification and Definitions (FPC&D) v2022
definition: Other uncoated paper and paperboard weighing more than 150 g/m² but less than 225 g/m² in rolls or sheets, not further worked or processed. (4805.92)
broader: Cartonboard

Other articles of natural cork
type: Concept
notation: 121.39
in scheme: Forest Products Classification and Definitions (FPC&D) v2022
definition: It includes discs, washers and wafers of natural cork, for lining crown corks and other closures for bottles, jars, etc.
broader: Articles of natural cork

Torrefied wood
type: Concept
notation: 022.
in scheme: Forest Products Classification and Definitions (FPC&D) v2022
definition: It includes wood chips and wood pellets that were torrefied. In the torrefaction process, biomass is heated to a temperature of approx. 250-350°C in an atmosphere with low oxygen concentrations, so that all moisture is removed as well as a fraction of the volatile matter of the dry biomass. Due to the substantial weight loss and a relatively smaller loss of calorific content, the heating value of processed biomass per mass unit increases significantly in the process.
broader: WOOD SIMPLY WORKED OR PROCESSED
narrower: Torrefied wood, coniferous
narrower: Other torrefied wood

Prefabricated buildings, of wood, complete buildings, unassembled
type: Concept
notation: 137.2
in scheme: Forest Products Classification and Definitions (FPC&D) v2022
definition: It includes complete buildings but not assembled and ready for use.
broader: Prefabricated buildings of wood

Thermo-mechanical pulp, unbleached, coniferous
type: Concept
notation: 081.411
in scheme: Forest Products Classification and Definitions (FPC&D) v2022
definition: N.A.
broader: Thermo-mechanical pulp, unbleached

Case materials
type: Concept
notation: 113.1
in scheme: Forest Products Classification and Definitions (FPC&D) v2022
definition: Papers and boards mainly used in the manufacture of corrugated board. They are made from any combination of virgin and recovered fibres and can be bleached, unbleached or mottled. It includes kraftliner, testliner, semi-chemical fluting, and waste-based fluting (Wellenstoff).
broader: Packaging materials
narrower: Case materials, kraftliner
narrower: Case materials, fluting paper
narrower: Case materials, testliner (recycled liner board)
narrower: Other case materials

Bobbins, spools, cops and similar supports of paper pulp, paper or paperboard, used for winding textile yarn
type: Concept
notation: 146.51
in scheme: Forest Products Classification and Definitions (FPC&D) v2022
definition: It includes bobbins, tubes, spools, cops, cones and similar supports used for winding textile yarn.
broader: Bobbins, spools, cops and similar supports of paper pulp, paper or paperboard

Other roundwood treated with preservatives, for poles
type: Concept
notation: 023.91
in scheme: Forest Products Classification and Definitions (FPC&D) v2022
definition: Straight pieces, usually of 5 m or more in length. They are used principally to support telephone, telegraph and electrical or transmission lines and for scaffolding.
broader: Other roundwood treated with preservatives

Other unbleached soda or sulphate chemical wood pulp
type: Concept
notation: 083.119
in scheme: Forest Products Classification and Definitions (FPC&D) v2022
definition: N.A.
broader: Soda or sulphate chemical wood pulp, unbleached

Other unbleached refiner mechanical pulp
type: Concept
notation: 081.319
in scheme: Forest Products Classification and Definitions (FPC&D) v2022
definition: N.A.
broader: Refiner mechanical pulp, unbleached

Other industrial roundwood, coniferous, for other uses - tanning, distillation, match blocks, gazogenes
type: Concept
notation: 012.1319
in scheme: Forest Products Classification and Definitions (FPC&D) v2022
definition: N.A.
broader: Other industrial roundwood, coniferous

Refiner mechanical pulp, unbleached, coniferous
type: Concept
notation: 081.311
in scheme: Forest Products Classification and Definitions (FPC&D) v2022
definition: N.A.
broader: Refiner mechanical pulp, unbleached

Special coated paper, tarred, bituminised or asphalted paper and paperboard
type: Concept
notation: 142.1
in scheme: Forest Products Classification and Definitions (FPC&D) v2022
definition: Tar paper is a heavy-duty paper used in construction. Tar paper is made by impregnating paper or fiberglass mat with tar, producing a waterproof material useful for roof construction. Bituminised or asphalted paper and paperboard are impregnated with bitumen (asphalt) and used in building construction.
broader: Special coated paper and pulp products

Tops, small branches and twigs
type: Concept
notation: 011.91
in scheme: Forest Products Classification and Definitions (FPC&D) v2022
definition: It includes wood from other parts than main stem and branches where these are harvested for fuel, e.g. tops, small branches and twigs, stumps and roots, bark separated in the forest from wood in the rough.
broader: Other wood fuel (tops, small branches and twigs; stumps and roots; bark)
narrower: Tops, small branches and twigs, coniferous
narrower: Tops, small branches and twigs, tropical non-coniferous
narrower: Other tops, small branches and twigs

Wrapping papers, glassine and other glazed transparent or translucent papers
type: Concept
notation: 113.36
in scheme: Forest Products Classification and Definitions (FPC&D) v2022
definition: Glassine and other glazed transparent paper is made in the same manner as greaseproof paper but in the final stage they are supercalendered to further improve the density. They are mainly uncoloured and generally less impermeable than vegetable parchment and greaseproof papers.
broader: Wrapping papers

Uncoated graphic papers, wood free
type: Concept
notation: 111.22
in scheme: Forest Products Classification and Definitions (FPC&D) v2022
definition: Paper and paperboard not containing 10 % or more fibres obtained by mechanical or thermo-mechanical process.
broader: Uncoated graphic papers
narrower: Uncoated graphic papers, wood free, hand-made paper and paperboard
narrower: Uncoated graphic papers, wood free, used as a base for photo-sensitive, heat-sensitive or electro-sensitive paper or paperboard
narrower: Other wood free uncoated graphic papers

Other veneer plywood, exterior grade
type: Concept
notation: 071.192
in scheme: Forest Products Classification and Definitions (FPC&D) v2022
definition: Veneer plywood in which waterproof glue is used to bond plies. It is a resin-based glue similar to the glue used in wooden ships. It dries to a hard, crystal substance that will never yield to moisture of any kind. It is suitable for indoor and outdoor applications.
broader: Other veneer plywood

Sulphate dissolving wood pulp, coniferous
type: Concept
notation: 084.11
in scheme: Forest Products Classification and Definitions (FPC&D) v2022
definition: N.A.
broader: Sulphate dissolving wood pulp

Wood wool
type: Concept
notation: 025.
in scheme: Forest Products Classification and Definitions (FPC&D) v2022
definition: Wood wool is a product consists of wood slivers, curled or twisted, which have regular size, thickness and length. It is cut from logs (poplar, coniferous tree species) and is mainly used in packaging, for cooling pads in home evaporative cooling systems known as swamp coolers, for erosion control mats, and as a raw material for the production of other products such as bonded wood wool boards and used as stuffing for stuffed animals.
broader: WOOD SIMPLY WORKED OR PROCESSED
narrower: Wood wool, coniferous
narrower: Other wood wool

Graphic papers
type: Concept
notation: 111.
in scheme: Forest Products Classification and Definitions (FPC&D) v2022
definition: The graphic papers category is an aggregate category. It represents the sum of newsprint; uncoated mechanical; uncoated woodfree and coated papers. Products in this category are generally manufactured in strips or rolls of a width exceeding 15 cm or in rectangular sheets with one side exceeding 36 cm and the other exceeding 15 cm in the unfolded state. It excludes manufactured paper products such as books and magazines, etc.
broader: PAPER AND PAPERBOARD
narrower: Newsprint
narrower: Uncoated graphic papers
narrower: Coated graphic papers

Other industrial roundwood, tropical non-coniferous, used for piling
type: Concept
notation: 012.1322
in scheme: Forest Products Classification and Definitions (FPC&D) v2022
definition: N.A.
broader: Other industrial roundwood, tropical non-coniferous

Other wood products for domestic or decorative use
type: Concept
notation: 133.9
in scheme: Forest Products Classification and Definitions (FPC&D) v2022
definition: Other wood products for domestic and decorative use not mentioned in the groups 133.1, 133.2, 133.3, 133.4 and 133.5
broader: Wood products for domestic/decorative use

WOOD PELLETS AND OTHER AGGLOMERATES
top concept of: Forest Products Classification and Definitions (FPC&D) v2022
type: Concept
notation: 04
in scheme: Forest Products Classification and Definitions (FPC&D) v2022
definition: Agglomerates produced from co-products (such as cutter shavings, sawdust or chips) of the mechanical wood processing industry, furniture-making industry or other wood transformation activities.
narrower: Wood pellets
narrower: Wood briquettes
narrower: Other agglomerates

Wood particle board
type: Concept
notation: 072.1
in scheme: Forest Products Classification and Definitions (FPC&D) v2022
definition: Particle board manufactured from particles of wood.
broader: Particle board
narrower: Wood particle board, waferboard
narrower: Wood particle board, medium density particle board
narrower: Wood particle board, extruded particle board
narrower: Other wood particle board n.e.c.

Other pulpwood and wood for wood-based panels, for fibreboard
type: Concept
notation: 012.1293
in scheme: Forest Products Classification and Definitions (FPC&D) v2022
definition: N.A.
broader: Other pulpwood and wood for wood-based panels

Other contaminated recoverable wood products, for energy
type: Concept
notation: 033.291
in scheme: Forest Products Classification and Definitions (FPC&D) v2022
definition: N.A.
broader: Other contaminated recoverable wood products

Coniferous, sawnwood rough, treated or impregnated
type: Concept
notation: 051.21
in scheme: Forest Products Classification and Definitions (FPC&D) v2022
definition: Wood sawn or chipped lengthwise, not planed, sanded or finger-jointed and which was treated with insecticides or fungicides for the purpose of protection. For long-term preservation they can be impregnated with creosote or other substances.
broader: Coniferous, sawnwood rough

Pulpwood and wood for wood-based panels, coniferous, for uses n.e.c.
type: Concept
notation: 012.1219
in scheme: Forest Products Classification and Definitions (FPC&D) v2022
definition: N.A.
broader: Pulpwood and wood for wood-based panels, coniferous

Sanitary and household papers
type: Concept
notation: 112.
in scheme: Forest Products Classification and Definitions (FPC&D) v2022
definition: This covers the stock of a wide range of tissue and other hygienic papers for use in households or commercial and industrial premises. Products in this category are generally manufactured in strips or rolls of a width exceeding 36 cm. Examples are toilet paper and facial tissues, kitchen towels, hand towels and industrial wipes. Some tissue is also used in the manufacture of baby napkins, sanitary towels, etc. The parent reel stock is made from virgin pulp or recovered fibre or mixtures of these.
broader: PAPER AND PAPERBOARD
narrower: Toilet or facial tissue stock, towel or napkin stock and similar papers
narrower: Cellulose wadding and webs of cellulose fibres
narrower: Other sanitary and household papers

Further processed sawnwood, coniferous
type: Concept
notation: 131.1
in scheme: Forest Products Classification and Definitions (FPC&D) v2022
definition: N.A.
broader: Further processed sawnwood
narrower: Further processed sawnwood, coniferous, boards with rounded edges or ends
narrower: Further processed sawnwood, coniferous, V-jointed wood
narrower: Further processed sawnwood, coniferous, beaded wood
narrower: Further processed sawnwood, coniferous, moulded wood
narrower: Further processed sawnwood, coniferous, rounded wood
narrower: Further processed sawnwood, coniferous, thermowood and torrefied sawnwood
narrower: Other coniferous further processed sawnwood

Non-decorative veneer sheets
type: Concept
notation: 062.
in scheme: Forest Products Classification and Definitions (FPC&D) v2022
definition: Veneer sheets, usually peeled, without specific decorative characteristics. They are often used for the cores of plywood.
broader: VENEER SHEETS
narrower: Non-decorative veneer sheets, coniferous
narrower: Non-decorative veneer sheets, tropical non-coniferous
narrower: Other non-decorative veneer sheets

Tropical non-coniferous, sawnwood planed, n.e.c.
type: Concept
notation: 052.39
in scheme: Forest Products Classification and Definitions (FPC&D) v2022
definition: Wood sawn or chipped lengthwise, and planed, sanded or finger-jointed, which was kiln- or air-dried but not treated for the purpose of protection.
broader: Tropical non-coniferous, sawnwood planed

Bark separated in the forest from wood in the rough, tropical non-coniferous, for uses n.e.c.
type: Concept
notation: 012.2329
in scheme: Forest Products Classification and Definitions (FPC&D) v2022
definition: N.A.
broader: Bark separated in the forest from wood in the rough, tropical non-coniferous

Chemi-mechanical pulp, bleached
type: Concept
notation: 082.22
in scheme: Forest Products Classification and Definitions (FPC&D) v2022
definition: Pulp treated with chemicals to increase its brightness.
broader: Chemi-mechanical pulp
narrower: Chemi-mechanical pulp, bleached, coniferous
narrower: Other bleached chemi-mechanical pulp

Other Wooden frames for paintings, photographs, mirrors or similar objects
type: Concept
notation: 133.19
in scheme: Forest Products Classification and Definitions (FPC&D) v2022
definition: It includes wooden frames of all shapes and dimensions. The frames of the heading may also be of wood marquetry or inlaid wood.
broader: Wooden frames for paintings, photographs, mirrors or similar objects

Decorative veneer sheets, tropical non-coniferous
type: Concept
notation: 061.2
in scheme: Forest Products Classification and Definitions (FPC&D) v2022
definition: N.A.
broader: Decorative veneer sheets
narrower: Decorative veneer sheets, tropical non-coniferous, for plywood (faces)
narrower: Decorative veneer sheets, tropical non-coniferous, for other purposes (facing of sawnwood, panel, furniture, etc.)

Other wood pellets
type: Concept
notation: 041.9
in scheme: Forest Products Classification and Definitions (FPC&D) v2022
definition: Agglomerates produced either directly by compression or by the addition of a binder in a proportion not exceeding 3% by weight. Such pellets are cylindrical, with a diameter not exceeding 25 mm and a length not exceeding 100 mm.
broader: Wood pellets
narrower: Other wood pellets, for energy
narrower: Other wood pellets, for uses n.e.c. (bedding, absorbents,…)

Wood chips and particles from recovered wood products, coniferous, for particle board
type: Concept
notation: 032.312
in scheme: Forest Products Classification and Definitions (FPC&D) v2022
definition: N.A.
broader: Wood chips and particles from recovered wood products, coniferous

Special coated paper, gummed or adhesive paper and paperboard, self-adhesive
type: Concept
notation: 142.21
in scheme: Forest Products Classification and Definitions (FPC&D) v2022
definition: Self-adhesive papers have a surface coated with an adhesive and not needing the application of glue or moisture. It is made up of three component parts: the face stock material, the adhesive and the silicone-coated release liner. The adhesive keeps the face material joined to the release liner.
broader: Special coated paper, gummed or adhesive paper and paperboard

Tropical non-coniferous, sawnwood rough, treated or impregnated
type: Concept
notation: 052.21
in scheme: Forest Products Classification and Definitions (FPC&D) v2022
definition: Wood sawn or chipped lengthwise, not planed, sanded or finger-jointed and which was treated with insecticides or fungicides for the purpose of protection. For long-term preservation they can be impregnated with creosote or other substances.
broader: Tropical non-coniferous, sawnwood rough

Other manufactured wood products
type: Concept
notation: 134.
in scheme: Forest Products Classification and Definitions (FPC&D) v2022
definition: It includes tools, tool handles, broom or brush bodies and handles, boot or shoe lasts or trees; clothes hangers, coffins and other articles of wood. It excludes bamboo-based products.
broader: SECONDARY WOOD PRODUCTS
narrower: Tools, tool bodies, tool handles
narrower: Broom or brush bodies and handles
narrower: Boot or shoe lasts and trees
narrower: Clothes hangers
narrower: Coffins
narrower: Other manufactured wood products n.e.c.

Chemi-mechanical pulp, unbleached
type: Concept
notation: 082.21
in scheme: Forest Products Classification and Definitions (FPC&D) v2022
definition: Pulp not treated with chemicals to increase its brightness.
broader: Chemi-mechanical pulp
narrower: Chemi-mechanical pulp, unbleached, coniferous
narrower: Other unbleached chemi-mechanical pulp

Wet process fibreboard, of a density not exceeding 0.5 g/cm³
type: Concept
notation: 074.21
in scheme: Forest Products Classification and Definitions (FPC&D) v2022
definition: It is a wet-process fibreboard of a density not exceeding 0.5 g/cm3. These boards are used mainly for thermal or sound insulation in building.
broader: Wet process fibreboard

Decorative veneer sheets, coniferous, for other purposes (facing of sawnwood, panel, furniture, etc.)
type: Concept
notation: 061.19
in scheme: Forest Products Classification and Definitions (FPC&D) v2022
definition: Decorative veneer sheets not intended for the manufacture of plywood. Possible uses are the veneering of furniture, sawnwood, or panels other than plywood, or marquetry and inlay work.
broader: Decorative veneer sheets, coniferous

Stumps and roots, tropical non-coniferous, for uses n.e.c.
type: Concept
notation: 011.9229
in scheme: Forest Products Classification and Definitions (FPC&D) v2022
definition: N.A.
broader: Stumps and roots, tropical non-coniferous

Paper and paperboard stationery, letter cards, plain postcards and correspondence cards
type: Concept
notation: 146.32
in scheme: Forest Products Classification and Definitions (FPC&D) v2022
definition: Letter cards are sheets of paper or paperboard or card with gummed edges or other provision for closing or sealing without the use of envelopes.
broader: Paper and paperboard stationery

Other wood chips and particles from recovered wood products, for energy
type: Concept
notation: 032.394
in scheme: Forest Products Classification and Definitions (FPC&D) v2022
definition: N.A.
broader: Other wood chips and particles from recovered wood products

Shavings
type: Concept
notation: 031.3
in scheme: Forest Products Classification and Definitions (FPC&D) v2022
definition: Long, thin pieces of wood, produced in planing operations.
broader: Wood residues (including wood for agglomerates)
narrower: Shavings, coniferous
narrower: Other shavings

Other roundwood treated with preservatives
type: Concept
notation: 023.9
in scheme: Forest Products Classification and Definitions (FPC&D) v2022
definition: This group covers products which have been treated with paint, stains, creosote or other preservatives, in order to increase their resistance. It excludes: products treated with substances for the purpose of simply maintaining them during shipment or storage, torrefied pellets
broader: Roundwood treated with preservatives
narrower: Other roundwood treated with preservatives, for poles
narrower: Other roundwood treated with preservatives, for piling
narrower: Other roundwood treated with preservatives, for posts
narrower: Other roundwood treated with preservatives, for uses n.e.c.

Wooden frames for paintings, photographs, mirrors or similar objects
type: Concept
notation: 133.1
in scheme: Forest Products Classification and Definitions (FPC&D) v2022
definition: It includes wooden frames of all shapes and dimensions. The frames of the heading may also be of wood marquetry or inlaid wood.
broader: Wood products for domestic/decorative use
narrower: Wooden frames for paintings, photographs, mirrors or similar objects, tropical non-coniferous
narrower: Other Wooden frames for paintings, photographs, mirrors or similar objects

Other paper and paperboard, tracing papers
type: Concept
notation: 114.4
in scheme: Forest Products Classification and Definitions (FPC&D) v2022
definition: A form of tracing paper is similar to greaseproof paper. Tracing paper is usually made from sulphite pulp by reducing the fibres to a state of fine subdivision and hydrolysing them by very prolonged beating in water. Tracing paper is named as such for its ability for an image to be traced onto it.
broader: Other paper and paperboard

Stumps and roots
type: Concept
notation: 012.22
in scheme: Forest Products Classification and Definitions (FPC&D) v2022
definition: Includes all the biomass of the tree below the separation of the harvested stem. The height of this cut will vary according to local practices and conditions.
broader: Wood in the rough other than from the main stem and branches
narrower: Stumps and roots, coniferous
narrower: Stumps and roots, tropical non-coniferous
narrower: Other stumps and roots

Cellulose wadding and webs of cellulose fibres
type: Concept
notation: 112.2
in scheme: Forest Products Classification and Definitions (FPC&D) v2022
definition: Cellulose wadding consists of creped web of cellulose fibres of open formation. Webs of cellulose fibres (tissues) consist of cellulose fibres of closed formation.
broader: Sanitary and household papers

Stumps and roots, tropical non-coniferous
type: Concept
notation: 012.222
in scheme: Forest Products Classification and Definitions (FPC&D) v2022
definition: Includes all the biomass of the tree below the separation of the harvested stem. The height of this cut will vary according to local practices and conditions.
broader: Stumps and roots
narrower: Stumps and roots, tropical non-coniferous, for pulp
narrower: Stumps and roots, tropical non-coniferous, for particle board
narrower: Stumps and roots, tropical non-coniferous, for fibreboard
narrower: Stumps and roots, tropical non-coniferous, for uses n.e.c.

Wooden furniture n.e.c.
type: Concept
notation: 136.59
in scheme: Forest Products Classification and Definitions (FPC&D) v2022
definition: It includes wooden furniture of a kind used in offices, in the kitchen, in the bedroom and other wooden furniture.
broader: Wooden furniture

Tops, small branches and twigs, coniferous
type: Concept
notation: 012.211
in scheme: Forest Products Classification and Definitions (FPC&D) v2022
definition: Includes tops, small branches and twigs from felled trees. The lower limit of the top (the upper limit of the stem) will vary according to local logging practices
broader: Tops, small branches and twigs
narrower: Tops, small branches and twigs, coniferous, for pulp
narrower: Tops, small branches and twigs, coniferous, for particle board
narrower: Tops, small branches and twigs, coniferous, for fibreboard
narrower: Tops, small branches and twigs, coniferous, for uses n.e.c.

Veneer plywood, coniferous, interior grade
type: Concept
notation: 071.111
in scheme: Forest Products Classification and Definitions (FPC&D) v2022
definition: Veneer plywood suitable only for indoor applications.
broader: Veneer plywood, coniferous

Sawlogs and veneer logs, tropical non-coniferous
type: Concept
notation: 012.112
in scheme: Forest Products Classification and Definitions (FPC&D) v2022
definition: Roundwood that will be sawn (or chipped) lengthways for the manufacture of sawnwood or railway sleepers (ties) or used for the production of veneer (mainly by peeling or slicing). It includes: roundwood (whether or not it is roughly squared) that will be used for these purposes; shingle bolts and stave bolts; match billets and other special types of roundwood (e.g. burls and roots, etc.) used for veneer production.
broader: Sawlogs and veneer logs
narrower: Sawlogs and veneer logs, tropical non-coniferous, for sawnwood and railway sleepers
narrower: Sawlogs and veneer logs, tropical non-coniferous, for veneer sheets
narrower: Sawlogs and veneer logs, tropical non-coniferous, for uses n.e.c.

Dry process fibreboard of a density exceeding 0.8 g/cm³
type: Concept
notation: 074.13
in scheme: Forest Products Classification and Definitions (FPC&D) v2022
definition: It is a high-density fibreboard (HDF) of a density exceeding 0.8 g/cm³ produced in the dry process
broader: Dry process fibreboard
narrower: Dry process fibreboard of a density exceeding 0.8 g/cm³, of a thickness not exceeding 5 mm
narrower: Dry process fibreboard of a density exceeding 0.8 g/cm³, of a thickness exceeding 5 mm but not exceeding 9 mm
narrower: Dry process fibreboard of a density exceeding 0.8 g/cm³, of a thickness exceeding 9 mm

Packaging cartons, boxes, etc.
type: Concept
notation: 145.
in scheme: Forest Products Classification and Definitions (FPC&D) v2022
definition: It includes cartons, boxes, cases, bags and other packing containers, of paper, paperboard, cellulose wadding or webs of cellulose fibres; box files, letter trays, and similar articles, of paper or paperboard of a kind used in offices, shops or the like.
broader: SECONDARY PAPER PRODUCTS
narrower: Cartons, boxes and cases, of corrugated paper or paperboard
narrower: Folding cartons, boxes and cases, of non-corrugated paper or paperboard
narrower: Sacks and bags, having a base of a width of 40 cm or more
narrower: Other sacks and bags, including cones
narrower: Other packing containers, including record sleeves
narrower: Box files, letter trays, storage boxes and similar articles

Other industrial roundwood n.e.c., used for piling
type: Concept
notation: 012.1392
in scheme: Forest Products Classification and Definitions (FPC&D) v2022
definition: N.A.
broader: Other industrial roundwood n.e.c.

Other agglomerated cork and articles of agglomerated cork, with a binding substance
type: Concept
notation: 122.19
in scheme: Forest Products Classification and Definitions (FPC&D) v2022
definition: Other uses of agglomerated cork, e.g. building materials, moulded shapes, insulating or protecting hot water or steam piping, for the manufacture of filters, etc.
broader: Agglomerated cork and articles of agglomerated cork, with a binding substance

Other industrial roundwood n.e.c., for other uses - tanning, distillation, match blocks, gazogenes
type: Concept
notation: 012.1399
in scheme: Forest Products Classification and Definitions (FPC&D) v2022
definition: N.A.
broader: Other industrial roundwood n.e.c.

Sulphite chemical wood pulp, bleached or semi-bleached, coniferous
type: Concept
notation: 083.221
in scheme: Forest Products Classification and Definitions (FPC&D) v2022
definition: N.A.
broader: Sulphite chemical wood pulp, bleached or semi-bleached

Tops, small branches and twigs, coniferous, for pulp
type: Concept
notation: 012.2111
in scheme: Forest Products Classification and Definitions (FPC&D) v2022
definition: N.A.
broader: Tops, small branches and twigs, coniferous

Shuttering for concrete constructional work
type: Concept
notation: 135.3
in scheme: Forest Products Classification and Definitions (FPC&D) v2022
definition: Shuttering for concrete constructional work, they can be made from of ordinary wood or of particle board, fibreboard, laminated wood or densified wood.
broader: Builder's joinery and carpentry of wood

Other paper and paperboard, filter paper and paperboard
type: Concept
notation: 114.2
in scheme: Forest Products Classification and Definitions (FPC&D) v2022
definition: Filter paper and paperboard are porous products, devoid of wood fibres obtained by mechanical or semi-chemical process. They are designed to remove solid particles from liquids or gases. They are produced from rag or chemical pulp or a mixture of. It includes filter paper and paperboard not further worked or processed.
broader: Other paper and paperboard

Other bark removed during processing ,for uses n.e.c.
type: Concept
notation: 031.499
in scheme: Forest Products Classification and Definitions (FPC&D) v2022
definition: N.A.
broader: Other bark removed during processing

Roughly trimmed wood
type: Concept
notation: 024.
in scheme: Forest Products Classification and Definitions (FPC&D) v2022
definition: It includes: Hoopwood; split poles; piles, pickets and stakes of wood, pointed but not sawn lengthwise; wooden sticks, roughly trimmed but not turned, bent or otherwise worked, suitable for the manufacture of walking sticks, umbrellas, tool handles or the like; chipwood and the like. It includes also wood shavings, which are used in the manufacture of vinegar or for the clarification of liquids.
broader: WOOD SIMPLY WORKED OR PROCESSED
narrower: Roughly trimmed wood, coniferous
narrower: Other roughly trimmed wood

Other non-coniferous, sawnwood rough
type: Concept
notation: 053.2
in scheme: Forest Products Classification and Definitions (FPC&D) v2022
definition: Wood sawn or chipped lengthwise, not planed, sanded or finger-jointed. It may be green (undried) or dried. It excludes sawn and hewn railway sleepers, wood shingles and sawn veneer sheets.
broader: Other non-coniferous, sawnwood and sleepers
narrower: Other non-coniferous, sawnwood rough, treated or impregnated
narrower: Other non-coniferous, sawnwood rough, other

Bark separated in the forest from wood in the rough
type: Concept
notation: 011.93
in scheme: Forest Products Classification and Definitions (FPC&D) v2022
definition: It includes wood from other parts than main stem and branches where these are harvested for fuel, e.g. tops, small branches and twigs, stumps and roots, bark separated in the forest from wood in the rough.
broader: Other wood fuel (tops, small branches and twigs; stumps and roots; bark)
narrower: Bark separated in the forest from wood in the rough, coniferous
narrower: Bark separated in the forest from wood in the rough, tropical non-coniferous
narrower: Other bark separated in the forest from wood in the rough

Wood wool, coniferous
type: Concept
notation: 025.1
in scheme: Forest Products Classification and Definitions (FPC&D) v2022
definition: Wood wool is a product consists of wood slivers, curled or twisted, which have regular size, thickness and length. It is cut from logs (poplar, coniferous tree species) and is mainly used in packaging, for cooling pads in home evaporative cooling systems known as swamp coolers, for erosion control mats, and as a raw material for the production of other products such as bonded wood wool boards and used as stuffing for stuffed animals.
broader: Wood wool

Agglomerated cork and articles of agglomerated cork, without a binding substance, gaskets, washers and other seals of agglomerated cork, for civil aircraft
type: Concept
notation: 122.23
in scheme: Forest Products Classification and Definitions (FPC&D) v2022
definition: Agglomerated cork in the form of gaskets, washers and other seals of agglomerated cork, for civil aircraft.
broader: Agglomerated cork and articles of agglomerated cork, without a binding substance

Further processed sawnwood, coniferous, moulded wood
type: Concept
notation: 131.14
in scheme: Forest Products Classification and Definitions (FPC&D) v2022
definition: It covers strips of wood shaped to various contours, which are used for the manufacture of picture frames, decoration of walls, furniture, etc.
broader: Further processed sawnwood, coniferous

Tableware and kitchenware
type: Concept
notation: 133.2
in scheme: Forest Products Classification and Definitions (FPC&D) v2022
definition: It includes household articles of wood, which are used as tableware or kitchenware like spoons, forks, salad servers; platters and serving dishes; jars, cups and saucers; etc.
broader: Wood products for domestic/decorative use
narrower: Tableware and kitchenware, tropical non-coniferous
narrower: Other Tableware and kitchenware

Other wood chips and particles from recovered wood products
type: Concept
notation: 032.39
in scheme: Forest Products Classification and Definitions (FPC&D) v2022
definition: Wood, which has been deliberately reduced to chips, particles, flakes, etc. from products wholly or mostly of wood or wood-based panels, which are no longer used for their original purpose.
broader: Wood chips and particles from recovered wood products
narrower: Other wood chips and particles from recovered wood products, for pulp
narrower: Other wood chips and particles from recovered wood products, for particle board
narrower: Other wood chips and particles from recovered wood products, for fibreboard
narrower: Other wood chips and particles from recovered wood products, for energy
narrower: Other wood chips and particles from recovered wood products, for uses n.e.c.

Uncontaminated recoverable wood products, coniferous
type: Concept
notation: 033.11
in scheme: Forest Products Classification and Definitions (FPC&D) v2022
definition: The recoverable wood products have not been contaminated (e.g. by impregnation, gluing, coating, painting or nailing) to such an extent that they are unsuitable as raw material for pulp particle board or fibreboard. Examples are some pallets and wood packing cases.
broader: Uncontaminated recoverable wood products
narrower: Uncontaminated recoverable wood products, coniferous, for pulp
narrower: Uncontaminated recoverable wood products, coniferous, for particle board
narrower: Uncontaminated recoverable wood products, coniferous, for fibreboard
narrower: Uncontaminated recoverable wood products, coniferous, for energy
narrower: Uncontaminated recoverable wood products, coniferous, for uses n.e.c.

Roundwood treated with preservatives, coniferous, for poles
type: Concept
notation: 023.11
in scheme: Forest Products Classification and Definitions (FPC&D) v2022
definition: Straight pieces, usually of 5 m or more in length. They are used principally to support telephone, telegraph and electrical or transmission lines and for scaffolding.
broader: Roundwood treated with preservatives, coniferous

Bark separated in the forest from wood in the rough, coniferous, for horticulture purposes
type: Concept
notation: 012.2311
in scheme: Forest Products Classification and Definitions (FPC&D) v2022
definition: N.A.
broader: Bark separated in the forest from wood in the rough, coniferous

Wrapping papers, vegetable parchment
type: Concept
notation: 113.34
in scheme: Forest Products Classification and Definitions (FPC&D) v2022
definition: Vegetable parchment is made by passing sheets of paper made of pulp fibres into sulfuric acid. The sulfuric acid hydrolyses and solubilizes the main natural organic polymer, cellulose, present in the pulp wood fibres. The paper web is then washed in water, which stops the hydrolysis of the cellulose and causes a kind of cellulose coating to form on the paper. The final paper is dried and it is then resistant to grease and semi-translucent.
broader: Wrapping papers

Stumps and roots
type: Concept
notation: 011.92
in scheme: Forest Products Classification and Definitions (FPC&D) v2022
definition: It includes wood from other parts than main stem and branches where these are harvested for fuel, e.g. tops, small branches and twigs, stumps and roots, bark separated in the forest from wood in the rough.
broader: Other wood fuel (tops, small branches and twigs; stumps and roots; bark)
narrower: Stumps and roots, coniferous
narrower: Stumps and roots, tropical non-coniferous
narrower: Other stumps and roots

Wood chips and particles
type: Concept
notation: 032.
in scheme: Forest Products Classification and Definitions (FPC&D) v2022
definition: Wood, which has been deliberately reduced to chips (flat, rigid and roughly squared), particles (thin and flexible), flakes, etc. from wood in the rough, processing residues or recovered wood products and has not been agglomerated. Wood chips and particles are used for producing cellulose pulp by mechanical means, by chemical means or by combining mechanical and chemical means, for the manufacture of fibreboard or particle board, for energy or for other purposes. The specification of the chips and particles may vary in respect to dimensions and quality according to location and end-use. The pieces are in forms ranging from flat, rigid and roughly squared chips down to small, thin flexible particles.
broader: WOOD CHIPS AND PARTICLES, RESIDUES AND RECOVERABLE WOOD PRODUCTS
narrower: Wood chips and particles from wood in the rough
narrower: Wood chips and particles from wood processing
narrower: Wood chips and particles from recovered wood products

Pressurised stone groundwood, bleached, coniferous
type: Concept
notation: 081.221
in scheme: Forest Products Classification and Definitions (FPC&D) v2022
definition: N.A.
broader: Pressurised stone groundwood, bleached

Other decorative veneer sheets
type: Concept
notation: 061.9
in scheme: Forest Products Classification and Definitions (FPC&D) v2022
definition: N.A.
broader: Decorative veneer sheets
narrower: Other decorative veneer sheets, for plywood (faces)
narrower: Other decorative veneer sheets, for other purposes (facing of sawnwood, panel, furniture, etc.)

Natural cork
type: Concept
notation: 121.
in scheme: Forest Products Classification and Definitions (FPC&D) v2022
definition: Cork having undergone no treatment whatever after stripping.
broader: CORK
narrower: Natural cork, raw or simply prepared
narrower: Natural cork, debacked or roughly squared, or in rectangular blocks, plates, sheets or strip
narrower: Articles of natural cork
narrower: Waste of natural or agglomerated cork
narrower: Crushed, granulated or ground cork

Further processed sawnwood, coniferous, rounded wood
type: Concept
notation: 131.15
in scheme: Forest Products Classification and Definitions (FPC&D) v2022
definition: It covers drawn woods, which are used in the manufacture of certain types of match splints, pegs for footwear, certain types of wooden sun blinds, toothpicks, cheese making screens, etc.
broader: Further processed sawnwood, coniferous

Other articles of paper and paperboard ready for use, moulded or pressed articles of paper pulp
type: Concept
notation: 146.94
in scheme: Forest Products Classification and Definitions (FPC&D) v2022
definition: It includes e.g. articles used for protective packaging or for food service trays and beverage carriers. Other typical uses are end caps, trays, plates, bowls and clamshell containers.
broader: Other articles of paper and paperboard ready for use

Dry process fibreboard of a density exceeding 0.5 g/cm³ but not exceeding 0.8 g/cm³ , of a thickness exceeding 9 mm
type: Concept
notation: 074.123
in scheme: Forest Products Classification and Definitions (FPC&D) v2022
definition: N.A.
broader: Dry process fibreboard of a density exceeding 0.5 g/cm³ but not exceeding 0.8 g/cm³

Tropical non-coniferous, sleepers
type: Concept
notation: 052.1
in scheme: Forest Products Classification and Definitions (FPC&D) v2022
definition: Railway or tramway sleepers are pieces of unplaned wood, of more or less rectangular section of the kind commonly used to support railway or tramway track. There are also included switch ties, which are longer than sleepers, and bridge ties, which are wider and thicker and usually longer than sleepers. It includes sawn sleepers, hewn sleepers, untreated and treated sleepers
broader: Tropical non-coniferous, sawnwood and sleepers
narrower: Tropical non-coniferous, sleepers, treated or impregnated
narrower: Tropical non-coniferous, sleepers, n.e.c.

Paper and paperboard stationery, envelopes
type: Concept
notation: 146.31
in scheme: Forest Products Classification and Definitions (FPC&D) v2022
definition: Envelopes can be printed with addresses, names, trademarks, decorations, crests, initials, etc.
broader: Paper and paperboard stationery

Other Tableware and kitchenware
type: Concept
notation: 133.29
in scheme: Forest Products Classification and Definitions (FPC&D) v2022
definition: It includes household articles of wood, which are used as tableware or kitchenware like spoons, forks, salad servers; platters and serving dishes; jars, cups and saucers; etc.
broader: Tableware and kitchenware

CORK
top concept of: Forest Products Classification and Definitions (FPC&D) v2022
type: Concept
notation: 12
in scheme: Forest Products Classification and Definitions (FPC&D) v2022
definition: Cork is obtained almost exclusively from the outer bark of the cork-oak (Quercus suber).
narrower: Natural cork
narrower: Agglomerated cork and articles of agglomerated cork

Natural cork, raw or simply prepared
type: Concept
notation: 121.1
in scheme: Forest Products Classification and Definitions (FPC&D) v2022
definition: Raw cork is presented in curved slabs as stripped from the cork tree. It includes cork which has been surface scraped or cleaned. It includes cork treated with fungicides or flattened by pressing after treatment in boiling water or stream. It excludes debacked cork (deprived of the outer bark), cork roughly squared
broader: Natural cork

Other roughly trimmed wood, wooden sticks roughly trimmed
type: Concept
notation: 024.94
in scheme: Forest Products Classification and Definitions (FPC&D) v2022
definition: Products of different length and thickness which serve as a raw material for the next manufacture of walking sticks, whips, umbrellas, handles for tools, etc
broader: Other roughly trimmed wood

Other Engineered structural timber products
type: Concept
notation: 135.79
in scheme: Forest Products Classification and Definitions (FPC&D) v2022
definition: Parallel strand lumber (PSL) is a form of wood product made from clipped veneer strands laid in parallel alignment and bonded with adhesive. Laminated strand lumber (LSL) resembles oriented strandboard in appearance because like OSB, LSL is made from long strands coming from fast-growing aspen or poplar. However, unlike OSB, the strands are arranged parallel to the longitudinal axis of the member. Oriented strand lumber (OSL) is made from flaked wood strands with a high length-to-thickness ratio. The strands are oriented and combined with an adhesive to form a large mat or billet and then pressed.
broader: Engineered structural timber products

Other tops, small branches and twigs, for particle board
type: Concept
notation: 012.2192
in scheme: Forest Products Classification and Definitions (FPC&D) v2022
definition: N.A.
broader: Other tops, small branches and twigs

Cellular board
type: Concept
notation: 071.3
in scheme: Forest Products Classification and Definitions (FPC&D) v2022
definition: Plywood with a core of cellular construction, which are somewhat similar in appearance to the blockboard and battenboard but the battens or laths forming the core are spaced one from the other, either parallel or in lattice form. Cellular boards are used for partitions, doors and sometimes in the manufacture of furniture.
broader: Plywood
narrower: Cellular board, coniferous
narrower: Cellular board, tropical non-coniferous
narrower: Other cellular board

Other solid wood processing residues, for uses n.e.c.
type: Concept
notation: 031.199
in scheme: Forest Products Classification and Definitions (FPC&D) v2022
definition: N.A.
broader: Other solid wood processing residues

Bark separated in the forest from wood in the rough
type: Concept
notation: 012.23
in scheme: Forest Products Classification and Definitions (FPC&D) v2022
definition: Includes all bark removed from the sterns or other parts of the tree during harvesting operations, as well as bark removed at the lower landing. It can be used for horticulture purposes or for other uses.
broader: Wood in the rough other than from the main stem and branches
narrower: Bark separated in the forest from wood in the rough, coniferous
narrower: Bark separated in the forest from wood in the rough, tropical non-coniferous
narrower: Other bark separated in the forest from wood in the rough

Coated graphic papers, woodfree, carbon paper, self-copy paper and other copying or transfer papers
type: Concept
notation: 111.321
in scheme: Forest Products Classification and Definitions (FPC&D) v2022
definition: Papers coated on one side with a layer of a loosely bound dry ink or pigmented coating, bound with wax, used for making one or more copies simultaneously with the creation of an original document by applying pressure (using a typewriter or a ballpoint pen). These products must be in strips or rolls of a width exceeding 36 cm.
broader: Coated graphic papers, woodfree

Other roundwood treated with preservatives, for piling
type: Concept
notation: 023.92
in scheme: Forest Products Classification and Definitions (FPC&D) v2022
definition: Long straight pieces, suitable for driving into the ground under impact. They are used principally in construction of harbour works and underpinning for bridges and buildings.
broader: Other roundwood treated with preservatives

Wet process fibreboard, of a density exceeding 0.8 g/cm³
type: Concept
notation: 074.23
in scheme: Forest Products Classification and Definitions (FPC&D) v2022
definition: This type of fibreboard has one smooth and one rough surface with a mesh pattern. It is mainly used for furniture, in the automotive industries, for door skins and for packaging. It excludes similar products made from pieces of wood, wood flour or other ligno-cellulosic material where additional binders are required to make the panel; and panels made of gypsum or other mineral material.
broader: Wet process fibreboard

Other torrefied wood, for uses n.e.c.
type: Concept
notation: 022.99
in scheme: Forest Products Classification and Definitions (FPC&D) v2022
definition: N.A.
broader: Other torrefied wood

Other pulpwood and wood for wood-based panels, for uses n.e.c.
type: Concept
notation: 012.1299
in scheme: Forest Products Classification and Definitions (FPC&D) v2022
definition: N.A.
broader: Other pulpwood and wood for wood-based panels

Other stumps and roots, for pulp
type: Concept
notation: 012.2291
in scheme: Forest Products Classification and Definitions (FPC&D) v2022
definition: N.A.
broader: Other stumps and roots

Windows, French-windows and their frames, tropical non-coniferous
type: Concept
notation: 135.11
in scheme: Forest Products Classification and Definitions (FPC&D) v2022
definition: It includes windows, French-windows and their frames used in the construction.
broader: Windows, French-windows and their frames

Other carbon paper and copying paper ready for use
type: Concept
notation: 143.9
in scheme: Forest Products Classification and Definitions (FPC&D) v2022
definition: It includes papers combine two or more of the reproduction processes described in the groups 143.1, 143.2, 143.3, 143.4, 143.5, and other n.e.c.
broader: Carbon paper and copying paper ready for use

Further processed sawnwood, coniferous, thermowood and torrefied sawnwood
type: Concept
notation: 131.16
in scheme: Forest Products Classification and Definitions (FPC&D) v2022
definition: The manufacturing process of ThermoWood is based on the use of high temperature and steam. No chemicals are used in the treatment. The process improves dimensional stability and biological durability of wood. Another improvement is in the insulation properties of the final material, the process leads to a reduction in thermal conductivity. Due to the high treatment temperatures the resin is removed from the wood. The manufacture of torrefied sawnwood consists of heating the wood at a very high temperature (from 190 to 240°C), in a torrefaction kiln (autoclave) at controlled atmosphere and low in oxygen. The length of the process, as well as the temperature degree sustained during a determined period, depends on the torrefied specie and the desired colour. This technology requires a pre-drying process using conventional kiln driers, to lower the moisture level between 6% and 10%. After that, the torrefaction kiln lowers the moisture level to 0%. Finally, the wood is placed in a conditioning chamber where the temperature is gradually lowered by controlled steam injection. The moisture level of the product is increased between 3% and 6%, in order to give back to the wood its natural flexibility. This conditioning stabilizes the wood and allows better quality manufacturing.
broader: Further processed sawnwood, coniferous

Core plywood, with at least one outer ply of tropical wood, n.e.c. (MDF core, particleboard core, veneer core, etc.)
type: Concept
notation: 071.229
in scheme: Forest Products Classification and Definitions (FPC&D) v2022
definition: Plywood in which the wooden core is replaced by other materials such as a layer or layers of particle board, fibreboard, wood waste glued together, etc.
broader: Core plywood, with at least one outer ply of tropical wood

Wooden wrapping and packaging material
type: Concept
notation: 132.
in scheme: Forest Products Classification and Definitions (FPC&D) v2022
definition: It includes packing cases, boxes, crates, drums and similar packings, of wood; cable-drums of wood; pallets, box pallets and other load boards, of wood; pallet collars of wood. Casks, barrels, vats, tubs and other coopers' products and parts thereof, of wood, including staves.
broader: SECONDARY WOOD PRODUCTS
narrower: Packing cases, boxes, crates, drums and similar packings
narrower: Cable drums
narrower: Pallets, box pallets and other load boards
narrower: Pallet collars
narrower: Casks, barrels, vats, tubs and other coopers' products
narrower: Parts of coopers' products from wood, including staves
narrower: Other wooden wrapping and packaging material

Other tops, small branches and twigs
type: Concept
notation: 012.219
in scheme: Forest Products Classification and Definitions (FPC&D) v2022
definition: Includes tops, small branches and twigs from felled trees. The lower limit of the top (the upper limit of the stem) will vary according to local logging practices
broader: Tops, small branches and twigs
narrower: Other tops, small branches and twigs, for pulp
narrower: Other tops, small branches and twigs, for particle board
narrower: Other tops, small branches and twigs, for fibreboard
narrower: Other tops, small branches and twigs, for uses n.e.c.

Agglomerated cork and articles of agglomerated cork, with a binding substance, gaskets, washers and other seals of agglomerated cork, for civil aircraft
type: Concept
notation: 122.13
in scheme: Forest Products Classification and Definitions (FPC&D) v2022
definition: Agglomerated cork in the form of gaskets, washers and other seals of agglomerated cork, for civil aircraft.
broader: Agglomerated cork and articles of agglomerated cork, with a binding substance

Other further processed sawnwood, boards with rounded edges or ends
type: Concept
notation: 131.91
in scheme: Forest Products Classification and Definitions (FPC&D) v2022
definition: Wood sawn or chipped lengthwise with rounded edges or ends.
broader: Other further processed sawnwood

Other non-coniferous, sawnwood and sleepers
type: Concept
notation: 053.
in scheme: Forest Products Classification and Definitions (FPC&D) v2022
definition: N.A.
broader: SAWNWOOD
narrower: Other non-coniferous, sleepers
narrower: Other non-coniferous, sawnwood rough
narrower: Other non-coniferous, sawnwood planed
narrower: Other non-coniferous n.e.c.

Other wood fuel from main stem and branches, for uses n.e.c.
type: Concept
notation: 011.199
in scheme: Forest Products Classification and Definitions (FPC&D) v2022
definition: N.A.
broader: Other wood fuel from the main stem and branches

Chemi-mechanical pulp, unbleached, coniferous
type: Concept
notation: 082.211
in scheme: Forest Products Classification and Definitions (FPC&D) v2022
definition: N.A.
broader: Chemi-mechanical pulp, unbleached

Agglomerated cork and articles of agglomerated cork, with a binding substance, corks and stoppers
type: Concept
notation: 122.12
in scheme: Forest Products Classification and Definitions (FPC&D) v2022
definition: It includes corks and stoppers of all kinds made from agglomerated cork.
broader: Agglomerated cork and articles of agglomerated cork, with a binding substance

Other agglomerates n.e.c., for other uses
type: Concept
notation: 043.99
in scheme: Forest Products Classification and Definitions (FPC&D) v2022
definition: N.A.
broader: Other agglomerates n.e.c.

Other uncoated paper and paperboard weighing 225 g/m² or more
type: Concept
notation: 113.91
in scheme: Forest Products Classification and Definitions (FPC&D) v2022
definition: Other uncoated paper and paperboards weighing 225 g/m² or more, in rolls or sheets, and not further worked or processed.
broader: Other papers mainly for packaging

Tops, small branches and twigs, tropical non-coniferous, for pellets
type: Concept
notation: 011.9121
in scheme: Forest Products Classification and Definitions (FPC&D) v2022
definition: N.A.
broader: Tops, small branches and twigs, tropical non-coniferous

Chemi-mechanical pulp
type: Concept
notation: 082.2
in scheme: Forest Products Classification and Definitions (FPC&D) v2022
definition: Chemi-mechanical pulp is produced in refiners from wood in chips, shavings, sawdust, etc. The wood is reduced to a fibrous state by the abrasive action. Small amounts of chemicals are introduced as a pre-treatment or during refining in order to facilitate fibre separation.
broader: Semi-chemical wood pulp
narrower: Chemi-mechanical pulp, unbleached
narrower: Chemi-mechanical pulp, bleached

Coniferous, sawnwood rough, n.e.c.
type: Concept
notation: 051.29
in scheme: Forest Products Classification and Definitions (FPC&D) v2022
definition: Wood sawn or chipped lengthwise, not planed, sanded or finger-jointed and which was not treated for the purpose of protection.
broader: Coniferous, sawnwood rough

Other plywood n.e.c., with at least one outer ply of tropical wood
type: Concept
notation: 071.92
in scheme: Forest Products Classification and Definitions (FPC&D) v2022
definition: N.A.
broader: Other plywood n.e.c.

Other core plywood, with at least one outer ply of non-coniferous non-tropical wood n.e.c. (MDF core, particleboard core, veneer core, etc.)
type: Concept
notation: 071.299
in scheme: Forest Products Classification and Definitions (FPC&D) v2022
definition: Plywood in which the wooden core is replaced by other materials such as a layer or layers of particle board, fibreboard, wood waste glued together, etc.
broader: Other core plywood, with at least one outer ply of non-coniferous non-tropical wood

Wood flour
type: Concept
notation: 026.
in scheme: Forest Products Classification and Definitions (FPC&D) v2022
definition: Wood flour is finely pulverized wood that has a consistency fairly equal to sand or sawdust, but can vary considerably, with particles ranging in size from a fine powder to roughly the size of a grain of rice. It is commonly used as a filler in thermosetting resins such as bakelite, and in linoleum floor coverings. Wood flour is also the main ingredient in wood-plastic composite products such as decks and roofs.
broader: WOOD SIMPLY WORKED OR PROCESSED
narrower: Wood flour, coniferous
narrower: Other wood flour

Wood fuel, coniferous, for pellets
type: Concept
notation: 011.111
in scheme: Forest Products Classification and Definitions (FPC&D) v2022
definition: N.A.
broader: Wood fuel from the main stem and branches, coniferous

Paper and paperboard stationery, manifold business forms and interleaved carbon sets
type: Concept
notation: 146.37
in scheme: Forest Products Classification and Definitions (FPC&D) v2022
definition: It includes multipart form sets either printed on self-copy paper or interleaved with carbon paper. These forms are used to make multiple copies. Interleaved carbon sets are similar to manifold business forms but they either contain no printed matter or contain only identifying information such as letter heads.
broader: Paper and paperboard stationery

Non-decorative veneer sheets, coniferous
type: Concept
notation: 062.1
in scheme: Forest Products Classification and Definitions (FPC&D) v2022
definition: N.A.
broader: Non-decorative veneer sheets
narrower: Non-decorative veneer sheets, coniferous, for plywood (face and core material)
narrower: Non-decorative veneer sheets, coniferous, for other purposes (match boxes, violin, … )

Thermoplastic bonded panels
type: Concept
notation: 077.3
in scheme: Forest Products Classification and Definitions (FPC&D) v2022
definition: Panels manufactured from particles of wood, bagasse, straw or other ligno-cellulosic materials bonded with thermoplastic (PE, PP, PVC etc.)
broader: Other panels based on wood or other ligno-cellulosic materials
narrower: Thermoplastic bonded panels, wood-plastic composite
narrower: Other thermoplastic bonded panels

Soda or sulphate chemical wood pulp, unbleached, coniferous
type: Concept
notation: 083.111
in scheme: Forest Products Classification and Definitions (FPC&D) v2022
definition: N.A.
broader: Soda or sulphate chemical wood pulp, unbleached

Pulps of fibres derived from recovered (waste and scrap) paper or paperboard, bleached
type: Concept
notation: 092.12
in scheme: Forest Products Classification and Definitions (FPC&D) v2022
definition: Pulp treated with chemicals to increase its brightness.
broader: Pulps of fibres derived from recovered (waste and scrap) paper or paperboard

Other stumps and roots, for pellets
type: Concept
notation: 011.9291
in scheme: Forest Products Classification and Definitions (FPC&D) v2022
definition: N.A.
broader: Other stumps and roots

Doors and their frames and thresholds, other
type: Concept
notation: 135.29
in scheme: Forest Products Classification and Definitions (FPC&D) v2022
definition: Doors and their frames and thresholds used in the construction. They can be made from of ordinary wood or of particle board, fibreboard, laminated wood or densified wood.
broader: Doors and their frames and thresholds

Tools, tool bodies, tool handles
type: Concept
notation: 134.1
in scheme: Forest Products Classification and Definitions (FPC&D) v2022
definition: It includes tool bodies of not fitted with their metal working parts and wooden handles for tools or implements of all kinds (e.g., handles for spades, shovels, rakes, hammers, screwdrivers, saws, etc.)
broader: Other manufactured wood products

Other shavings, for particle board
type: Concept
notation: 031.392
in scheme: Forest Products Classification and Definitions (FPC&D) v2022
definition: N.A.
broader: Other shavings

Other solid wood processing residues, for particle board
type: Concept
notation: 031.192
in scheme: Forest Products Classification and Definitions (FPC&D) v2022
definition: N.A.
broader: Other solid wood processing residues

Other Laminated veneered lumber
type: Concept
notation: 071.49
in scheme: Forest Products Classification and Definitions (FPC&D) v2022
definition: Laminated veneer lumber is the wood product that uses multiple layers of thin wood assembled with adhesives. Laminated veneer lumber is similar in appearance to plywood without crossbands.
broader: Laminated veneered lumber (LVL)

Chemi-mechanical pulp, bleached, coniferous
type: Concept
notation: 082.221
in scheme: Forest Products Classification and Definitions (FPC&D) v2022
definition: N.A.
broader: Chemi-mechanical pulp, bleached

Tropical non-coniferous, sawnwood rough
type: Concept
notation: 052.2
in scheme: Forest Products Classification and Definitions (FPC&D) v2022
definition: Wood sawn or chipped lengthwise, not planed, sanded or finger-jointed. It may be green (undried) or dried. It excludes sawn and hewn railway sleepers, wood shingles and sawn veneer sheets.
broader: Tropical non-coniferous, sawnwood and sleepers
narrower: Tropical non-coniferous, sawnwood rough, treated or impregnated
narrower: Tropical non-coniferous, sawnwood rough, n.e.c.

Solid wood processing residues, coniferous, for energy
type: Concept
notation: 031.114
in scheme: Forest Products Classification and Definitions (FPC&D) v2022
definition: N.A.
broader: Solid wood processing residues, coniferous

Bark removed during processing, coniferous, for uses n.e.c.
type: Concept
notation: 031.419
in scheme: Forest Products Classification and Definitions (FPC&D) v2022
definition: N.A.
broader: Bark removed during processing, coniferous

Other core plywood, with at least one outer ply of non-coniferous non-tropical wood , blockboard, laminboard and battenboard
type: Concept
notation: 071.291
in scheme: Forest Products Classification and Definitions (FPC&D) v2022
definition: Plywood with a solid core (i.e. the central layer, generally thicker than the other plies) that consists of narrow boards, blocks or strips of wood placed side by side, which may or may not be glued together.
broader: Other core plywood, with at least one outer ply of non-coniferous non-tropical wood

Other stumps and roots, for uses n.e.c.
type: Concept
notation: 011.9299
in scheme: Forest Products Classification and Definitions (FPC&D) v2022
definition: N.A.
broader: Other stumps and roots

Other non-coniferous, sawnwood planed, treated or impregnated
type: Concept
notation: 053.31
in scheme: Forest Products Classification and Definitions (FPC&D) v2022
definition: Wood sawn or chipped lengthwise, and planed, sanded or finger-jointed, which was not kiln- or air-dried but was treated with insecticides or fungicides for the purpose of protection. For long-term preservation they can be impregnated with creosote or other substances.
broader: Other non-coniferous, sawnwood planed

Wood fuel, tropical non-coniferous, for uses n.e.c.
type: Concept
notation: 011.129
in scheme: Forest Products Classification and Definitions (FPC&D) v2022
definition: N.A.
broader: Wood fuel from the main stem and branches, tropical non-coniferous

Pressurised stone groundwood, unbleached
type: Concept
notation: 081.21
in scheme: Forest Products Classification and Definitions (FPC&D) v2022
definition: Pulp not treated with chemicals to increase its brightness.
broader: Pressurised stone groundwood
narrower: Pressurised stone groundwood, unbleached, coniferous
narrower: Other unbleached pressurised stone groundwood

FPC&D2022: Level 3
type: ClassificationLevel
depth: 3

Laminated veneered lumber (LVL)
type: Concept
notation: 071.4
in scheme: Forest Products Classification and Definitions (FPC&D) v2022
definition: Laminated veneer lumber is the wood product that uses multiple layers of thin wood assembled with adhesives. Laminated veneer lumber is similar in appearance to plywood without crossbands.
broader: Plywood
narrower: Laminated veneered lumber, with both outer plies of coniferous wood
narrower: Laminated veneered lumber, with at least one outer ply of tropical wood
narrower: Other Laminated veneered lumber

Agglomerated cork and articles of agglomerated cork, without a binding substance, corks and stoppers
type: Concept
notation: 122.22
in scheme: Forest Products Classification and Definitions (FPC&D) v2022
definition: It includes corks and stoppers of all kinds made from agglomerated cork.
broader: Agglomerated cork and articles of agglomerated cork, without a binding substance

Sawdust
type: Concept
notation: 031.2
in scheme: Forest Products Classification and Definitions (FPC&D) v2022
definition: Wood dust produced in the process of sawing.
broader: Wood residues (including wood for agglomerates)
narrower: Sawdust, coniferous
narrower: Other sawdust

Statuettes and other ornaments, tropical non-coniferous
type: Concept
notation: 133.51
in scheme: Forest Products Classification and Definitions (FPC&D) v2022
definition: It includes statuettes, animals, figures and other ornaments.
broader: Statuettes and other ornaments

Tops, small branches and twigs, tropical non-coniferous, for particle board
type: Concept
notation: 012.2122
in scheme: Forest Products Classification and Definitions (FPC&D) v2022
definition: N.A.
broader: Tops, small branches and twigs, tropical non-coniferous

Other agglomerates, coniferous, for uses n.e.c.
type: Concept
notation: 043.19
in scheme: Forest Products Classification and Definitions (FPC&D) v2022
definition: N.A.
broader: Other agglomerates, coniferous

Refiner mechanical pulp, bleached
type: Concept
notation: 081.32
in scheme: Forest Products Classification and Definitions (FPC&D) v2022
definition: Pulp treated with chemicals to increase its brightness.
broader: Refiner mechanical pulp
narrower: Refiner mechanical pulp, bleached, coniferous
narrower: Other bleached refiner mechanical pulp

Other wood chips and particles from wood processing, for energy
type: Concept
notation: 032.294
in scheme: Forest Products Classification and Definitions (FPC&D) v2022
definition: N.A.
broader: Other wood chips and particles from wood processing

Bark removed during processing
type: Concept
notation: 031.4
in scheme: Forest Products Classification and Definitions (FPC&D) v2022
definition: Bark, separated from the wood in the wood-processing industries.
broader: Wood residues (including wood for agglomerates)
narrower: Bark removed during processing, coniferous
narrower: Other bark removed during processing

Coated graphic papers, woodfree
type: Concept
notation: 111.32
in scheme: Forest Products Classification and Definitions (FPC&D) v2022
definition: Coated paper and paperboard not containing 10 % or more fibres obtained by mechanical or thermo-mechanical process.
broader: Coated graphic papers
narrower: Coated graphic papers, woodfree, carbon paper, self-copy paper and other copying or transfer papers
narrower: Other wood free coated graphic papers

Sawlogs and veneer logs, coniferous, for veneer sheets
type: Concept
notation: 012.1112
in scheme: Forest Products Classification and Definitions (FPC&D) v2022
definition: N.A.
broader: Sawlogs and veneer logs, coniferous

Bark removed during processing, coniferous
type: Concept
notation: 031.41
in scheme: Forest Products Classification and Definitions (FPC&D) v2022
definition: Bark, separated from the wood in the wood-processing industries.
broader: Bark removed during processing
narrower: Bark removed during processing, coniferous, for horticulture purposes
narrower: Bark removed during processing, coniferous, for energy
narrower: Bark removed during processing, coniferous, for uses n.e.c.

Other wood wool
type: Concept
notation: 025.9
in scheme: Forest Products Classification and Definitions (FPC&D) v2022
definition: Wood wool is a product consists of wood slivers, curled or twisted, which have regular size, thickness and length. It is cut from logs (poplar, coniferous tree species) and is mainly used in packaging, for cooling pads in home evaporative cooling systems known as swamp coolers, for erosion control mats, and as a raw material for the production of other products such as bonded wood wool boards and used as stuffing for stuffed animals.
broader: Wood wool

Other shavings, for pulp
type: Concept
notation: 031.391
in scheme: Forest Products Classification and Definitions (FPC&D) v2022
definition: N.A.
broader: Other shavings

Other unbleached sulphite chemical wood pulp
type: Concept
notation: 083.219
in scheme: Forest Products Classification and Definitions (FPC&D) v2022
definition: N.A.
broader: Sulphite chemical wood pulp, unbleached

Wood fuel simply worked
type: Concept
notation: 027.
in scheme: Forest Products Classification and Definitions (FPC&D) v2022
definition: Fuel wood, in logs, in billets, in twigs, in faggots or in similar forms.
broader: WOOD SIMPLY WORKED OR PROCESSED
narrower: Wood fuel simply worked, coniferous
narrower: Other wood fuel simply worked

Other mechanical coated graphic papers
type: Concept
notation: 111.319
in scheme: Forest Products Classification and Definitions (FPC&D) v2022
definition: Other mechanical coated papers.
broader: Coated graphic papers, mechanical

Sulphate dissolving wood pulp
type: Concept
notation: 084.1
in scheme: Forest Products Classification and Definitions (FPC&D) v2022
definition: Dissolving grade wood pulp obtained by use of the sulphate and soda process (description in the group 083.1).
broader: Dissolving wood pulp
narrower: Sulphate dissolving wood pulp, coniferous
narrower: Other sulphate dissolving wood pulp

Stumps and roots, coniferous
type: Concept
notation: 011.921
in scheme: Forest Products Classification and Definitions (FPC&D) v2022
definition: N.A.
broader: Stumps and roots
narrower: Stumps and roots, coniferous, for pellets
narrower: Stumps and roots, coniferous, for uses n.e.c.

Other non-coniferous n.e.c.
type: Concept
notation: 053.9
in scheme: Forest Products Classification and Definitions (FPC&D) v2022
definition: N.A.
broader: Other non-coniferous, sawnwood and sleepers

Casks, barrels, vats, tubs and other coopers' products
type: Concept
notation: 132.5
in scheme: Forest Products Classification and Definitions (FPC&D) v2022
definition: It includes containers which the bodies are composed of staves with grooves into which the heads and bottoms are fitted and the shape being maintained by hoops of wood or metal.
broader: Wooden wrapping and packaging material

Contaminated recoverable wood products, coniferous
type: Concept
notation: 033.21
in scheme: Forest Products Classification and Definitions (FPC&D) v2022
definition: The recoverable wood products have been contaminated (e.g. by impregnation, gluing, coating, painting or nailing) to such an extent that they are unsuitable as raw material for pulp particle board or fibreboard. They are usually only suitable as energy source.
broader: Contaminated recoverable wood products
narrower: Contaminated recoverable wood products, coniferous, for energy
narrower: Contaminated recoverable wood products, coniferous, for uses n.e.c.

Other pulpwood and wood for wood-based panels, for pulp
type: Concept
notation: 012.1291
in scheme: Forest Products Classification and Definitions (FPC&D) v2022
definition: N.A.
broader: Other pulpwood and wood for wood-based panels

Pulpwood and wood for wood-based panels, coniferous, for pulp
type: Concept
notation: 012.1211
in scheme: Forest Products Classification and Definitions (FPC&D) v2022
definition: N.A.
broader: Pulpwood and wood for wood-based panels, coniferous

Pressurised stone groundwood, unbleached, coniferous
type: Concept
notation: 081.211
in scheme: Forest Products Classification and Definitions (FPC&D) v2022
definition: N.A.
broader: Pressurised stone groundwood, unbleached

Other non-coniferous, sawnwood rough, other
type: Concept
notation: 053.29
in scheme: Forest Products Classification and Definitions (FPC&D) v2022
definition: Wood sawn or chipped lengthwise, not planed, sanded or finger-jointed and which was not treated for the purpose of protection.
broader: Other non-coniferous, sawnwood rough

Semi-chemical pulp, bleached, coniferous
type: Concept
notation: 082.121
in scheme: Forest Products Classification and Definitions (FPC&D) v2022
definition: N.A.
broader: Semi-chemical pulp, bleached

Pulpwood and wood for wood-based panels, tropical non-coniferous, for uses n.e.c.
type: Concept
notation: 012.1229
in scheme: Forest Products Classification and Definitions (FPC&D) v2022
definition: N.A.
broader: Pulpwood and wood for wood-based panels, tropical non-coniferous

Other builder's joinery and carpentry of wood
type: Concept
notation: 135.9
in scheme: Forest Products Classification and Definitions (FPC&D) v2022
definition: Other builder's joinery and carpentry of wood
broader: Builder's joinery and carpentry of wood

Prefabricated buildings, of wood, complete buildings, fully assembled
type: Concept
notation: 137.1
in scheme: Forest Products Classification and Definitions (FPC&D) v2022
definition: It includes complete buildings, fully assembled and ready for use.
broader: Prefabricated buildings of wood

Prefabricated buildings of wood
type: Concept
notation: 137.
in scheme: Forest Products Classification and Definitions (FPC&D) v2022
definition: It includes prefabricated buildings where the main construction material is wood.
broader: SECONDARY WOOD PRODUCTS
narrower: Prefabricated buildings, of wood, complete buildings, fully assembled
narrower: Prefabricated buildings, of wood, complete buildings, unassembled
narrower: Prefabricated buildings, of wood, incomplete buildings

Assembled flooring panels
type: Concept
notation: 135.6
in scheme: Forest Products Classification and Definitions (FPC&D) v2022
definition: It includes solid blocks, strips, friezes, etc., assembled into flooring panels or tiles. It also includes flooring panels or tiles consisting of blocks, strips, friezes, etc., assembled on a support of one or more layers of wood, known as “multilayer” parquet flooring panels.
broader: Builder's joinery and carpentry of wood

Pulpwood, round and split and wood for wood-based panels
type: Concept
notation: 012.12
in scheme: Forest Products Classification and Definitions (FPC&D) v2022
definition: Roundwood that will be used for the production of pulp, particleboard, oriented strand board (OSB) or fibreboard. It includes: roundwood (with or without bark) that will be used for these purposes in its round form or as splitwood or wood chips made directly (i.e. in the forest) from roundwood
broader: Wood in the rough from the main stem and branches
narrower: Pulpwood and wood for wood-based panels, coniferous
narrower: Pulpwood and wood for wood-based panels, tropical non-coniferous
narrower: Other pulpwood and wood for wood-based panels

Recovered fibre pulp
type: Concept
notation: 092.
in scheme: Forest Products Classification and Definitions (FPC&D) v2022
definition: Pulp manufactured from recovered paper or paperboard and used for the manufacture of paper, paperboard and fibreboard. It excludes pulp made from straw; bamboo; bagasse; esparto; other reeds or grasses; cotton fibres; flax; hemp; rags; and other textile wastes. It may be unbleached or bleached.
broader: OTHER PULP
narrower: Pulps of fibres derived from recovered (waste and scrap) paper or paperboard
narrower: Unbleached kraft paper or paperboard or corrugated paper or paperboard

Wood chips and particles from wood in the rough
type: Concept
notation: 032.1
in scheme: Forest Products Classification and Definitions (FPC&D) v2022
definition: Wood, which has been deliberately reduced to chips, particles, flakes, etc. directly from wood in the rough, not during the processing of wood.
broader: Wood chips and particles
narrower: Wood chips and particles from wood in the rough, coniferous
narrower: Other wood chips and particles from wood in the rough

Other industrial roundwood, coniferous, for other uses in the rough (fencing, …)
type: Concept
notation: 012.1315
in scheme: Forest Products Classification and Definitions (FPC&D) v2022
definition: N.A.
broader: Other industrial roundwood, coniferous

Other wood particle board n.e.c.
type: Concept
notation: 072.19
in scheme: Forest Products Classification and Definitions (FPC&D) v2022
definition: Other wood particle board n.e.c. not mentioned under 072.11, 072.12, 072.13
broader: Wood particle board

Other bleached or semi-bleached soda or sulphate chemical wood pulp
type: Concept
notation: 083.129
in scheme: Forest Products Classification and Definitions (FPC&D) v2022
definition: N.A.
broader: Soda or sulphate chemical wood pulp, bleached or semi-bleached

Other plywood n.e.c., other
type: Concept
notation: 071.99
in scheme: Forest Products Classification and Definitions (FPC&D) v2022
definition: N.A.
broader: Other plywood n.e.c.

Glue‑laminated timber (GLULAM)
type: Concept
notation: 135.71
in scheme: Forest Products Classification and Definitions (FPC&D) v2022
definition: Glue-laminated timber is a type of structural timber product comprising a number of layers of dimensioned timber bonded together with durable, moisture-resistant structural adhesives. The wood laminations have their grain essentially parallel.
broader: Engineered structural timber products

Mineral bonded panels, other than cement bonded
type: Concept
notation: 077.2
in scheme: Forest Products Classification and Definitions (FPC&D) v2022
definition: Panels manufactured from chips particles, flakes etc. of wood or other ligno-cellulosic materials, bonded together with mineral binders other than cement, and chemical additives (e.g. gypsum board).
broader: Other panels based on wood or other ligno-cellulosic materials
narrower: Mineral bonded panels, other than cement bonded, gypsum fibreboard
narrower: Mineral bonded panels, other than cement bonded, gypsum particle board
narrower: Other mineral bonded panels, other than cement bonded

Contaminated recoverable wood products, coniferous, for energy
type: Concept
notation: 033.211
in scheme: Forest Products Classification and Definitions (FPC&D) v2022
definition: N.A.
broader: Contaminated recoverable wood products, coniferous

Other panels based on wood or other ligno-cellulosic materials
type: Concept
notation: 077.
in scheme: Forest Products Classification and Definitions (FPC&D) v2022
definition: This heading includes notably cement bonded panels, other mineral bonded panels and thermoplastic bonded panels.
broader: WOOD-BASED PANELS
narrower: Cement bonded panels
narrower: Mineral bonded panels, other than cement bonded
narrower: Thermoplastic bonded panels
narrower: Other panels n.e.c.

Cartonboard
type: Concept
notation: 113.2
in scheme: Forest Products Classification and Definitions (FPC&D) v2022
definition: Sometimes referred to as folding boxboard, it may be single- or multi-ply, coated or uncoated. It is made from virgin and/or recovered fibres, and has good folding properties, stiffness and scoring ability. It is mainly used in cartons for consumer products such as frozen food and for liquid containers. It includes paper and paperboard covered or coated with plastics (excluding adhesives) and coated multi-ply.
broader: Packaging materials
narrower: Cartonboard, kraftpaper paper and paperboard not used for writing weighing more than 150 g/m² but less than 225 g/m²
narrower: Cartonboard, other uncoated paper and paperboard weighing more than 150 g/m² but less than 225 g/m²
narrower: Cartonboard, paper and paperboard coated, impregnated or covered with plastics (excluding adhesives) weighing more than 150 g/m²
narrower: Cartonboard, other kraft paper and paperboard weighing 225 g/m² or more
narrower: Other cartonboard n.e.c.

Core plywood, with both outer plies of coniferous wood, n.e.c. (MDF core, particleboard core, veneer core, etc.)
type: Concept
notation: 071.219
in scheme: Forest Products Classification and Definitions (FPC&D) v2022
definition: Plywood in which the wooden core is replaced by other materials such as a layer or layers of particle board, fibreboard, wood waste glued together, etc.
broader: Core plywood, with both outer plies of coniferous wood

Other articles of paper and paperboard ready for use, rolls, sheets and dials, printed for self-recording apparatus
type: Concept
notation: 146.92
in scheme: Forest Products Classification and Definitions (FPC&D) v2022
definition: It includes rolls, sheets and printed dials, other than rectangular form, for self-recording apparatus.
broader: Other articles of paper and paperboard ready for use

Other bleached refiner mechanical pulp
type: Concept
notation: 081.329
in scheme: Forest Products Classification and Definitions (FPC&D) v2022
definition: N.A.
broader: Refiner mechanical pulp, bleached

Other roughly trimmed wood, chipwood
type: Concept
notation: 024.95
in scheme: Forest Products Classification and Definitions (FPC&D) v2022
definition: This product encompasses flexible, narrow, thin and even strips of wood suitable for plaiting or for making sieves, chip-boxes, match-boxes, etc. It is produced by slicing, peeling or it is sawned.
broader: Other roughly trimmed wood

Torrefied wood, coniferous, for energy
type: Concept
notation: 022.11
in scheme: Forest Products Classification and Definitions (FPC&D) v2022
definition: N.A.
broader: Torrefied wood, coniferous

Particle board of ligno-cellulosic material other than wood (flax, bagasse, bamboo)
type: Concept
notation: 072.9
in scheme: Forest Products Classification and Definitions (FPC&D) v2022
definition: Particle board of bagasse, flax, hemp, straw or other non-wood ligno­cellulosic materials.
broader: Particle board

Household and sanitary paper ready for use
type: Concept
notation: 144.
in scheme: Forest Products Classification and Definitions (FPC&D) v2022
definition: Products ready for use: toilet paper and similar paper, cellulose wadding or webs of cellulose fibres, of a kind used for household or sanitary purposes, in rolls of a width not exceeding 36 cm, or cut to size or shape. It includes handkerchiefs, cleansing tissues, towels, tablecloths, serviettes, napkins for babies, tampons, bed sheets and similar household, sanitary or hospital articles, articles of apparel and clothing accessories, of paper pulp, paper, cellulose wadding or webs of cellulose fibres. It excludes the parent reel stock used to produce these products as well as napkins for babies and tampons.
broader: SECONDARY PAPER PRODUCTS
narrower: Toilet paper
narrower: Handkerchiefs, cleansing or facial tissues and towels
narrower: Tablecloths and serviettes
narrower: Sanitary towels and tampons, napkins and napkin liners
narrower: Articles of apparel and clothing accessories
narrower: Other household and sanitary paper ready for use

Non-decorative veneer sheets, coniferous, for plywood (face and core material)
type: Concept
notation: 062.11
in scheme: Forest Products Classification and Definitions (FPC&D) v2022
definition: Non-decorative veneer sheets used for the manufacture of plywood. They may either be used in the core or for the face of those plywoods for which a face of decorative veneer sheets is not considered necessary. Woods used for the manufacture of plywood are generally cut by the peeling process.
broader: Non-decorative veneer sheets, coniferous

Other plywood n.e.c., with both outer plies of coniferous wood
type: Concept
notation: 071.91
in scheme: Forest Products Classification and Definitions (FPC&D) v2022
definition: N.A.
broader: Other plywood n.e.c.

Tops, small branches and twigs, coniferous, for fibreboard
type: Concept
notation: 012.2113
in scheme: Forest Products Classification and Definitions (FPC&D) v2022
definition: N.A.
broader: Tops, small branches and twigs, coniferous

Other articles of paper and paperboard ready for use, printing and writing papers ready for use
type: Concept
notation: 146.95
in scheme: Forest Products Classification and Definitions (FPC&D) v2022
definition: Paper and paperboard, of a kind used for writing, printing or other graphic purposes and cut to shape other than rectangular.
broader: Other articles of paper and paperboard ready for use

Other sawdust, for fibreboard
type: Concept
notation: 031.293
in scheme: Forest Products Classification and Definitions (FPC&D) v2022
definition: N.A.
broader: Other sawdust

Folding cartons, boxes and cases, of non-corrugated paper or paperboard
type: Concept
notation: 145.2
in scheme: Forest Products Classification and Definitions (FPC&D) v2022
definition: It includes folding cartons, boxes and cases made from non-corrugated paper or paperboard, generally used for the packing, transport, storage or sale of merchandise.
broader: Packaging cartons, boxes, etc.

Dry process fibreboard of a density exceeding 0.5 g/cm³ but not exceeding 0.8 g/cm³ , of a thickness exceeding 5 mm but not exceeding 9 mm
type: Concept
notation: 074.122
in scheme: Forest Products Classification and Definitions (FPC&D) v2022
definition: N.A.
broader: Dry process fibreboard of a density exceeding 0.5 g/cm³ but not exceeding 0.8 g/cm³

Semi-chemical pulp, bleached
type: Concept
notation: 082.12
in scheme: Forest Products Classification and Definitions (FPC&D) v2022
definition: Pulp treated with chemicals to increase its brightness.
broader: Semi-chemical pulp
narrower: Semi-chemical pulp, bleached, coniferous
narrower: Other bleached semi-chemical pulp

Other papers mainly for packaging
type: Concept
notation: 113.9
in scheme: Forest Products Classification and Definitions (FPC&D) v2022
definition: This category embraces all papers and boards mainly for packaging purposes other than those listed above. Most are produced from recovered fibres, e.g. greyboards, and go for conversion, which in some cases may be for end-uses other than packaging.
broader: Packaging materials
narrower: Other uncoated paper and paperboard weighing 225 g/m² or more
narrower: Other papers mainly for packaging n.e.c.

Roughly trimmed wood, coniferous, wooden sticks roughly trimmed
type: Concept
notation: 024.14
in scheme: Forest Products Classification and Definitions (FPC&D) v2022
definition: Products of different length and thickness which serve as a raw material for the next manufacture of walking sticks, whips, umbrellas, handles for tools, etc
broader: Roughly trimmed wood, coniferous

Case materials, kraftliner
type: Concept
notation: 113.11
in scheme: Forest Products Classification and Definitions (FPC&D) v2022
definition: Paper or paperboard in rolls whose fibre content has no less than 80% fibers obtained by the chemical sulfate or soda processes and weighing more than 115 g/m2.
broader: Case materials
narrower: Case materials, kraftliner, unbleached
narrower: Case materials, kraftliner, bleached

Non-decorative veneer sheets, tropical non-coniferous
type: Concept
notation: 062.2
in scheme: Forest Products Classification and Definitions (FPC&D) v2022
definition: N.A.
broader: Non-decorative veneer sheets
narrower: Non-decorative veneer sheets, tropical non-coniferous, for plywood (face and core material)
narrower: Non-decorative veneer sheets, tropical non-coniferous, for other purposes (match boxes, violin, … )

Tops, small branches and twigs
type: Concept
notation: 012.21
in scheme: Forest Products Classification and Definitions (FPC&D) v2022
definition: Includes tops, small branches and twigs from felled trees. The lower limit of the top (the upper limit of the stem) will vary according to local logging practices
broader: Wood in the rough other than from the main stem and branches
narrower: Tops, small branches and twigs, coniferous
narrower: Tops, small branches and twigs, tropical non-coniferous
narrower: Other tops, small branches and twigs

Sawdust, coniferous
type: Concept
notation: 031.21
in scheme: Forest Products Classification and Definitions (FPC&D) v2022
definition: Wood dust produced in the process of sawing.
broader: Sawdust
narrower: Sawdust, coniferous, for pulp
narrower: Sawdust, coniferous, for particle board
narrower: Sawdust, coniferous, for fibreboard
narrower: Sawdust, coniferous, for energy
narrower: Sawdust, coniferous, for uses n.e.c.

Pulpwood and wood for wood-based panels, tropical non-coniferous, for fibreboard
type: Concept
notation: 012.1223
in scheme: Forest Products Classification and Definitions (FPC&D) v2022
definition: N.A.
broader: Pulpwood and wood for wood-based panels, tropical non-coniferous

Other sulphate dissolving wood pulp
type: Concept
notation: 084.19
in scheme: Forest Products Classification and Definitions (FPC&D) v2022
definition: N.A.
broader: Sulphate dissolving wood pulp

Wooden parts of seats
type: Concept
notation: 136.4
in scheme: Forest Products Classification and Definitions (FPC&D) v2022
definition: It includes identifiable parts of chairs or other seats, such as backs, bottoms and arm rests made from wood.
broader: Wooden furniture

Other further processed sawnwood, rounded wood
type: Concept
notation: 131.95
in scheme: Forest Products Classification and Definitions (FPC&D) v2022
definition: It covers drawn woods, which are used in the manufacture of certain types of match splints, pegs for footwear, certain types of wooden sun blinds, toothpicks, cheese making screens, etc.
broader: Other further processed sawnwood

Other further processed sawnwood, moulded wood
type: Concept
notation: 131.94
in scheme: Forest Products Classification and Definitions (FPC&D) v2022
definition: It covers strips of wood shaped to various contours, which are used for the manufacture of picture frames, decoration of walls, furniture, etc.
broader: Other further processed sawnwood

Other wood fuel from main stem and branches, for pellets
type: Concept
notation: 011.191
in scheme: Forest Products Classification and Definitions (FPC&D) v2022
definition: N.A.
broader: Other wood fuel from the main stem and branches

Uncontaminated recoverable wood products, coniferous, for uses n.e.c.
type: Concept
notation: 033.119
in scheme: Forest Products Classification and Definitions (FPC&D) v2022
definition: N.A.
broader: Uncontaminated recoverable wood products, coniferous

Several particle boards and several fibreboards assembled in any order
type: Concept
notation: 076.3
in scheme: Forest Products Classification and Definitions (FPC&D) v2022
definition: Laminated panels consisting of several particle boards and several fibreboards assembled in any order.
broader: Combination board

Bark separated in the forest from wood in the rough, coniferous, for other uses n.e.c.
type: Concept
notation: 012.2319
in scheme: Forest Products Classification and Definitions (FPC&D) v2022
definition: N.A.
broader: Bark separated in the forest from wood in the rough, coniferous

Wooden frames for paintings, photographs, mirrors or similar objects, tropical non-coniferous
type: Concept
notation: 133.11
in scheme: Forest Products Classification and Definitions (FPC&D) v2022
definition: It includes wooden frames of all shapes and dimensions. The frames of the heading may also be of wood marquetry or inlaid wood.
broader: Wooden frames for paintings, photographs, mirrors or similar objects

Coniferous, sleepers, n.e.c.
type: Concept
notation: 051.19
in scheme: Forest Products Classification and Definitions (FPC&D) v2022
definition: Sleepers which are not treated with insecticides or fungicides nor impregnated.
broader: Coniferous, sleepers

Bark separated in the forest from wood in the rough, tropical non-coniferous
type: Concept
notation: 012.232
in scheme: Forest Products Classification and Definitions (FPC&D) v2022
definition: Includes all bark removed from the sterns or other parts of the tree during harvesting operations, as well as bark removed at the lower landing. It can be used for horticulture purposes or for other uses.
broader: Bark separated in the forest from wood in the rough
narrower: Bark separated in the forest from wood in the rough, tropical non-coniferous, for horticulture purposes
narrower: Bark separated in the forest from wood in the rough, tropical non-coniferous, for uses n.e.c.

Other seats with wooden frames
type: Concept
notation: 136.3
in scheme: Forest Products Classification and Definitions (FPC&D) v2022
definition: It includes seats with wooden frames which can be upholstered.
broader: Wooden furniture

Laminated veneered lumber, with both outer plies of coniferous wood
type: Concept
notation: 071.41
in scheme: Forest Products Classification and Definitions (FPC&D) v2022
definition: Laminated veneer lumber is the wood product that uses multiple layers of thin wood assembled with adhesives. Laminated veneer lumber is similar in appearance to plywood without crossbands.
broader: Laminated veneered lumber (LVL)

Paper and paperboard stationery, binders (other than book covers), folders and file covers
type: Concept
notation: 146.36
in scheme: Forest Products Classification and Definitions (FPC&D) v2022
definition: It includes binders designed for holding loose sheets, magazines, folders, file covers and files (other than box files) and portfolios.
broader: Paper and paperboard stationery

Wood chips and particles from wood in the rough, coniferous, for fibreboard
type: Concept
notation: 032.113
in scheme: Forest Products Classification and Definitions (FPC&D) v2022
definition: N.A.
broader: Wood chips and particles from wood in the rough, coniferous

Other paper and paperboard, felt paper and paperboard
type: Concept
notation: 114.3
in scheme: Forest Products Classification and Definitions (FPC&D) v2022
definition: Felt paper and paperboard are products made from a fibrous mass of varying degrees of absorbency. Waste and scrap of paper or paperboard and wood pulp or textile waste in the form of fibres are used in their manufacture. They are mainly used in the manufacture of paperboard for roofing.
broader: Other paper and paperboard

Mineral bonded panels, other than cement bonded, gypsum fibreboard
type: Concept
notation: 077.21
in scheme: Forest Products Classification and Definitions (FPC&D) v2022
definition: Panels manufactured from gypsum and cellulose or recycled paper fibres. These two natural raw materials are mixed with water, without any other binders being added. The mixture is then pressed into stable boards under high pressure, dried, coated with a water repellent.
broader: Mineral bonded panels, other than cement bonded

Further processed sawnwood, tropical non-coniferous, V-jointed wood
type: Concept
notation: 131.22
in scheme: Forest Products Classification and Definitions (FPC&D) v2022
definition: It covers i.e., wood tongued and grooved with chamfered edges or ends.
broader: Further processed sawnwood, tropical non-coniferous

Paper and paperboard labels
type: Concept
notation: 146.4
in scheme: Forest Products Classification and Definitions (FPC&D) v2022
definition: It includes all varieties of paper and paperboard labels of a kind used for attachment to any type of article for the purpose of indicating its nature, identity, ownership, destination, price, etc.
broader: Other articles of paper and paperboard ready for use
narrower: Printed paper and paperboard labels
narrower: Other paper and paperboard labels

Other torrefied wood
type: Concept
notation: 022.9
in scheme: Forest Products Classification and Definitions (FPC&D) v2022
definition: It includes wood chips and wood pellets that were torrefied. In the torrefaction process, biomass is heated to a temperature of approx. 250-350°C in an atmosphere with low oxygen concentrations, so that all moisture is removed as well as a fraction of the volatile matter of the dry biomass. Due to the substantial weight loss and a relatively smaller loss of calorific content, the heating value of processed biomass per mass unit increases significantly in the process.
broader: Torrefied wood
narrower: Other torrefied wood, for energy
narrower: Other torrefied wood, for uses n.e.c.

Waste of natural or agglomerated cork
type: Concept
notation: 121.4
in scheme: Forest Products Classification and Definitions (FPC&D) v2022
definition: It includes i.e. shavings, waste pieces and scrap used generally for the production of crushed, granulated or powdered cork. It includes also waste turnings, of cork in the form of “cork wool”.
broader: Natural cork

Coniferous, sawnwood planed
type: Concept
notation: 051.3
in scheme: Forest Products Classification and Definitions (FPC&D) v2022
definition: Wood sawn or chipped lengthwise, and planed, sanded or finger-jointed.
broader: Coniferous, sawnwood and sleepers
narrower: Coniferous, sawnwood planed, treated or impregnated
narrower: Coniferous, sawnwood planed, n.e.c.

Paper for offset plates and offset plates
type: Concept
notation: 143.5
in scheme: Forest Products Classification and Definitions (FPC&D) v2022
definition: Paper for offset plates has a special coating on one side rendering it impervious to lithographic ink. The plates are usually used on office-type offset machines.
broader: Carbon paper and copying paper ready for use

Cement bonded panels, cement bonded particle board
type: Concept
notation: 077.11
in scheme: Forest Products Classification and Definitions (FPC&D) v2022
definition: The panel is a mixture of wood particles and Portland cement together with some additives. The mat is formed in three layers, the outer layers comprising small chips. Unlike normal particleboard production in a multi-daylight press, the set of cauls in cement bonded particle boards production must be kept under pressure until the cement has set.
broader: Cement bonded panels

Handkerchiefs, cleansing or facial tissues and towels
type: Concept
notation: 144.2
in scheme: Forest Products Classification and Definitions (FPC&D) v2022
definition: Handkerchiefs, cleansing or facial tissues and towels in strips or rolls of a width not exceeding 36 cm.
broader: Household and sanitary paper ready for use

Roughly trimmed wood, coniferous, hoopwood
type: Concept
notation: 024.11
in scheme: Forest Products Classification and Definitions (FPC&D) v2022
definition: Hoopwood cover split rods of willow, hazel, birch, etc., which are used in the manufacture of barrel hoops, hurdles, etc.
broader: Roughly trimmed wood, coniferous

Other sacks and bags, including cones
type: Concept
notation: 145.4
in scheme: Forest Products Classification and Definitions (FPC&D) v2022
definition: It includes sacks and bags, including cones, used for the packing, transport, storage or sale of merchandise.
broader: Packaging cartons, boxes, etc.

Thermo-mechanical pulp, bleached
type: Concept
notation: 081.42
in scheme: Forest Products Classification and Definitions (FPC&D) v2022
definition: Pulp treated with chemicals to increase its brightness.
broader: Thermo-mechanical pulp
narrower: Thermo-mechanical pulp, bleached, coniferous
narrower: Other bleached thermo-mechanical pulp

Case materials, fluting paper
type: Concept
notation: 113.12
in scheme: Forest Products Classification and Definitions (FPC&D) v2022
definition: Paper or paperboard used mainly as a corrugating medium in the production of corrugated board. It may be produced wholly or principally from semi-chemical wood pulp or from other materials.
broader: Case materials
narrower: Case materials, fluting paper, semi-chemical
narrower: Case materials, fluting paper, straw fluting paper
narrower: Other fluting papers

Articles of natural cork
type: Concept
notation: 121.3
in scheme: Forest Products Classification and Definitions (FPC&D) v2022
definition: It includes corks and stoppers of all kinds made from natural cork; discs, washers and wafers of natural cork, for lining crown corks and other closures for bottles, jars, etc.
broader: Natural cork
narrower: Articles of natural cork, corks and stoppers
narrower: Other articles of natural cork

Other bark separated in the forest from wood in the rough, for horticulture purposes
type: Concept
notation: 012.2391
in scheme: Forest Products Classification and Definitions (FPC&D) v2022
definition: N.A.
broader: Other bark separated in the forest from wood in the rough

Wood pellets
type: Concept
notation: 041.
in scheme: Forest Products Classification and Definitions (FPC&D) v2022
definition: Agglomerates produced either directly by compression or by the addition of a binder in a proportion not exceeding 3% by weight. Such pellets are cylindrical, with a diameter not exceeding 25 mm and a length not exceeding 100 mm.
broader: WOOD PELLETS AND OTHER AGGLOMERATES
narrower: Wood pellets, coniferous
narrower: Other wood pellets

Cable drums
type: Concept
notation: 132.2
in scheme: Forest Products Classification and Definitions (FPC&D) v2022
definition: Cable drums are large drums, used to hold and transport electric cables, telephone cables and similar cables.
broader: Wooden wrapping and packaging material

Shavings, coniferous, for fibreboard
type: Concept
notation: 031.313
in scheme: Forest Products Classification and Definitions (FPC&D) v2022
definition: N.A.
broader: Shavings, coniferous

WOOD IN THE ROUGH OTHER THAN WOOD FUEL
type: Concept
notation: 012.
in scheme: Forest Products Classification and Definitions (FPC&D) v2022
definition: Wood in the rough that will be used in the production of other goods and services (except as a source of fuel).
broader: WOOD IN THE ROUGH (ROUNDWOOD)
narrower: Wood in the rough from the main stem and branches
narrower: Wood in the rough other than from the main stem and branches

Soda or sulphate chemical wood pulp
type: Concept
notation: 083.1
in scheme: Forest Products Classification and Definitions (FPC&D) v2022
definition: Wood pulp obtained by mechanically reducing pulpwood, wood chips, particles or residues to small pieces that are subsequently cooked in a pressure vessel in the presence of sodium hydroxide cooking liquor (soda pulp) or a mixture of sodium hydroxide and sodium sulphite cooking liquor (sulphate pulp). It is used in the manufacture of absorbent products as well as for papers and paperboards requiring high tearing resistance and tensile and bursting strength.
broader: Chemical wood pulp
narrower: Soda or sulphate chemical wood pulp, unbleached
narrower: Soda or sulphate chemical wood pulp, bleached or semi-bleached

Caskets and cases for jewellery or cutlery
type: Concept
notation: 133.4
in scheme: Forest Products Classification and Definitions (FPC&D) v2022
definition: It includes a wide variety of articles of generally of careful manufacture and good finish, such as small articles of cabinetwork (for example, caskets and jewel cases); small furnishing goods; decorative articles, etc.
broader: Wood products for domestic/decorative use

Wooden furniture, used in offices
type: Concept
notation: 136.51
in scheme: Forest Products Classification and Definitions (FPC&D) v2022
definition: It includes wooden furniture of a kind used in offices, in the kitchen, in the bedroom and other wooden furniture.
broader: Wooden furniture

Other pulpwood and wood for wood-based panels, for wood wool
type: Concept
notation: 012.1294
in scheme: Forest Products Classification and Definitions (FPC&D) v2022
definition: N.A.
broader: Other pulpwood and wood for wood-based panels

Other bark removed during processing, for horticulture purposes
type: Concept
notation: 031.491
in scheme: Forest Products Classification and Definitions (FPC&D) v2022
definition: N.A.
broader: Other bark removed during processing

Other special coated paper, paperboard, cellulose wadding and webs of cellulose fibres
type: Concept
notation: 142.9
in scheme: Forest Products Classification and Definitions (FPC&D) v2022
definition: Other paper, paperboard, cellulose wadding and webs of cellulose fibre not mentioned in the groups 142.1, 142.2 and 142.3.
broader: Special coated paper and pulp products

Bark separated in the forest from wood in the rough, tropical non-coniferous, for horticulture purposes
type: Concept
notation: 012.2321
in scheme: Forest Products Classification and Definitions (FPC&D) v2022
definition: N.A.
broader: Bark separated in the forest from wood in the rough, tropical non-coniferous

Other wood charcoal, for uses n.e.c.
type: Concept
notation: 021.99
in scheme: Forest Products Classification and Definitions (FPC&D) v2022
definition: N.A.
broader: Other wood charcoal

Bark separated in the forest from wood in the rough, coniferous
type: Concept
notation: 012.231
in scheme: Forest Products Classification and Definitions (FPC&D) v2022
definition: Includes all bark removed from the sterns or other parts of the tree during harvesting operations, as well as bark removed at the lower landing. It can be used for horticulture purposes or for other uses.
broader: Bark separated in the forest from wood in the rough
narrower: Bark separated in the forest from wood in the rough, coniferous, for horticulture purposes
narrower: Bark separated in the forest from wood in the rough, coniferous, for other uses n.e.c.

Soda or sulphate chemical wood pulp, unbleached
type: Concept
notation: 083.11
in scheme: Forest Products Classification and Definitions (FPC&D) v2022
definition: Pulp not treated with chemicals to increase its brightness.
broader: Soda or sulphate chemical wood pulp
narrower: Soda or sulphate chemical wood pulp, unbleached, coniferous
narrower: Other unbleached soda or sulphate chemical wood pulp

Tropical non-coniferous, sleepers, treated or impregnated
type: Concept
notation: 052.11
in scheme: Forest Products Classification and Definitions (FPC&D) v2022
definition: Sleepers may be surface treated with insecticides, fungicides or impregnated with creosote or other substances for long-term preservation.
broader: Tropical non-coniferous, sleepers

Veneer plywood
type: Concept
notation: 071.1
in scheme: Forest Products Classification and Definitions (FPC&D) v2022
definition: Plywood manufactured by bonding together more than two veneer sheets, where the grain of alternate veneer sheets is crossed, generally at right angles.
broader: Plywood
narrower: Veneer plywood, coniferous
narrower: Veneer plywood, tropical non-coniferous
narrower: Other veneer plywood

Sacks and bags, having a base of a width of 40 cm or more
type: Concept
notation: 145.3
in scheme: Forest Products Classification and Definitions (FPC&D) v2022
definition: It includes sacks and bags, having a base of a width of 40 cm or more, used for the packing, transport, storage or sale of merchandise.
broader: Packaging cartons, boxes, etc.

Mineral bonded panels, other than cement bonded, gypsum particle board
type: Concept
notation: 077.22
in scheme: Forest Products Classification and Definitions (FPC&D) v2022
definition: Panels manufactured from gypsum and particles of wood, bagasse, straw or other ligno-cellulosic materials.
broader: Mineral bonded panels, other than cement bonded

Stone groundwood
type: Concept
notation: 081.1
in scheme: Forest Products Classification and Definitions (FPC&D) v2022
definition: It is produced from roundwood or blocks in stone grinders at atmospheric pressure.
broader: Mechanical wood pulp
narrower: Stone groundwood, unbleached
narrower: Stone groundwood, bleached

Box files, letter trays, storage boxes and similar articles
type: Concept
notation: 145.6
in scheme: Forest Products Classification and Definitions (FPC&D) v2022
definition: It includes container, such as filing cabinets, box files, letter trays, storage boxes and similar articles. They are used for the filing or storage of documents or stock of various kinds in offices, shops, warehouses, etc.
broader: Packaging cartons, boxes, etc.

Shavings, coniferous
type: Concept
notation: 031.31
in scheme: Forest Products Classification and Definitions (FPC&D) v2022
definition: Long, thin pieces of wood, produced in planing operations.
broader: Shavings
narrower: Shavings, coniferous, for pulp
narrower: Shavings, coniferous, for particle board
narrower: Shavings, coniferous, for fibreboard
narrower: Shavings, coniferous, for energy
narrower: Shavings, coniferous, for uses n.e.c.

Other shavings, for energy
type: Concept
notation: 031.394
in scheme: Forest Products Classification and Definitions (FPC&D) v2022
definition: N.A.
broader: Other shavings

Composite paper and paperboard
type: Concept
notation: 141.
in scheme: Forest Products Classification and Definitions (FPC&D) v2022
definition: It includes paper and paperboard made by sticking two or more layers of paper or paperboard together with the aid of an adhesive.
broader: SECONDARY PAPER PRODUCTS

Cartonboard, kraftpaper paper and paperboard not used for writing weighing more than 150 g/m² but less than 225 g/m²
type: Concept
notation: 113.21
in scheme: Forest Products Classification and Definitions (FPC&D) v2022
definition: Kraftpaper paper or paperboard (cardboard) are produced from chemical pulp produced in the kraft process, which means that not less than 80 % by weight of the total fibre content consists of fibres obtained by the chemical sulphate or soda processes.
broader: Cartonboard

Stumps and roots, tropical non-coniferous, for pellets
type: Concept
notation: 011.9221
in scheme: Forest Products Classification and Definitions (FPC&D) v2022
definition: N.A.
broader: Stumps and roots, tropical non-coniferous

Windows, French-windows and their frames
type: Concept
notation: 135.1
in scheme: Forest Products Classification and Definitions (FPC&D) v2022
definition: It includes windows, French-windows and their frames used in the construction.
broader: Builder's joinery and carpentry of wood
narrower: Windows, French-windows and their frames, tropical non-coniferous
narrower: Windows, French-windows and their frames, other

Sawlogs and veneer logs, tropical non-coniferous, for veneer sheets
type: Concept
notation: 012.1122
in scheme: Forest Products Classification and Definitions (FPC&D) v2022
definition: N.A.
broader: Sawlogs and veneer logs, tropical non-coniferous

Coniferous, other
type: Concept
notation: 051.9
in scheme: Forest Products Classification and Definitions (FPC&D) v2022
definition: N.A.
broader: Coniferous, sawnwood and sleepers

Solid wood processing residues, coniferous, for fibreboard
type: Concept
notation: 031.113
in scheme: Forest Products Classification and Definitions (FPC&D) v2022
definition: N.A.
broader: Solid wood processing residues, coniferous

Packaging materials
type: Concept
notation: 113.
in scheme: Forest Products Classification and Definitions (FPC&D) v2022
definition: Paper or paperboard mainly used for wrapping and packaging purposes. Products in this category are generally manufactured in strips or rolls of a width exceeding 36 cm. It excludes unbleached kraft paper and paperboard that are not sack kraft paper or Kraftliner and weighing more than 150 g/m² but less than 225 g/m²; felt paper and paperboard; tracing papers; not further processed uncoated paper weighing 225 g/m² or more.
broader: PAPER AND PAPERBOARD
narrower: Case materials
narrower: Cartonboard
narrower: Wrapping papers
narrower: Other papers mainly for packaging

Pulpwood and wood for wood-based panels, coniferous
type: Concept
notation: 012.121
in scheme: Forest Products Classification and Definitions (FPC&D) v2022
definition: Roundwood that will be used for the production of pulp, particleboard, oriented strand board (OSB) or fibreboard. It includes: roundwood (with or without bark) that will be used for these purposes in its round form or as splitwood or wood chips made directly (i.e. in the forest) from roundwood
broader: Pulpwood, round and split and wood for wood-based panels
narrower: Pulpwood and wood for wood-based panels, coniferous, for pulp
narrower: Pulpwood and wood for wood-based panels, coniferous, for particle board
narrower: Pulpwood and wood for wood-based panels, coniferous, for fibreboard
narrower: Pulpwood and wood for wood-based panels, coniferous, for wood wool
narrower: Pulpwood and wood for wood-based panels, coniferous, for uses n.e.c.

Sawlogs and veneer logs, coniferous
type: Concept
notation: 012.111
in scheme: Forest Products Classification and Definitions (FPC&D) v2022
definition: Roundwood that will be sawn (or chipped) lengthways for the manufacture of sawnwood or railway sleepers (ties) or used for the production of veneer (mainly by peeling or slicing). It includes: roundwood (whether or not it is roughly squared) that will be used for these purposes; shingle bolts and stave bolts; match billets and other special types of roundwood (e.g. burls and roots, etc.) used for veneer production.
broader: Sawlogs and veneer logs
narrower: Sawlogs and veneer logs, coniferous, for sawnwood and railway sleepers
narrower: Sawlogs and veneer logs, coniferous, for veneer sheets
narrower: Sawlogs and veneer logs, coniferous, for uses n.e.c.

Refiner mechanical pulp, bleached, coniferous
type: Concept
notation: 081.321
in scheme: Forest Products Classification and Definitions (FPC&D) v2022
definition: N.A.
broader: Refiner mechanical pulp, bleached

Wood charcoal, coniferous, for uses n.e.c.
type: Concept
notation: 021.19
in scheme: Forest Products Classification and Definitions (FPC&D) v2022
definition: N.A.
broader: Wood charcoal, coniferous

Mechanical wood pulp
type: Concept
notation: 081.
in scheme: Forest Products Classification and Definitions (FPC&D) v2022
definition: Wood pulp obtained by grinding or milling pulpwood or residues into fibres, or through refining chips or particles. It may be bleached or unbleached. It includes stone groundwood, pressurised stone groundwood, refiner mechanical pulp and thermo-mechanical pulp, It excludes exploded and defibrillated pulp
broader: WOOD PULP
narrower: Stone groundwood
narrower: Pressurised stone groundwood
narrower: Refiner mechanical pulp
narrower: Thermo-mechanical pulp

Non-decorative veneer sheets, tropical non-coniferous, for other purposes (match boxes, violin, … )
type: Concept
notation: 062.29
in scheme: Forest Products Classification and Definitions (FPC&D) v2022
definition: Non-decorative veneer sheets not used for the manufacture of plywood. Included in this item are veneer sheets for match boxes, violins, cigar boxes, etc. It excludes chipwood (subgroups 024.15, 024.95) which is used for plaiting or to make chip baskets, pill boxes, etc.
broader: Non-decorative veneer sheets, tropical non-coniferous

Wood chips and particles from wood processing, coniferous, for particle board
type: Concept
notation: 032.212
in scheme: Forest Products Classification and Definitions (FPC&D) v2022
definition: N.A.
broader: Wood chips and particles from wood processing, coniferous

Non-decorative veneer sheets, tropical non-coniferous, for plywood (face and core material)
type: Concept
notation: 062.21
in scheme: Forest Products Classification and Definitions (FPC&D) v2022
definition: Non-decorative veneer sheets used for the manufacture of plywood. They may either be used in the core or for the face of those plywoods for which a face of decorative veneer sheets is not considered necessary. Woods used for the manufacture of plywood are generally cut by the peeling process.
broader: Non-decorative veneer sheets, tropical non-coniferous

Other fluting papers
type: Concept
notation: 113.129
in scheme: Forest Products Classification and Definitions (FPC&D) v2022
definition: Fluting paper made wholly or principally from other than semi-chemical woodpulp.
broader: Case materials, fluting paper

Stumps and roots, coniferous, for pulp
type: Concept
notation: 012.2211
in scheme: Forest Products Classification and Definitions (FPC&D) v2022
definition: N.A.
broader: Stumps and roots, coniferous

WOOD PULP
top concept of: Forest Products Classification and Definitions (FPC&D) v2022
type: Concept
notation: 08
in scheme: Forest Products Classification and Definitions (FPC&D) v2022
definition: Fibrous material prepared from pulpwood, wood chips, particles or residues by mechanical and/or chemical process for further manufacture into paper, paperboard, fibreboard or other cellulose products.
narrower: Mechanical wood pulp
narrower: Semi-chemical wood pulp
narrower: Chemical wood pulp
narrower: Dissolving wood pulp

Other roughly trimmed wood, n.e.c.
type: Concept
notation: 024.99
in scheme: Forest Products Classification and Definitions (FPC&D) v2022
definition: These products also cover e.g. wood shavings, which are used in the manufacture of vinegar or for the clarification of liquids.
broader: Other roughly trimmed wood

Tropical non-coniferous, sawnwood rough, n.e.c.
type: Concept
notation: 052.29
in scheme: Forest Products Classification and Definitions (FPC&D) v2022
definition: Wood sawn or chipped lengthwise, not planed, sanded or finger-jointed and which was not treated for the purpose of protection.
broader: Tropical non-coniferous, sawnwood rough

Wood chips and particles from wood in the rough, coniferous, for uses n.e.c.
type: Concept
notation: 032.119
in scheme: Forest Products Classification and Definitions (FPC&D) v2022
definition: N.A.
broader: Wood chips and particles from wood in the rough, coniferous

Special coated paper, impregnated or covered with wax, paraffin wax, stearin, oil or glycerol
type: Concept
notation: 142.3
in scheme: Forest Products Classification and Definitions (FPC&D) v2022
definition: It includes paper and paperboard, coated, impregnated or covered with wax, paraffin wax, stearin, oil or glycerol. Application of these materials made paper moisture-proof.
broader: Special coated paper and pulp products

FPC&D2022: Level 4
type: ClassificationLevel
depth: 4

Other tops, small branches and twigs, for fibreboard
type: Concept
notation: 012.2193
in scheme: Forest Products Classification and Definitions (FPC&D) v2022
definition: N.A.
broader: Other tops, small branches and twigs

Articles of natural cork, corks and stoppers
type: Concept
notation: 121.31
in scheme: Forest Products Classification and Definitions (FPC&D) v2022
definition: It includes corks and stoppers of all kinds made from natural cork.
broader: Articles of natural cork

Other further processed sawnwood, beaded wood
type: Concept
notation: 131.93
in scheme: Forest Products Classification and Definitions (FPC&D) v2022
definition: It covers wood tongued and grooved with a simple bead between the edge or end and the tongue.
broader: Other further processed sawnwood

General purpose OSB and OSB for interior fitments, used in dry conditions
type: Concept
notation: 073.11
in scheme: Forest Products Classification and Definitions (FPC&D) v2022
definition: OSB used only in dry conditions, mainly for interior fitments (including furniture), grade OSB/1.
broader: General purpose OSB and OSB for interior fitments

Wood fuel simply worked, coniferous, n.e.c.
type: Concept
notation: 027.19
in scheme: Forest Products Classification and Definitions (FPC&D) v2022
definition: Twigs, faggots, rough sticks, tree stumps and roots.
broader: Wood fuel simply worked, coniferous

Paper and paperboard stationery
type: Concept
notation: 146.3
in scheme: Forest Products Classification and Definitions (FPC&D) v2022
definition: It includes paper or paperboard stationery which are used in correspondence and other various articles of stationery like exercise books, registers, account books, etc.
broader: Other articles of paper and paperboard ready for use
narrower: Paper and paperboard stationery, envelopes
narrower: Paper and paperboard stationery, letter cards, plain postcards and correspondence cards
narrower: Paper and paperboard stationery, boxes, pouches, wallets and writing compendium
narrower: Paper and paperboard stationery, registers, account books, note books, order books and similar
narrower: Paper and paperboard stationery, exercise books
narrower: Paper and paperboard stationery, binders (other than book covers), folders and file covers
narrower: Paper and paperboard stationery, manifold business forms and interleaved carbon sets
narrower: Paper and paperboard stationery, albums for samples or for collections
narrower: Other paper and paperboard stationery

Wood briquettes, other
type: Concept
notation: 42.9
in scheme: Forest Products Classification and Definitions (FPC&D) v2022
definition: Agglomerates produced either directly by compression or by the addition of a binder. Briquettes are cylindrical, with a diameter exceeding 25 mm (usually from 75 mm to 90 mm) and a length up to 300 mm.
broader: Wood briquettes

Other sawlogs and veneer logs
type: Concept
notation: 012.119
in scheme: Forest Products Classification and Definitions (FPC&D) v2022
definition: Roundwood that will be sawn (or chipped) lengthways for the manufacture of sawnwood or railway sleepers (ties) or used for the production of veneer (mainly by peeling or slicing). It includes: roundwood (whether or not it is roughly squared) that will be used for these purposes; shingle bolts and stave bolts; match billets and other special types of roundwood (e.g. burls and roots, etc.) used for veneer production.
broader: Sawlogs and veneer logs
narrower: Other sawlogs and veneer logs, for sawnwood and railway sleepers
narrower: Other sawlogs and veneer logs, for veneer sheets
narrower: Other sawlogs and veneer logs, for uses n.e.c.

Other sawdust, for energy
type: Concept
notation: 031.294
in scheme: Forest Products Classification and Definitions (FPC&D) v2022
definition: N.A.
broader: Other sawdust

Other papers mainly for packaging n.e.c.
type: Concept
notation: 113.99
in scheme: Forest Products Classification and Definitions (FPC&D) v2022
definition: Other papers mainly for packaging n.e.c.
broader: Other papers mainly for packaging

Cartons, boxes and cases, of corrugated paper or paperboard
type: Concept
notation: 145.1
in scheme: Forest Products Classification and Definitions (FPC&D) v2022
definition: It includes cartons, boxes and cases made from corrugated paper or paperboard, generally used for the packing, transport, storage or sale of merchandise.
broader: Packaging cartons, boxes, etc.

Other wood chips and particles from wood in the rough, for pulp
type: Concept
notation: 032.191
in scheme: Forest Products Classification and Definitions (FPC&D) v2022
definition: N.A.
broader: Other wood chips and particles from wood in the rough

Wood chips and particles from wood in the rough, coniferous, for energy
type: Concept
notation: 032.114
in scheme: Forest Products Classification and Definitions (FPC&D) v2022
definition: N.A.
broader: Wood chips and particles from wood in the rough, coniferous

Tableware and kitchenware, tropical non-coniferous
type: Concept
notation: 133.21
in scheme: Forest Products Classification and Definitions (FPC&D) v2022
definition: It includes household articles of wood, which are used as tableware or kitchenware like spoons, forks, salad servers; platters and serving dishes; jars, cups and saucers; etc.
broader: Tableware and kitchenware

Other agglomerates n.e.c.
type: Concept
notation: 043.9
in scheme: Forest Products Classification and Definitions (FPC&D) v2022
definition: Agglomerates other than wood pellets and wood briquettes, for example logs.
broader: Other agglomerates
narrower: Other agglomerates n.e.c., for energy
narrower: Other agglomerates n.e.c., for other uses

Wrapping papers, kraft paper and paperboard weighing 150 g/m² or less, bleached
type: Concept
notation: 113.322
in scheme: Forest Products Classification and Definitions (FPC&D) v2022
definition: Kraftpaper paper and paperboard made wholly or principally of bleached sulphate pulp.
broader: Wrapping papers, kraft paper and paperboard weighing 150 g/m² or less

Core plywood, with at least one outer ply of tropical wood, blockboard, laminboard and battenboard
type: Concept
notation: 071.221
in scheme: Forest Products Classification and Definitions (FPC&D) v2022
definition: Plywood with a solid core (i.e. the central layer, generally thicker than the other plies) that consists of narrow boards, blocks or strips of wood placed side by side, which may or may not be glued together.
broader: Core plywood, with at least one outer ply of tropical wood

Uncoated graphic papers
type: Concept
notation: 111.2
in scheme: Forest Products Classification and Definitions (FPC&D) v2022
definition: Paper and paperboard, except newsprint, that may have been subjected to sizing, calendering, super-calendering, glazing, water marking or similar simple finishing processes, but not to coating.
broader: Graphic papers
narrower: Uncoated graphic papers, mechanical
narrower: Uncoated graphic papers, wood free

Other sanitary and household papers
type: Concept
notation: 112.9
in scheme: Forest Products Classification and Definitions (FPC&D) v2022
definition: Other sanitary and household papers n.e.c.
broader: Sanitary and household papers

Further processed sawnwood
type: Concept
notation: 131.
in scheme: Forest Products Classification and Definitions (FPC&D) v2022
definition: Wood sawn or chipped lengthwise (including strips and friezes for parquet flooring, not assembled) and continuously shaped (tongued, grooved, rebated, V-jointed, beaded, moulded, rounded or the like) along any of its edges or faces, whether or not planed, sanded or finger jointed. It excludes bamboo-based products and sawn or chipped wood with further treatment of edges and/or faces other than planing, or sanding.
broader: SECONDARY WOOD PRODUCTS
narrower: Further processed sawnwood, coniferous
narrower: Further processed sawnwood, tropical non-coniferous
narrower: Other further processed sawnwood

Other roundwood treated with preservatives, for uses n.e.c.
type: Concept
notation: 023.99
in scheme: Forest Products Classification and Definitions (FPC&D) v2022
definition: Roundwood treated with preservatives, other than poles, pilings and posts.
broader: Other roundwood treated with preservatives

Stumps and roots, coniferous, for pellets
type: Concept
notation: 011.9211
in scheme: Forest Products Classification and Definitions (FPC&D) v2022
definition: N.A.
broader: Stumps and roots, coniferous

Other agglomerates, coniferous, for energy
type: Concept
notation: 043.11
in scheme: Forest Products Classification and Definitions (FPC&D) v2022
definition: N.A.
broader: Other agglomerates, coniferous

Other residues of wood processing, not of solid wood, coniferous
type: Concept
notation: 031.91
in scheme: Forest Products Classification and Definitions (FPC&D) v2022
definition: This item includes notably sander dust and contaminated process residues.
broader: Other residues of wood processing, not of solid wood
narrower: Other residues of wood processing, not of solid wood, coniferous, for energy
narrower: Other residues of wood processing, not of solid wood, coniferous, for uses n.e.c.

Windows, French-windows and their frames, other
type: Concept
notation: 135.19
in scheme: Forest Products Classification and Definitions (FPC&D) v2022
definition: It includes windows, French-windows and their frames used in the construction.
broader: Windows, French-windows and their frames

Other household and sanitary paper ready for use
type: Concept
notation: 144.9
in scheme: Forest Products Classification and Definitions (FPC&D) v2022
definition: Other household and sanitary paper ready for use, e.g. sanitary or hospital articles, in strips or rolls of a width not exceeding 36 cm.
broader: Household and sanitary paper ready for use

Other tops, small branches and twigs, for uses n.e.c.
type: Concept
notation: 012.2199
in scheme: Forest Products Classification and Definitions (FPC&D) v2022
definition: N.A.
broader: Other tops, small branches and twigs

Uncoated graphic papers, wood free, hand-made paper and paperboard
type: Concept
notation: 111.221
in scheme: Forest Products Classification and Definitions (FPC&D) v2022
definition: Hand-made paper and paperboard can be made from any paper-making material but mainly are used best grade linen or cotton rags. The term “hand-made” means that moulding the pulp fibres into sheet form is performed by hand.
broader: Uncoated graphic papers, wood free

Other unbleached thermo-mechanical pulp
type: Concept
notation: 081.419
in scheme: Forest Products Classification and Definitions (FPC&D) v2022
definition: N.A.
broader: Thermo-mechanical pulp, unbleached

Other tops, small branches and twigs
type: Concept
notation: 011.919
in scheme: Forest Products Classification and Definitions (FPC&D) v2022
definition: N.A.
broader: Tops, small branches and twigs
narrower: Other tops, small branches and twigs, for pellets
narrower: Other tops, small branches and twigs, for uses n.e.c.

Coniferous, sleepers, treated or impregnated
type: Concept
notation: 051.11
in scheme: Forest Products Classification and Definitions (FPC&D) v2022
definition: Sleepers may be surface treated with insecticides, fungicides or impregnated with creosote or other substances for long-term preservation.
broader: Coniferous, sleepers

Other agglomerated cork and articles of agglomerated cork, without a binding substance
type: Concept
notation: 122.29
in scheme: Forest Products Classification and Definitions (FPC&D) v2022
definition: Other uses of agglomerated cork, e.g. building materials, moulded shapes, insulating or protecting hot water or steam piping, for the manufacture of filters, etc.
broader: Agglomerated cork and articles of agglomerated cork, without a binding substance

Paper and paperboard stationery, exercise books
type: Concept
notation: 146.35
in scheme: Forest Products Classification and Definitions (FPC&D) v2022
definition: Exercise books may simply contain sheets of lined paper but may also include printed examples of handwriting for copying in manuscript.
broader: Paper and paperboard stationery

Paper or paperboard made mainly of mechanical pulp (newspapers, journals and similar)
type: Concept
notation: 103.
in scheme: Forest Products Classification and Definitions (FPC&D) v2022
definition: Paper or paperboard made mainly of mechanical pulp (newspapers, journals and similar)
broader: RECOVERED PAPER

Other roughly trimmed wood, hoopwood
type: Concept
notation: 024.91
in scheme: Forest Products Classification and Definitions (FPC&D) v2022
definition: Hoopwood cover split rods of willow, hazel, birch, etc., which are used in the manufacture of barrel hoops, hurdles, etc.
broader: Other roughly trimmed wood

Stumps and roots, coniferous, for uses n.e.c.
type: Concept
notation: 012.2219
in scheme: Forest Products Classification and Definitions (FPC&D) v2022
definition: N.A.
broader: Stumps and roots, coniferous

Uncontaminated recoverable wood products, coniferous, for energy
type: Concept
notation: 033.114
in scheme: Forest Products Classification and Definitions (FPC&D) v2022
definition: N.A.
broader: Uncontaminated recoverable wood products, coniferous

Other tops, small branches and twigs, for uses n.e.c.
type: Concept
notation: 011.9199
in scheme: Forest Products Classification and Definitions (FPC&D) v2022
definition: N.A.
broader: Other tops, small branches and twigs

Case materials, kraftliner, bleached
type: Concept
notation: 113.112
in scheme: Forest Products Classification and Definitions (FPC&D) v2022
definition: Kraftliner made wholly or principally of bleached sulphate pulp.
broader: Case materials, kraftliner

Wood briquettes, coniferous
type: Concept
notation: 042.1
in scheme: Forest Products Classification and Definitions (FPC&D) v2022
definition: Agglomerates produced either directly by compression or by the addition of a binder. Briquettes are cylindrical, with a diameter exceeding 25 mm (usually from 75 mm to 90 mm) and a length up to 300 mm.
broader: Wood briquettes

Wood chips and particles from wood in the rough, coniferous, for particle board
type: Concept
notation: 032.112
in scheme: Forest Products Classification and Definitions (FPC&D) v2022
definition: N.A.
broader: Wood chips and particles from wood in the rough, coniferous

Crushed, granulated or ground cork
type: Concept
notation: 121.5
in scheme: Forest Products Classification and Definitions (FPC&D) v2022
definition: Crushed, granulated or ground cork is made from virgin cork or cork waste, and mainly used in the manufacture of agglomerated cork, linoleum or lincrusta.
broader: Natural cork

Stumps and roots, coniferous, for particle board
type: Concept
notation: 012.2212
in scheme: Forest Products Classification and Definitions (FPC&D) v2022
definition: N.A.
broader: Stumps and roots, coniferous

FPC&D2022: Level 6
type: ClassificationLevel
depth: 6

Stumps and roots, tropical non-coniferous, for uses n.e.c.
type: Concept
notation: 012.2229
in scheme: Forest Products Classification and Definitions (FPC&D) v2022
definition: N.A.
broader: Stumps and roots, tropical non-coniferous

Other wood chips and particles from wood in the rough, for particle board
type: Concept
notation: 032.192
in scheme: Forest Products Classification and Definitions (FPC&D) v2022
definition: N.A.
broader: Other wood chips and particles from wood in the rough

VENEER SHEETS
top concept of: Forest Products Classification and Definitions (FPC&D) v2022
type: Concept
notation: 06
in scheme: Forest Products Classification and Definitions (FPC&D) v2022
definition: Thin sheets of wood of uniform thickness not exceeding 6 mm (excluding any reinforcing material), obtained by sawing, slicing or peeling (rotary cutting). Veneer sheets are used for the manufacture of plywood, laminated construction material, veneering furniture, veneer containers, etc.
narrower: Decorative veneer sheets
narrower: Non-decorative veneer sheets

Other bleached semi-chemical pulp
type: Concept
notation: 082.129
in scheme: Forest Products Classification and Definitions (FPC&D) v2022
definition: N.A.
broader: Semi-chemical pulp, bleached

Other wood fuel (tops, small branches and twigs; stumps and roots; bark)
type: Concept
notation: 011.9
in scheme: Forest Products Classification and Definitions (FPC&D) v2022
definition: Roundwood that will be used as fuel for purposes such as cooking, heating or power production. It includes wood harvested from main stems, branches and other parts of trees (where these are harvested for fuel) and wood that will be used for the production of charcoal (e.g. in pit kilns and portable ovens), wood pellets and other agglomerates. It also includes wood chips to be used for fuel that are made directly (i.e. in the forest) from roundwood. It excludes wood charcoal, pellets and other agglomerates.
broader: WOOD FUEL (INCLUDING WOOD FOR CHARCOAL)
narrower: Tops, small branches and twigs
narrower: Stumps and roots
narrower: Bark separated in the forest from wood in the rough

Other wrapping papers n.e.c.
type: Concept
notation: 113.39
in scheme: Forest Products Classification and Definitions (FPC&D) v2022
definition: Other wrapping papers not mentioned in the subgroups 113.31, 113.32, 113.33, 113.34, 113.35, 113.36, 113.37 and 113.38.
broader: Wrapping papers

Pulp from fibres other than wood
type: Concept
notation: 091.
in scheme: Forest Products Classification and Definitions (FPC&D) v2022
definition: Pulp manufactured from fibrous vegetable materials other than wood and used for the manufacture of paper, paperboard, fibreboard and other uses. It excludes pulp made from recovered paper. It includes pulps made from: straw; bamboo; bagasse; esparto; other reeds or grasses; cotton fibres; flax; hemp; rags; and other textile wastes.
broader: OTHER PULP

Refiner mechanical pulp, unbleached
type: Concept
notation: 081.31
in scheme: Forest Products Classification and Definitions (FPC&D) v2022
definition: Pulp not treated with chemicals to increase its brightness.
broader: Refiner mechanical pulp
narrower: Refiner mechanical pulp, unbleached, coniferous
narrower: Other unbleached refiner mechanical pulp

Other non-decorative veneer sheets, for other purposes (match boxes, violin, … )
type: Concept
notation: 062.99
in scheme: Forest Products Classification and Definitions (FPC&D) v2022
definition: Non-decorative veneer sheets not used for the manufacture of plywood. Included in this item are veneer sheets for match boxes, violins, cigar boxes, etc. It excludes chipwood (subgroups 024.15, 024.95) which is used for plaiting or to make chip baskets, pill boxes, etc.
broader: Other non-decorative veneer sheets

Wrapping papers, sack kraft paper, bleached
type: Concept
notation: 113.312
in scheme: Forest Products Classification and Definitions (FPC&D) v2022
definition: N.A.
broader: Wrapping papers, sack kraft paper

Decorative veneer sheets, coniferous, for plywood (faces)
type: Concept
notation: 061.11
in scheme: Forest Products Classification and Definitions (FPC&D) v2022
definition: Decorative veneer sheets for the manufacture of plywood. Because of its specific decorative characteristics this material is usually used on the face of plywood.
broader: Decorative veneer sheets, coniferous

Coniferous, sawnwood planed, n.e.c.
type: Concept
notation: 051.39
in scheme: Forest Products Classification and Definitions (FPC&D) v2022
definition: Wood sawn or chipped lengthwise, and planed, sanded or finger-jointed, which was kiln- or air-dried but not treated for the purpose of protection.
broader: Coniferous, sawnwood planed

Case materials, fluting paper, straw fluting paper
type: Concept
notation: 113.122
in scheme: Forest Products Classification and Definitions (FPC&D) v2022
definition: Paper, in rolls, made mainly of straw pulp obtained by semi-chemical pulping processes and weighing 130 g/m2 or more.
broader: Case materials, fluting paper

Other residues of wood processing, not of solid wood n.e.c.
type: Concept
notation: 031.99
in scheme: Forest Products Classification and Definitions (FPC&D) v2022
definition: This item includes notably sander dust and contaminated process residues.
broader: Other residues of wood processing, not of solid wood
narrower: Other residues of wood processing, not of solid wood n.e.c., for energy
narrower: Other residues of wood processing, not of solid wood n.e.c., for other uses

Pulpwood and wood for wood-based panels, tropical non-coniferous, for particle board
type: Concept
notation: 012.1222
in scheme: Forest Products Classification and Definitions (FPC&D) v2022
definition: N.A.
broader: Pulpwood and wood for wood-based panels, tropical non-coniferous

Other cellular board
type: Concept
notation: 071.39
in scheme: Forest Products Classification and Definitions (FPC&D) v2022
definition: Plywood with a core of cellular construction, which are somewhat similar in appearance to the blockboard and battenboard but the battens or laths forming the core are spaced one from the other, either parallel or in lattice form. Cellular boards are used for partitions, doors and sometimes in the manufacture of furniture.
broader: Cellular board

Wood chips and particles from wood processing, coniferous, for fibreboard
type: Concept
notation: 032.213
in scheme: Forest Products Classification and Definitions (FPC&D) v2022
definition: N.A.
broader: Wood chips and particles from wood processing, coniferous

Window transparencies of paper
type: Concept
notation: 146.2
in scheme: Forest Products Classification and Definitions (FPC&D) v2022
definition: Window transparencies of paper are produced from thin, hard and highly-glazed translucent or transparent paper. They are used either for decorative purposes or simply to reduce the transparency of windows. They can be coated with adhesives and also printed with texts or illustrations.
broader: Other articles of paper and paperboard ready for use

Other special coated gummed or adhesive paper and paperboard
type: Concept
notation: 142.29
in scheme: Forest Products Classification and Definitions (FPC&D) v2022
definition: Other adhesive paper other than self-adhesive paper and other paper coated with a moisture activated adhesive, dextrin, gum Arabic, etc.
broader: Special coated paper, gummed or adhesive paper and paperboard

Carbon or similar copying papers
type: Concept
notation: 143.1
in scheme: Forest Products Classification and Definitions (FPC&D) v2022
definition: It includes papers which has been coated or sometimes impregnated with fatty or waxy substances mixed with carbon black or other colouring material. They are used for pen, pencil, or typewriter copying onto ordinary paper.
broader: Carbon paper and copying paper ready for use

Coated graphic papers
type: Concept
notation: 111.3
in scheme: Forest Products Classification and Definitions (FPC&D) v2022
definition: Paper and paperboard which has been coated on one or both sides by a compound or polymer to impart certain qualities to the paper, including weight, surface gloss, smoothness or reduced ink absorbency.
broader: Graphic papers
narrower: Coated graphic papers, mechanical
narrower: Coated graphic papers, woodfree

Other unbleached stone groundwood
type: Concept
notation: 081.119
in scheme: Forest Products Classification and Definitions (FPC&D) v2022
definition: N.A.
broader: Stone groundwood, unbleached

Stumps and roots, coniferous, for uses n.e.c.
type: Concept
notation: 011.9219
in scheme: Forest Products Classification and Definitions (FPC&D) v2022
definition: N.A.
broader: Stumps and roots, coniferous

Pressurised stone groundwood, bleached
type: Concept
notation: 081.22
in scheme: Forest Products Classification and Definitions (FPC&D) v2022
definition: Pulp treated with chemicals to increase its brightness.
broader: Pressurised stone groundwood
narrower: Pressurised stone groundwood, bleached, coniferous
narrower: Other bleached pressurised stone groundwood

Wrapping papers, sulphite wrapping paper
type: Concept
notation: 113.33
in scheme: Forest Products Classification and Definitions (FPC&D) v2022
definition: Sulphite wrapping paper means machine-glazed paper. It contains more than 40 % by weight fibres obtained by chemical sulphite process.
broader: Wrapping papers

Wood swivel seats with variable height adjustment
type: Concept
notation: 136.1
in scheme: Forest Products Classification and Definitions (FPC&D) v2022
definition: Wood swivel seats with variable height adjustment
broader: Wooden furniture

Other bleached stone groundwood
type: Concept
notation: 081.129
in scheme: Forest Products Classification and Definitions (FPC&D) v2022
definition: N.A.
broader: Stone groundwood, bleached

Other sawlogs and veneer logs, for veneer sheets
type: Concept
notation: 012.1192
in scheme: Forest Products Classification and Definitions (FPC&D) v2022
definition: N.A.
broader: Other sawlogs and veneer logs

Wrapping papers, corrugated paper and paperboard
type: Concept
notation: 113.37
in scheme: Forest Products Classification and Definitions (FPC&D) v2022
definition: Corrugated paper and paperboard results from processing material through grooved rollers with the application of heat and steam. Flat surface sheet can be applied on one or both sides.
broader: Wrapping papers

Wood seats other than garden seats or camping equipment, convertible into beds
type: Concept
notation: 136.2
in scheme: Forest Products Classification and Definitions (FPC&D) v2022
definition: Wood seats other than garden seats or camping equipment, convertible into beds
broader: Wooden furniture

Agglomerated cork and articles of agglomerated cork, without a binding substance, blocks, plates, sheets and strip; tiles of any shape; solid cylinders, including discs
type: Concept
notation: 122.21
in scheme: Forest Products Classification and Definitions (FPC&D) v2022
definition: Agglomerated cork in the form of blocks, plates, sheets and strip; tiles of any shape; solid cylinders, including discs.
broader: Agglomerated cork and articles of agglomerated cork, without a binding substance

Other sawlogs and veneer logs, for sawnwood and railway sleepers
type: Concept
notation: 012.1191
in scheme: Forest Products Classification and Definitions (FPC&D) v2022
definition: N.A.
broader: Other sawlogs and veneer logs

Wood fuel simply worked, coniferous, split (firewood)
type: Concept
notation: 027.11
in scheme: Forest Products Classification and Definitions (FPC&D) v2022
definition: Split logs or billets.
broader: Wood fuel simply worked, coniferous

Other bleached or semi-bleached sulphite chemical wood pulp
type: Concept
notation: 083.229
in scheme: Forest Products Classification and Definitions (FPC&D) v2022
definition: N.A.
broader: Sulphite chemical wood pulp, bleached or semi-bleached

Dissolving wood pulp
type: Concept
notation: 084.
in scheme: Forest Products Classification and Definitions (FPC&D) v2022
definition: Chemical pulp (sulphate, soda or sulphite) made from wood of special quality, with a very high alpha-cellulose content (usually 90 % and over). This type of pulp is always bleached and is specially refined or purified to meet requirements of its intended use. It is used for making regenerated cellulose, cellulose ethers and esters and products of these materials, such as plates, sheets, film, foil and strip, textile fibres and certain papers (filter paper, vegetable parchment, … )
broader: WOOD PULP
narrower: Sulphate dissolving wood pulp
narrower: Sulphite dissolving wood pulp

Particle board
type: Concept
notation: 072.
in scheme: Forest Products Classification and Definitions (FPC&D) v2022
definition: Flat-pressed or moulded panels manufactured from particles of wood or other ligno-cellulosic materials bonded by a suitable, usually organic, binder in the presence of heat and pressure. They may also be manufactured by extruding the materials into a mould under heat and pressure. Extruded particle board may be solid or with hollow cavities. The density of particle boards varies with the density of raw materials used and the binder, pressures and temperatures used in manufacture. It includes special types of particle board as waferboard and oriented particle board. It excludes wood wool board or other boards with mineral binders.
broader: WOOD-BASED PANELS
narrower: Wood particle board
narrower: Particle board of ligno-cellulosic material other than wood (flax, bagasse, bamboo)

Agglomerated cork and articles of agglomerated cork, without a binding substance
type: Concept
notation: 122.2
in scheme: Forest Products Classification and Definitions (FPC&D) v2022
definition: Agglomerated cork is manufactured under heat and pressure without an added binding substance, at a temperature of about 300 oC, where natural gum in the cork acts as a binder.
broader: Agglomerated cork and articles of agglomerated cork
narrower: Agglomerated cork and articles of agglomerated cork, without a binding substance, blocks, plates, sheets and strip; tiles of any shape; solid cylinders, including discs
narrower: Agglomerated cork and articles of agglomerated cork, without a binding substance, corks and stoppers
narrower: Agglomerated cork and articles of agglomerated cork, without a binding substance, gaskets, washers and other seals of agglomerated cork, for civil aircraft
narrower: Other agglomerated cork and articles of agglomerated cork, without a binding substance

Wood fuel from the main stem and branches
type: Concept
notation: 011.1
in scheme: Forest Products Classification and Definitions (FPC&D) v2022
definition: Roundwood that will be used as fuel for purposes such as cooking, heating or power production. It includes wood harvested from main stems, branches and other parts of trees (where these are harvested for fuel) and wood that will be used for the production of charcoal (e.g. in pit kilns and portable ovens), wood pellets and other agglomerates. It also includes wood chips to be used for fuel that are made directly (i.e. in the forest) from roundwood. It excludes wood charcoal, pellets and other agglomerates.
broader: WOOD FUEL (INCLUDING WOOD FOR CHARCOAL)
narrower: Wood fuel from the main stem and branches, coniferous
narrower: Wood fuel from the main stem and branches, tropical non-coniferous
narrower: Other wood fuel from the main stem and branches

Wood marquetry and inlaid wood
type: Concept
notation: 133.3
in scheme: Forest Products Classification and Definitions (FPC&D) v2022
definition: It includes panels of wood marquetry and inlaid wood, including those partly of material other than wood.
broader: Wood products for domestic/decorative use

Other stumps and roots, for particle board
type: Concept
notation: 012.2292
in scheme: Forest Products Classification and Definitions (FPC&D) v2022
definition: N.A.
broader: Other stumps and roots

Pulpwood and wood for wood-based panels, coniferous, for wood wool
type: Concept
notation: 012.1214
in scheme: Forest Products Classification and Definitions (FPC&D) v2022
definition: N.A.
broader: Pulpwood and wood for wood-based panels, coniferous

WOOD FUEL (INCLUDING WOOD FOR CHARCOAL)
type: Concept
notation: 011.
in scheme: Forest Products Classification and Definitions (FPC&D) v2022
definition: Roundwood that will be used as fuel for purposes such as cooking, heating or power production. It includes wood harvested from main stems, branches and other parts of trees (where these are harvested for fuel) and wood that will be used for the production of charcoal (e.g. in pit kilns and portable ovens), wood pellets and other agglomerates. It also includes wood chips to be used for fuel that are made directly (i.e. in the forest) from roundwood. It excludes wood charcoal, pellets and other agglomerates.
broader: WOOD IN THE ROUGH (ROUNDWOOD)
narrower: Wood fuel from the main stem and branches
narrower: Other wood fuel (tops, small branches and twigs; stumps and roots; bark)

Bark separated in the forest from wood in the rough, coniferous
type: Concept
notation: 011.931
in scheme: Forest Products Classification and Definitions (FPC&D) v2022
definition: N.A.
broader: Bark separated in the forest from wood in the rough

Other unbleached semi-chemical pulp
type: Concept
notation: 082.119
in scheme: Forest Products Classification and Definitions (FPC&D) v2022
definition: N.A.
broader: Semi-chemical pulp, unbleached

Shavings, coniferous, for pulp
type: Concept
notation: 031.311
in scheme: Forest Products Classification and Definitions (FPC&D) v2022
definition: N.A.
broader: Shavings, coniferous

Pulps of fibres derived from recovered (waste and scrap) paper or paperboard
type: Concept
notation: 092.1
in scheme: Forest Products Classification and Definitions (FPC&D) v2022
definition: Pulps of fibres derived from recovered (waste and scrap) paper or paperboard used for the manufacture of paper, paperboard and fibreboard.
broader: Recovered fibre pulp
narrower: Pulps of fibres derived from recovered (waste and scrap) paper or paperboard, unbleached
narrower: Pulps of fibres derived from recovered (waste and scrap) paper or paperboard, bleached

Other industrial roundwood, tropical non-coniferous, used for posts
type: Concept
notation: 012.1324
in scheme: Forest Products Classification and Definitions (FPC&D) v2022
definition: N.A.
broader: Other industrial roundwood, tropical non-coniferous

Roundwood treated with preservatives, coniferous, for posts
type: Concept
notation: 023.13
in scheme: Forest Products Classification and Definitions (FPC&D) v2022
definition: Round, hewn, squared or split wood, usually less than 3 m in length, but possibly up to 5 m used for fencing, guard rails and the like.
broader: Roundwood treated with preservatives, coniferous

Other further processed sawnwood, thermowood and torrefied sawnwood
type: Concept
notation: 131.96
in scheme: Forest Products Classification and Definitions (FPC&D) v2022
definition: The manufacturing process of ThermoWood is based on the use of high temperature and steam. No chemicals are used in the treatment. The process improves dimensional stability and biological durability of wood. Another improvement is in the insulation properties of the final material, the process leads to a reduction in thermal conductivity. Due to the high treatment temperatures the resin is removed from the wood. The manufacture of torrefied sawnwood consists of heating the wood at a very high temperature (from 190 to 240°C), in a torrefaction kiln (autoclave) at controlled atmosphere and low in oxygen. The length of the process, as well as the temperature degree sustained during a determined period, depends on the torrefied specie and the desired colour. This technology requires a pre-drying process using conventional kiln driers, to lower the moisture level between 6% and 10%. After that, the torrefaction kiln lowers the moisture level to 0%. Finally, the wood is placed in a conditioning chamber where the temperature is gradually lowered by controlled steam injection. The moisture level of the product is increased between 3% and 6%, in order to give back to the wood its natural flexibility. This conditioning stabilizes the wood and allows better quality manufacturing.
broader: Other further processed sawnwood

Other wood chips and particles from wood processing, for particle board
type: Concept
notation: 032.292
in scheme: Forest Products Classification and Definitions (FPC&D) v2022
definition: N.A.
broader: Other wood chips and particles from wood processing

Other non-decorative veneer sheets, for plywood (face and core material)
type: Concept
notation: 062.91
in scheme: Forest Products Classification and Definitions (FPC&D) v2022
definition: Non-decorative veneer sheets used for the manufacture of plywood. They may either be used in the core or for the face of those plywoods for which a face of decorative veneer sheets is not considered necessary. Woods used for the manufacture of plywood are generally cut by the peeling process.
broader: Other non-decorative veneer sheets

Paper and paperboard stationery, albums for samples or for collections
type: Concept
notation: 146.38
in scheme: Forest Products Classification and Definitions (FPC&D) v2022
definition: It includes albums for samples or for collections of stamps, photographs, etc.
broader: Paper and paperboard stationery

Other wood fuel simply worked, n.e.c.
type: Concept
notation: 027.99
in scheme: Forest Products Classification and Definitions (FPC&D) v2022
definition: Twigs, faggots, rough sticks, tree stumps and roots.
broader: Other wood fuel simply worked

WOOD IN THE ROUGH (ROUNDWOOD)
top concept of: Forest Products Classification and Definitions (FPC&D) v2022
type: Concept
notation: 01
in scheme: Forest Products Classification and Definitions (FPC&D) v2022
definition: All roundwood felled or otherwise harvested and removed. It comprises all wood obtained from removals, i.e. the quantities removed from forests and from trees outside the forest, including wood recovered from natural, felling and logging losses during the period, calendar year or forest year. It includes all wood removed with or without bark, including wood removed in its round form, or split, roughly squared or in other form (e.g. branches, roots, stumps and burls, where these are harvested) and wood that is roughly shaped or pointed. It is an aggregate comprising wood fuel, including wood for charcoal and industrial roundwood (wood in the rough). Coniferous All woods derived from trees classified botanically as Gymnospermae, e.g. Abies spp., Araucaria spp., Cedrus spp., Chamaecyparis spp., Cupressus spp., Larix spp., Picea spp., Pinus spp., Thuja spp., Tsuga spp., etc. These are generally referred to as softwoods. Non-coniferous All woods derived from trees classified botanically as Angiospermae, e.g. Acer spp., Dipterocarpus spp., Entandrophragma spp., Eucalyptus spp., Fagus spp., Populus spp., Quercus spp., Shorea spp., Swietenia spp., Tectona spp., etc. These are generally referred to as broadleaves or hardwoods. Non-coniferous tropical Tropical timber is defined in the International Tropical Timber Agreement (1994) as follows: “Non-coniferous tropical wood for industrial uses, which grows or is produced in the countries situated between the Tropic of Cancer and the Tropic of Capricorn. The term covers logs, sawnwood, veneer sheets and plywood. Plywood which includes in some measure conifers of tropical origin shall also be covered by the definition.” Non-Coniferous other All woods derived from trees classified botanically as Angiospermae, e.g. Acer spp., Eucalyptus spp., Fagus spp., Populus spp., Quercus spp., etc. other than tropical.
narrower: WOOD FUEL (INCLUDING WOOD FOR CHARCOAL)
narrower: WOOD IN THE ROUGH OTHER THAN WOOD FUEL

Printed paper and paperboard labels
type: Concept
notation: 146.41
in scheme: Forest Products Classification and Definitions (FPC&D) v2022
definition: It includes paper and paperboard labels printed to any extent with characters or pictures.
broader: Paper and paperboard labels

Other Statuettes and other ornaments
type: Concept
notation: 133.59
in scheme: Forest Products Classification and Definitions (FPC&D) v2022
definition: It includes statuettes, animals, figures and other ornaments.
broader: Statuettes and other ornaments

Decorative veneer sheets
type: Concept
notation: 061.
in scheme: Forest Products Classification and Definitions (FPC&D) v2022
definition: Veneer sheets whose face veneer has an attractive appearance due to figure, colour, grain, lustre, etc. The sheets for veneering of fine highly grained woods used in cabinet making veneers are more often obtained by sawing or slicing.
broader: VENEER SHEETS
narrower: Decorative veneer sheets, coniferous
narrower: Decorative veneer sheets, tropical non-coniferous
narrower: Other decorative veneer sheets

Other wood free uncoated graphic papers
type: Concept
notation: 111.229
in scheme: Forest Products Classification and Definitions (FPC&D) v2022
definition: Other wood free paper and paperboard.
broader: Uncoated graphic papers, wood free

Other industrial roundwood n.e.c., used for pitprops
type: Concept
notation: 012.1393
in scheme: Forest Products Classification and Definitions (FPC&D) v2022
definition: N.A.
broader: Other industrial roundwood n.e.c.

Wood chips and particles from recovered wood products, coniferous, for uses n.e.c.
type: Concept
notation: 032.319
in scheme: Forest Products Classification and Definitions (FPC&D) v2022
definition: N.A.
broader: Wood chips and particles from recovered wood products, coniferous

Dry process fibreboard of a density exceeding 0.5 g/cm³ but not exceeding 0.8 g/cm³
type: Concept
notation: 074.12
in scheme: Forest Products Classification and Definitions (FPC&D) v2022
definition: It is a medium density fibreboard (MDF) of a density ranges from 0.5 g/cm³ to 0.8 g/cm³. Additional thermosetting resins are added to the dried wood fibres in order to assist the bonding process in the press. It can be used in many different applications such as furniture, interior decoration and in building.
broader: Dry process fibreboard
narrower: Dry process fibreboard of a density exceeding 0.5 g/cm³ but not exceeding 0.8 g/cm³ , of a thickness not exceeding 5 mm
narrower: Dry process fibreboard of a density exceeding 0.5 g/cm³ but not exceeding 0.8 g/cm³ , of a thickness exceeding 5 mm but not exceeding 9 mm
narrower: Dry process fibreboard of a density exceeding 0.5 g/cm³ but not exceeding 0.8 g/cm³ , of a thickness exceeding 9 mm

Other bark separated in the forest from wood in the rough
type: Concept
notation: 011.939
in scheme: Forest Products Classification and Definitions (FPC&D) v2022
definition: N.A.
broader: Bark separated in the forest from wood in the rough

Tops, small branches and twigs, coniferous, for particle board
type: Concept
notation: 012.2112
in scheme: Forest Products Classification and Definitions (FPC&D) v2022
definition: N.A.
broader: Tops, small branches and twigs, coniferous

Uncontaminated recoverable wood products, coniferous, for pulp
type: Concept
notation: 033.111
in scheme: Forest Products Classification and Definitions (FPC&D) v2022
definition: N.A.
broader: Uncontaminated recoverable wood products, coniferous

Broom or brush bodies and handles
type: Concept
notation: 134.2
in scheme: Forest Products Classification and Definitions (FPC&D) v2022
definition: Broom or brush bodies are pieces of wood, shaped to the actual form of broom or brush heads. They may sometimes consist of more than one piece.
broader: Other manufactured wood products

FPC&D2022: Level 5
type: ClassificationLevel
depth: 5

Wood chips and particles from wood in the rough, coniferous, for pulp
type: Concept
notation: 032.111
in scheme: Forest Products Classification and Definitions (FPC&D) v2022
definition: N.A.
broader: Wood chips and particles from wood in the rough, coniferous

Particle board covered on one or both faces with fibreboard
type: Concept
notation: 076.1
in scheme: Forest Products Classification and Definitions (FPC&D) v2022
definition: Laminated panels consisting of particle board covered on one or both faces with fibreboard.
broader: Combination board

Pulpwood and wood for wood-based panels, tropical non-coniferous, for pulp
type: Concept
notation: 012.1221
in scheme: Forest Products Classification and Definitions (FPC&D) v2022
definition: N.A.
broader: Pulpwood and wood for wood-based panels, tropical non-coniferous

Sawlogs and veneer logs, coniferous, for sawnwood and railway sleepers
type: Concept
notation: 012.1111
in scheme: Forest Products Classification and Definitions (FPC&D) v2022
definition: N.A.
broader: Sawlogs and veneer logs, coniferous

Other uncontaminated recoverable wood products, for fibreboard
type: Concept
notation: 033.193
in scheme: Forest Products Classification and Definitions (FPC&D) v2022
definition: N.A.
broader: Other uncontaminated recoverable wood products

Other decorative veneer sheets, for plywood (faces)
type: Concept
notation: 061.91
in scheme: Forest Products Classification and Definitions (FPC&D) v2022
definition: Decorative veneer sheets for the manufacture of plywood. Because of its specific decorative characteristics this material is usually used on the face of plywood.
broader: Other decorative veneer sheets

Tops, small branches and twigs, tropical non-coniferous, for uses n.e.c.
type: Concept
notation: 011.9129
in scheme: Forest Products Classification and Definitions (FPC&D) v2022
definition: N.A.
broader: Tops, small branches and twigs, tropical non-coniferous

I-beams
type: Concept
notation: 135.73
in scheme: Forest Products Classification and Definitions (FPC&D) v2022
definition: I-beams are strong, lightweight, "I" shaped engineered wood structural members that meet demanding performance standards. I-beams are comprised of top and bottom flanges, which resist bending, united with webs, which provide outstanding shear resistance. The flange material is typically laminated veneer lumber (LVL) or solid sawn lumber, and the web is made with plywood or OSB.
broader: Engineered structural timber products

Wood chips and particles from recovered wood products, coniferous, for energy
type: Concept
notation: 032.314
in scheme: Forest Products Classification and Definitions (FPC&D) v2022
definition: N.A.
broader: Wood chips and particles from recovered wood products, coniferous

FPC&D2022: Level 1
type: ClassificationLevel
depth: 1

Wrapping papers, greaseproof papers
type: Concept
notation: 113.35
in scheme: Forest Products Classification and Definitions (FPC&D) v2022
definition: Greaseproof papers are translucent papers that are impermeable to oil or grease and are normally used in cooking or food packaging. Normally greaseproof paper are produced by refining the paper stock and thus create a sheet with very low porosity.
broader: Wrapping papers

Other paper and paperboard n.e.c.
type: Concept
notation: 114.9
in scheme: Forest Products Classification and Definitions (FPC&D) v2022
definition: Other paper and paperboards not mentioned in the divisions 111., 112., 113.
broader: Other paper and paperboard

Other contaminated recoverable wood products, for uses n.e.c.
type: Concept
notation: 033.299
in scheme: Forest Products Classification and Definitions (FPC&D) v2022
definition: N.A.
broader: Other contaminated recoverable wood products

Other wood chips and particles from recovered wood products, for fibreboard
type: Concept
notation: 032.393
in scheme: Forest Products Classification and Definitions (FPC&D) v2022
definition: N.A.
broader: Other wood chips and particles from recovered wood products

Wood particle board, extruded particle board
type: Concept
notation: 072.13
in scheme: Forest Products Classification and Definitions (FPC&D) v2022
definition: Particle boards made by extrusion the mixture of wood particles and resin through a die. The particles lie with their larger dimensions mainly at right angles to the direction of extrusion. They are used as cores or middle layers.
broader: Wood particle board

Veneer plywood, tropical non-coniferous, interior grade
type: Concept
notation: 071.121
in scheme: Forest Products Classification and Definitions (FPC&D) v2022
definition: Veneer plywood suitable only for indoor applications.
broader: Veneer plywood, tropical non-coniferous